Removed Pin From Net: NetName=DGND Pin=P2-a26
Removed Pin From Net: NetName=DGND Pin=P2-c26
Added Pin To Net: NetName=DGND Pin=P2-a20
Added Pin To Net: NetName=DGND Pin=P2-a21
Added Pin To Net: NetName=DGND Pin=P2-a22
Added Pin To Net: NetName=+3.3V Pin=P2-a25
Added Pin To Net: NetName=+3.3V Pin=P2-a26
Added Pin To Net: NetName=DGND Pin=P2-c20
Added Pin To Net: NetName=DGND Pin=P2-c21
Added Pin To Net: NetName=DGND Pin=P2-c22
Added Pin To Net: NetName=+3.3V Pin=P2-c25
Added Pin To Net: NetName=+3.3V Pin=P2-c26
