Removed Pin From Net: NetName=GND Pin=W1-2
Removed Pin From Net: NetName=GND Pin=W2-2
Removed Member From Class: ClassName=Overlapping Member=SW1
Removed Member From Class: ClassName=Velo PXI Input Connector V1 Member=SW1
Removed Member From Class: ClassName=Overlapping Member=SW2
Removed Member From Class: ClassName=Velo PXI Input Connector V1 Member=SW2
Removed Member From Class: ClassName=Overlapping Member=W1
Removed Member From Class: ClassName=Velo PXI Input Connector V1 Member=W1
Removed Member From Class: ClassName=Overlapping Member=W2
Removed Member From Class: ClassName=Velo PXI Input Connector V1 Member=W2
