%TF.GenerationSoftware,Altium Limited,Altium Designer,19.1.5 (86)*%
G04 Layer_Color=0*
%FSLAX45Y45*%
%MOMM*%
%TF.FileFunction,Profile,NP*%
%TF.Part,Single*%
G01*
G75*
%TA.AperFunction,Profile*%
%ADD27C,0.02540*%
D27*
X0Y0D02*
Y10500000D01*
X5000000D01*
Y0D01*
X0D01*
%TF.MD5,349de19ea2510b755bb065981abb1c6d*%
M02*
