%TF.GenerationSoftware,Altium Limited,Altium Designer,19.1.5 (86)*%
G04 Layer_Color=32896*
%FSLAX45Y45*%
%MOMM*%
%TF.FileFunction,Other,Mechanical_8*%
%TF.Part,Single*%
G01*
G75*
%TA.AperFunction,NonConductor*%
%ADD24C,0.10000*%
%ADD25C,0.05000*%
D24*
X1000000Y5676199D02*
X1050000D01*
X1000000Y5626199D02*
Y5676199D01*
X950000D02*
X1000000D01*
Y5726199D01*
Y8851201D02*
X1050000D01*
X1000000Y8801201D02*
Y8851201D01*
X950000D02*
X1000000D01*
Y8901201D01*
Y2501197D02*
X1050000D01*
X1000000Y2451198D02*
Y2501197D01*
X950000D02*
X1000000D01*
Y2551198D01*
X858000Y8022200D02*
X908000D01*
X858000Y7972200D02*
Y8022200D01*
X808000D02*
X858000D01*
Y8072201D01*
Y7746200D02*
X908000D01*
X858000Y7696200D02*
Y7746200D01*
X808000D02*
X858000D01*
Y7796200D01*
Y7470200D02*
X908000D01*
X858000Y7420200D02*
Y7470200D01*
X808000D02*
X858000D01*
Y7520200D01*
Y7194200D02*
X908000D01*
X858000Y7144200D02*
Y7194200D01*
X808000D02*
X858000D01*
Y7244200D01*
Y6918200D02*
X908000D01*
X858000Y6868200D02*
Y6918200D01*
X808000D02*
X858000D01*
Y6968200D01*
Y6642200D02*
X908000D01*
X858000Y6592200D02*
Y6642200D01*
X808000D02*
X858000D01*
Y6692200D01*
Y6366200D02*
X908000D01*
X858000Y6316199D02*
Y6366200D01*
X808000D02*
X858000D01*
Y6416200D01*
Y6090199D02*
X908000D01*
X858000Y6040200D02*
Y6090199D01*
X808000D02*
X858000D01*
Y6140200D01*
Y5814199D02*
X908000D01*
X858000Y5764199D02*
Y5814199D01*
X808000D02*
X858000D01*
Y5864199D01*
Y5538199D02*
X908000D01*
X858000Y5488199D02*
Y5538199D01*
X808000D02*
X858000D01*
Y5588199D01*
Y5262199D02*
X908000D01*
X858000Y5212199D02*
Y5262199D01*
X808000D02*
X858000D01*
Y5312199D01*
Y4986199D02*
X908000D01*
X858000Y4936199D02*
Y4986199D01*
X808000D02*
X858000D01*
Y5036199D01*
Y4710199D02*
X908000D01*
X858000Y4660199D02*
Y4710199D01*
X808000D02*
X858000D01*
Y4760199D01*
Y4434199D02*
X908000D01*
X858000Y4384198D02*
Y4434199D01*
X808000D02*
X858000D01*
Y4484199D01*
Y4158198D02*
X908000D01*
X858000Y4108198D02*
Y4158198D01*
X808000D02*
X858000D01*
Y4208198D01*
Y3882198D02*
X908000D01*
X858000Y3832198D02*
Y3882198D01*
X808000D02*
X858000D01*
Y3932198D01*
Y3606198D02*
X908000D01*
X858000Y3556198D02*
Y3606198D01*
X808000D02*
X858000D01*
Y3656198D01*
Y3330198D02*
X908000D01*
X858000Y3280198D02*
Y3330198D01*
X808000D02*
X858000D01*
Y3380198D01*
X1142000Y8160201D02*
X1192000D01*
X1142000Y8110200D02*
Y8160201D01*
X1092000D02*
X1142000D01*
Y8210200D01*
Y7884200D02*
X1192000D01*
X1142000Y7834200D02*
Y7884200D01*
X1092000D02*
X1142000D01*
Y7934201D01*
Y7608200D02*
X1192000D01*
X1142000Y7558200D02*
Y7608200D01*
X1092000D02*
X1142000D01*
Y7658200D01*
Y7332200D02*
X1192000D01*
X1142000Y7282200D02*
Y7332200D01*
X1092000D02*
X1142000D01*
Y7382200D01*
Y7056200D02*
X1192000D01*
X1142000Y7006200D02*
Y7056200D01*
X1092000D02*
X1142000D01*
Y7106200D01*
Y6780200D02*
X1192000D01*
X1142000Y6730200D02*
Y6780200D01*
X1092000D02*
X1142000D01*
Y6830200D01*
Y6504200D02*
X1192000D01*
X1142000Y6454200D02*
Y6504200D01*
X1092000D02*
X1142000D01*
Y6554200D01*
Y6228200D02*
X1192000D01*
X1142000Y6178199D02*
Y6228200D01*
X1092000D02*
X1142000D01*
Y6278200D01*
Y5952199D02*
X1192000D01*
X1142000Y5902199D02*
Y5952199D01*
X1092000D02*
X1142000D01*
Y6002199D01*
Y5676199D02*
X1192000D01*
X1142000Y5626199D02*
Y5676199D01*
X1092000D02*
X1142000D01*
Y5726199D01*
Y5400199D02*
X1192000D01*
X1142000Y5350199D02*
Y5400199D01*
X1092000D02*
X1142000D01*
Y5450199D01*
Y5124199D02*
X1192000D01*
X1142000Y5074199D02*
Y5124199D01*
X1092000D02*
X1142000D01*
Y5174199D01*
Y4848199D02*
X1192000D01*
X1142000Y4798199D02*
Y4848199D01*
X1092000D02*
X1142000D01*
Y4898199D01*
Y4572199D02*
X1192000D01*
X1142000Y4522198D02*
Y4572199D01*
X1092000D02*
X1142000D01*
Y4622199D01*
Y4296198D02*
X1192000D01*
X1142000Y4246199D02*
Y4296198D01*
X1092000D02*
X1142000D01*
Y4346199D01*
Y4020198D02*
X1192000D01*
X1142000Y3970198D02*
Y4020198D01*
X1092000D02*
X1142000D01*
Y4070198D01*
Y3744198D02*
X1192000D01*
X1142000Y3694198D02*
Y3744198D01*
X1092000D02*
X1142000D01*
Y3794198D01*
Y3468198D02*
X1192000D01*
X1142000Y3418198D02*
Y3468198D01*
X1092000D02*
X1142000D01*
Y3518198D01*
Y3192198D02*
X1192000D01*
X1142000Y3142198D02*
Y3192198D01*
X1092000D02*
X1142000D01*
Y3242198D01*
D25*
X2273000Y3975100D02*
X2373000D01*
X2400000Y5245100D02*
X2500000D01*
X2600000D01*
X2500000Y5145100D02*
Y5245100D01*
Y5345100D01*
X2527000Y2705100D02*
X2627000D01*
X2727000D01*
X2627000Y2605100D02*
Y2705100D01*
Y2805100D01*
X2273000Y2705100D02*
X2373000D01*
X2473000D01*
X2373000Y2605100D02*
Y2705100D01*
Y2805100D01*
X2527000Y2451100D02*
X2627000D01*
X2727000D01*
X2627000Y2351100D02*
Y2451100D01*
Y2551100D01*
X2273000Y2451100D02*
X2373000D01*
X2473000D01*
X2373000Y2351100D02*
Y2451100D01*
Y2551100D01*
X2527000Y2197100D02*
X2627000D01*
X2727000D01*
X2627000Y2097100D02*
Y2197100D01*
Y2297100D01*
X2273000Y2197100D02*
X2373000D01*
X2473000D01*
X2373000Y2097100D02*
Y2197100D01*
Y2297100D01*
X2527000Y8293100D02*
X2627000D01*
X2727000D01*
X2627000Y8193100D02*
Y8293100D01*
Y8393100D01*
X2273000Y8293100D02*
X2373000D01*
X2473000D01*
X2373000Y8193100D02*
Y8293100D01*
Y8393100D01*
X2527000Y8039100D02*
X2627000D01*
X2727000D01*
X2627000Y7939100D02*
Y8039100D01*
Y8139100D01*
X2273000Y8039100D02*
X2373000D01*
X2473000D01*
X2373000Y7939100D02*
Y8039100D01*
Y8139100D01*
X2527000Y7785100D02*
X2627000D01*
X2727000D01*
X2627000Y7685100D02*
Y7785100D01*
Y7885100D01*
X2273000Y7785100D02*
X2373000D01*
X2473000D01*
X2373000Y7685100D02*
Y7785100D01*
Y7885100D01*
X2527000Y7531100D02*
X2627000D01*
X2727000D01*
X2627000Y7431100D02*
Y7531100D01*
Y7631100D01*
X2273000Y7531100D02*
X2373000D01*
X2473000D01*
X2373000Y7431100D02*
Y7531100D01*
Y7631100D01*
X2527000Y6261100D02*
X2627000D01*
X2727000D01*
X2627000Y6161100D02*
Y6261100D01*
Y6361100D01*
X2273000Y6261100D02*
X2373000D01*
X2473000D01*
X2373000Y6161100D02*
Y6261100D01*
Y6361100D01*
X2527000Y6007100D02*
X2627000D01*
X2727000D01*
X2627000Y5907100D02*
Y6007100D01*
Y6107100D01*
X2273000Y6007100D02*
X2373000D01*
X2473000D01*
X2373000Y5907100D02*
Y6007100D01*
Y6107100D01*
X2527000Y5753100D02*
X2627000D01*
X2727000D01*
X2627000Y5653100D02*
Y5753100D01*
Y5853100D01*
X2273000Y5753100D02*
X2373000D01*
X2473000D01*
X2373000Y5653100D02*
Y5753100D01*
Y5853100D01*
X2527000Y5499100D02*
X2627000D01*
X2727000D01*
X2627000Y5399100D02*
Y5499100D01*
Y5599100D01*
X2273000Y5499100D02*
X2373000D01*
X2473000D01*
X2373000Y5399100D02*
Y5499100D01*
Y5599100D01*
X2527000Y5245100D02*
X2627000D01*
X2727000D01*
X2627000Y5145100D02*
Y5245100D01*
Y5345100D01*
X2273000Y5245100D02*
X2373000D01*
X2473000D01*
X2373000Y5145100D02*
Y5245100D01*
Y5345100D01*
X2527000Y4991100D02*
X2627000D01*
X2727000D01*
X2627000Y4891100D02*
Y4991100D01*
Y5091100D01*
X2273000Y4991100D02*
X2373000D01*
X2473000D01*
X2373000Y4891100D02*
Y4991100D01*
Y5091100D01*
X2527000Y4737100D02*
X2627000D01*
X2727000D01*
X2627000Y4637100D02*
Y4737100D01*
Y4837100D01*
X2273000Y4737100D02*
X2373000D01*
X2473000D01*
X2373000Y4637100D02*
Y4737100D01*
Y4837100D01*
X2527000Y4483100D02*
X2627000D01*
X2727000D01*
X2627000Y4383100D02*
Y4483100D01*
Y4583100D01*
X2273000Y4483100D02*
X2373000D01*
X2473000D01*
X2373000Y4383100D02*
Y4483100D01*
Y4583100D01*
X2527000Y4229100D02*
X2627000D01*
X2727000D01*
X2627000Y4129100D02*
Y4229100D01*
Y4329100D01*
X2273000Y4229100D02*
X2373000D01*
X2473000D01*
X2373000Y4129100D02*
Y4229100D01*
Y4329100D01*
X2527000Y2959100D02*
X2627000D01*
X2727000D01*
X2627000Y2859100D02*
Y2959100D01*
Y3059100D01*
X2273000Y2959100D02*
X2373000D01*
X2473000D01*
X2373000Y2859100D02*
Y2959100D01*
Y3059100D01*
X2527000Y7277100D02*
X2627000D01*
X2727000D01*
X2627000Y7177100D02*
Y7277100D01*
Y7377100D01*
X2273000Y7277100D02*
X2373000D01*
X2473000D01*
X2373000Y7177100D02*
Y7277100D01*
Y7377100D01*
X2527000Y7023100D02*
X2627000D01*
X2727000D01*
X2627000Y6923100D02*
Y7023100D01*
Y7123100D01*
X2273000Y7023100D02*
X2373000D01*
X2473000D01*
X2373000Y6923100D02*
Y7023100D01*
Y7123100D01*
X2527000Y6769100D02*
X2627000D01*
X2727000D01*
X2627000Y6669100D02*
Y6769100D01*
Y6869100D01*
X2273000Y6769100D02*
X2373000D01*
X2473000D01*
X2373000Y6669100D02*
Y6769100D01*
Y6869100D01*
X2527000Y6515100D02*
X2627000D01*
X2727000D01*
X2627000Y6415100D02*
Y6515100D01*
Y6615100D01*
X2273000Y6515100D02*
X2373000D01*
X2473000D01*
X2373000Y6415100D02*
Y6515100D01*
Y6615100D01*
X2527000Y3975100D02*
X2627000D01*
X2727000D01*
X2627000Y3875100D02*
Y3975100D01*
Y4075100D01*
X2373000Y3975100D02*
X2473000D01*
X2373000Y3875100D02*
Y3975100D01*
Y4075100D01*
X2527000Y3721100D02*
X2627000D01*
X2727000D01*
X2627000Y3621100D02*
Y3721100D01*
Y3821100D01*
X2273000Y3721100D02*
X2373000D01*
X2473000D01*
X2373000Y3621100D02*
Y3721100D01*
Y3821100D01*
X2527000Y3467100D02*
X2627000D01*
X2727000D01*
X2627000Y3367100D02*
Y3467100D01*
Y3567100D01*
X2273000Y3467100D02*
X2373000D01*
X2473000D01*
X2373000Y3367100D02*
Y3467100D01*
Y3567100D01*
X2527000Y3213100D02*
X2627000D01*
X2727000D01*
X2627000Y3113100D02*
Y3213100D01*
Y3313100D01*
X2273000Y3213100D02*
X2373000D01*
X2473000D01*
X2373000Y3113100D02*
Y3213100D01*
Y3313100D01*
X4127000Y3975100D02*
X4227000D01*
X4000000Y5245100D02*
X4100000D01*
X3900000D02*
X4000000D01*
Y5145100D02*
Y5245100D01*
Y5345100D01*
X3873000Y2705100D02*
X3973000D01*
X3773000D02*
X3873000D01*
Y2605100D02*
Y2705100D01*
Y2805100D01*
X4127000Y2705100D02*
X4227000D01*
X4027000D02*
X4127000D01*
Y2605100D02*
Y2705100D01*
Y2805100D01*
X3873000Y2451100D02*
X3973000D01*
X3773000D02*
X3873000D01*
Y2351100D02*
Y2451100D01*
Y2551100D01*
X4127000Y2451100D02*
X4227000D01*
X4027000D02*
X4127000D01*
Y2351100D02*
Y2451100D01*
Y2551100D01*
X3873000Y2197100D02*
X3973000D01*
X3773000D02*
X3873000D01*
Y2097100D02*
Y2197100D01*
Y2297100D01*
X4127000Y2197100D02*
X4227000D01*
X4027000D02*
X4127000D01*
Y2097100D02*
Y2197100D01*
Y2297100D01*
X3873000Y8293100D02*
X3973000D01*
X3773000D02*
X3873000D01*
Y8193100D02*
Y8293100D01*
Y8393100D01*
X4127000Y8293100D02*
X4227000D01*
X4027000D02*
X4127000D01*
Y8193100D02*
Y8293100D01*
Y8393100D01*
X3873000Y8039100D02*
X3973000D01*
X3773000D02*
X3873000D01*
Y7939100D02*
Y8039100D01*
Y8139100D01*
X4127000Y8039100D02*
X4227000D01*
X4027000D02*
X4127000D01*
Y7939100D02*
Y8039100D01*
Y8139100D01*
X3873000Y7785100D02*
X3973000D01*
X3773000D02*
X3873000D01*
Y7685100D02*
Y7785100D01*
Y7885100D01*
X4127000Y7785100D02*
X4227000D01*
X4027000D02*
X4127000D01*
Y7685100D02*
Y7785100D01*
Y7885100D01*
X3873000Y7531100D02*
X3973000D01*
X3773000D02*
X3873000D01*
Y7431100D02*
Y7531100D01*
Y7631100D01*
X4127000Y7531100D02*
X4227000D01*
X4027000D02*
X4127000D01*
Y7431100D02*
Y7531100D01*
Y7631100D01*
X3873000Y6261100D02*
X3973000D01*
X3773000D02*
X3873000D01*
Y6161100D02*
Y6261100D01*
Y6361100D01*
X4127000Y6261100D02*
X4227000D01*
X4027000D02*
X4127000D01*
Y6161100D02*
Y6261100D01*
Y6361100D01*
X3873000Y6007100D02*
X3973000D01*
X3773000D02*
X3873000D01*
Y5907100D02*
Y6007100D01*
Y6107100D01*
X4127000Y6007100D02*
X4227000D01*
X4027000D02*
X4127000D01*
Y5907100D02*
Y6007100D01*
Y6107100D01*
X3873000Y5753100D02*
X3973000D01*
X3773000D02*
X3873000D01*
Y5653100D02*
Y5753100D01*
Y5853100D01*
X4127000Y5753100D02*
X4227000D01*
X4027000D02*
X4127000D01*
Y5653100D02*
Y5753100D01*
Y5853100D01*
X3873000Y5499100D02*
X3973000D01*
X3773000D02*
X3873000D01*
Y5399100D02*
Y5499100D01*
Y5599100D01*
X4127000Y5499100D02*
X4227000D01*
X4027000D02*
X4127000D01*
Y5399100D02*
Y5499100D01*
Y5599100D01*
X3873000Y5245100D02*
X3973000D01*
X3773000D02*
X3873000D01*
Y5145100D02*
Y5245100D01*
Y5345100D01*
X4127000Y5245100D02*
X4227000D01*
X4027000D02*
X4127000D01*
Y5145100D02*
Y5245100D01*
Y5345100D01*
X3873000Y4991100D02*
X3973000D01*
X3773000D02*
X3873000D01*
Y4891100D02*
Y4991100D01*
Y5091100D01*
X4127000Y4991100D02*
X4227000D01*
X4027000D02*
X4127000D01*
Y4891100D02*
Y4991100D01*
Y5091100D01*
X3873000Y4737100D02*
X3973000D01*
X3773000D02*
X3873000D01*
Y4637100D02*
Y4737100D01*
Y4837100D01*
X4127000Y4737100D02*
X4227000D01*
X4027000D02*
X4127000D01*
Y4637100D02*
Y4737100D01*
Y4837100D01*
X3873000Y4483100D02*
X3973000D01*
X3773000D02*
X3873000D01*
Y4383100D02*
Y4483100D01*
Y4583100D01*
X4127000Y4483100D02*
X4227000D01*
X4027000D02*
X4127000D01*
Y4383100D02*
Y4483100D01*
Y4583100D01*
X3873000Y4229100D02*
X3973000D01*
X3773000D02*
X3873000D01*
Y4129100D02*
Y4229100D01*
Y4329100D01*
X4127000Y4229100D02*
X4227000D01*
X4027000D02*
X4127000D01*
Y4129100D02*
Y4229100D01*
Y4329100D01*
X3873000Y2959100D02*
X3973000D01*
X3773000D02*
X3873000D01*
Y2859100D02*
Y2959100D01*
Y3059100D01*
X4127000Y2959100D02*
X4227000D01*
X4027000D02*
X4127000D01*
Y2859100D02*
Y2959100D01*
Y3059100D01*
X3873000Y7277100D02*
X3973000D01*
X3773000D02*
X3873000D01*
Y7177100D02*
Y7277100D01*
Y7377100D01*
X4127000Y7277100D02*
X4227000D01*
X4027000D02*
X4127000D01*
Y7177100D02*
Y7277100D01*
Y7377100D01*
X3873000Y7023100D02*
X3973000D01*
X3773000D02*
X3873000D01*
Y6923100D02*
Y7023100D01*
Y7123100D01*
X4127000Y7023100D02*
X4227000D01*
X4027000D02*
X4127000D01*
Y6923100D02*
Y7023100D01*
Y7123100D01*
X3873000Y6769100D02*
X3973000D01*
X3773000D02*
X3873000D01*
Y6669100D02*
Y6769100D01*
Y6869100D01*
X4127000Y6769100D02*
X4227000D01*
X4027000D02*
X4127000D01*
Y6669100D02*
Y6769100D01*
Y6869100D01*
X3873000Y6515100D02*
X3973000D01*
X3773000D02*
X3873000D01*
Y6415100D02*
Y6515100D01*
Y6615100D01*
X4127000Y6515100D02*
X4227000D01*
X4027000D02*
X4127000D01*
Y6415100D02*
Y6515100D01*
Y6615100D01*
X3873000Y3975100D02*
X3973000D01*
X3773000D02*
X3873000D01*
Y3875100D02*
Y3975100D01*
Y4075100D01*
X4027000Y3975100D02*
X4127000D01*
Y3875100D02*
Y3975100D01*
Y4075100D01*
X3873000Y3721100D02*
X3973000D01*
X3773000D02*
X3873000D01*
Y3621100D02*
Y3721100D01*
Y3821100D01*
X4127000Y3721100D02*
X4227000D01*
X4027000D02*
X4127000D01*
Y3621100D02*
Y3721100D01*
Y3821100D01*
X3873000Y3467100D02*
X3973000D01*
X3773000D02*
X3873000D01*
Y3367100D02*
Y3467100D01*
Y3567100D01*
X4127000Y3467100D02*
X4227000D01*
X4027000D02*
X4127000D01*
Y3367100D02*
Y3467100D01*
Y3567100D01*
X3873000Y3213100D02*
X3973000D01*
X3773000D02*
X3873000D01*
Y3113100D02*
Y3213100D01*
Y3313100D01*
X4127000Y3213100D02*
X4227000D01*
X4027000D02*
X4127000D01*
Y3113100D02*
Y3213100D01*
Y3313100D01*
%TF.MD5,89c269079a06325d973e655d239aa53e*%
M02*
