%TF.GenerationSoftware,Altium Limited,Altium Designer,19.1.5 (86)*%
G04 Layer_Color=16711935*
%FSLAX45Y45*%
%MOMM*%
%TF.FileFunction,Soldermask,Bot*%
%TF.Part,Single*%
G01*
G75*
%TA.AperFunction,ComponentPad*%
%ADD19C,1.80320*%
%ADD20C,4.10320*%
%ADD21C,4.80320*%
%TA.AperFunction,ViaPad*%
%ADD22C,5.70320*%
D19*
X858000Y3321698D02*
D03*
Y3598698D02*
D03*
Y3875698D02*
D03*
Y4152698D02*
D03*
Y4429699D02*
D03*
Y4706699D02*
D03*
Y4983699D02*
D03*
Y5260699D02*
D03*
Y5537699D02*
D03*
Y5814699D02*
D03*
Y6091700D02*
D03*
Y6368699D02*
D03*
Y6645700D02*
D03*
Y6922700D02*
D03*
Y7199700D02*
D03*
Y7476700D02*
D03*
Y7753700D02*
D03*
Y8030700D02*
D03*
X1142000Y3183198D02*
D03*
Y3460198D02*
D03*
Y3737198D02*
D03*
Y4014198D02*
D03*
Y4291198D02*
D03*
Y4568199D02*
D03*
Y8169201D02*
D03*
Y7892200D02*
D03*
Y7615200D02*
D03*
Y7338200D02*
D03*
Y7061200D02*
D03*
Y6784200D02*
D03*
Y6507200D02*
D03*
Y6230200D02*
D03*
Y5953199D02*
D03*
Y5676199D02*
D03*
Y5399199D02*
D03*
Y5122199D02*
D03*
Y4845199D02*
D03*
X2373000Y3467100D02*
D03*
X2627000D02*
D03*
X2373000Y3721100D02*
D03*
X2627000D02*
D03*
X2373000Y3975100D02*
D03*
X2627000D02*
D03*
X2373000Y4229100D02*
D03*
X2627000D02*
D03*
X2373000Y3213100D02*
D03*
X2627000D02*
D03*
X2373000Y2959100D02*
D03*
X2627000D02*
D03*
X2373000Y2705100D02*
D03*
X2627000D02*
D03*
X2373000Y2451100D02*
D03*
X2627000D02*
D03*
X2373000Y6769100D02*
D03*
X2627000D02*
D03*
X2373000Y7023100D02*
D03*
X2627000D02*
D03*
Y7785100D02*
D03*
Y7277100D02*
D03*
X2373000D02*
D03*
Y7531100D02*
D03*
X2627000D02*
D03*
X2373000Y7785100D02*
D03*
Y8039100D02*
D03*
X2627000D02*
D03*
X2373000Y8293100D02*
D03*
X2627000D02*
D03*
Y6515100D02*
D03*
X2373000D02*
D03*
X2627000Y6261099D02*
D03*
X2373000D02*
D03*
X2627000Y6007099D02*
D03*
X2373000D02*
D03*
Y5753099D02*
D03*
X2627000Y5499099D02*
D03*
X2373000D02*
D03*
Y5245099D02*
D03*
X2627000D02*
D03*
Y5753099D02*
D03*
Y4991098D02*
D03*
X2373000D02*
D03*
X2627000Y4737098D02*
D03*
X2373000D02*
D03*
Y4483098D02*
D03*
X2627000Y2197100D02*
D03*
X2373000D02*
D03*
X2627000Y4483098D02*
D03*
X4127000Y3467100D02*
D03*
X3873000D02*
D03*
X4127000Y3721100D02*
D03*
X3873000D02*
D03*
X4127000Y3975100D02*
D03*
X3873000D02*
D03*
X4127000Y4229100D02*
D03*
X3873000D02*
D03*
X4127000Y3213100D02*
D03*
X3873000D02*
D03*
X4127000Y2959100D02*
D03*
X3873000D02*
D03*
X4127000Y2705100D02*
D03*
X3873000D02*
D03*
X4127000Y2451100D02*
D03*
X3873000D02*
D03*
X4127000Y6769100D02*
D03*
X3873000D02*
D03*
X4127000Y7023100D02*
D03*
X3873000D02*
D03*
Y7785100D02*
D03*
Y7277100D02*
D03*
X4127000D02*
D03*
Y7531100D02*
D03*
X3873000D02*
D03*
X4127000Y7785100D02*
D03*
Y8039100D02*
D03*
X3873000D02*
D03*
X4127000Y8293100D02*
D03*
X3873000D02*
D03*
Y6515100D02*
D03*
X4127000D02*
D03*
X3873000Y6261099D02*
D03*
X4127000D02*
D03*
X3873000Y6007099D02*
D03*
X4127000D02*
D03*
Y5753099D02*
D03*
X3873000Y5499099D02*
D03*
X4127000D02*
D03*
Y5245099D02*
D03*
X3873000D02*
D03*
Y5753099D02*
D03*
Y4991098D02*
D03*
X4127000D02*
D03*
X3873000Y4737098D02*
D03*
X4127000D02*
D03*
Y4483098D02*
D03*
X3873000Y2197100D02*
D03*
X4127000D02*
D03*
X3873000Y4483098D02*
D03*
D20*
X1000000Y2501199D02*
D03*
Y8851199D02*
D03*
D21*
X2525400Y9188450D02*
D03*
Y1301750D02*
D03*
X3974600Y9188450D02*
D03*
Y1301750D02*
D03*
D22*
X342900Y342900D02*
D03*
X4635500D02*
D03*
Y10134600D02*
D03*
X342900D02*
D03*
%TF.MD5,571acb2ec15f62f19cb3c6967fb4069f*%
M02*
