%TF.GenerationSoftware,Altium Limited,Altium Designer,19.1.5 (86)*%
G04 Layer_Color=32768*
%FSLAX45Y45*%
%MOMM*%
%TF.FileFunction,Other,Mechanical_3*%
%TF.Part,Single*%
G01*
G75*
%TA.AperFunction,NonConductor*%
%ADD31C,0.12700*%
D31*
X48564587Y-4761711D02*
G03*
X48686658Y-4761711I61036J-79212D01*
G01*
X46138120Y-5300923D02*
G03*
X46138120Y-5000922I0J150000D01*
G01*
X47313123Y-5050923D02*
G03*
X47313123Y-5050923I-200000J0D01*
G01*
X48686658Y20044879D02*
G03*
X48564587Y20044879I-61036J79212D01*
G01*
X46138120Y20284091D02*
G03*
X46138120Y20584091I0J150000D01*
G01*
X47313123Y20334091D02*
G03*
X47313123Y20334091I-200000J0D01*
G01*
X46308121Y7641584D02*
G03*
X46308121Y7641584I-200000J0D01*
G01*
X46138120Y8034084D02*
G03*
X46138120Y8334085I0J150000D01*
G01*
Y6949084D02*
G03*
X46138120Y7249084I0J150000D01*
G01*
X45488120Y-4990922D02*
Y-4650922D01*
Y-5310923D02*
X45688120D01*
X45488120Y-4990922D02*
X45688120D01*
Y-4850922D01*
Y-5450923D02*
Y-5310923D01*
X45488120Y-5520923D02*
Y-5310923D01*
X45688120Y-5400923D02*
Y-4900922D01*
X47218121Y-5520923D02*
X47488123Y-5250923D01*
X48988123Y-4950923D02*
Y-4650922D01*
Y-5250923D02*
Y-5090923D01*
X48263123Y-4650922D02*
X48500623D01*
X48750623D02*
X48988123D01*
X48500623D02*
X48564587Y-4761710D01*
X48686658D02*
X48750623Y-4650922D01*
X48788123Y-5090923D02*
Y-4950923D01*
Y-5090923D02*
X48988123D01*
X48788123Y-4950923D02*
X48988123D01*
X47613123Y-4800922D02*
Y-4650922D01*
X48263123Y-4800922D02*
Y-4650922D01*
X47488123Y-5250923D02*
X48988123D01*
X47538123Y-5050923D02*
X48338123D01*
Y-4800922D01*
X48263123D02*
X48338123D01*
X47538123Y-5050923D02*
Y-4800922D01*
X47613123D01*
X45888120Y-5000922D02*
Y-4850922D01*
Y-5300923D02*
X46138120D01*
X45888120Y-5000922D02*
X46138120D01*
X45888120Y-5450923D02*
Y-5300923D01*
Y-5400923D02*
Y-4900922D01*
X45488120Y-4650922D02*
X47613123D01*
X45488120Y-5520923D02*
X47218121D01*
X45688120Y-4850922D02*
X45888120D01*
X45688120Y-5450923D02*
X45888120D01*
X45688120Y-5400923D02*
X45888120D01*
X45688120Y-4900922D02*
X45888120D01*
X45188120Y-5550923D02*
Y-4750922D01*
Y-5550923D02*
X45488120D01*
Y-4750922D01*
X45188120D02*
X45488120D01*
X45028122Y20744090D02*
X45188120D01*
X45028122Y-5460923D02*
X45188120D01*
Y20744090D01*
X45028122Y-5460923D02*
Y20744090D01*
X45188120Y6699084D02*
X45488120D01*
X45188120Y7499084D02*
X45488120D01*
X45188120Y6699084D02*
Y7499084D01*
X45488120Y6699084D02*
Y7499084D01*
X45188120Y7784084D02*
X45488120D01*
X45188120Y8584085D02*
X45488120D01*
X45188120Y7784084D02*
Y8584085D01*
X45488120Y7784084D02*
Y8584085D01*
Y19934091D02*
Y20274091D01*
Y20594090D02*
X45688120D01*
X45488120Y20274091D02*
X45688120D01*
Y20134091D02*
Y20274091D01*
Y20594090D02*
Y20734091D01*
X45488120Y20594090D02*
Y20804091D01*
X45688120Y20184091D02*
Y20684091D01*
X47218121Y20804091D02*
X47488123Y20534091D01*
X48988123Y19934091D02*
Y20234091D01*
Y20374091D02*
Y20534091D01*
X48263123Y19934091D02*
X48500623D01*
X48750623D02*
X48988123D01*
X48500623D02*
X48564587Y20044879D01*
X48686658D02*
X48750623Y19934091D01*
X48788123Y20234091D02*
Y20374091D01*
X48988123D01*
X48788123Y20234091D02*
X48988123D01*
X47613123Y19934091D02*
Y20084091D01*
X48263123Y19934091D02*
Y20084091D01*
X47488123Y20534091D02*
X48988123D01*
X47538123Y20334091D02*
X48338123D01*
Y20084091D02*
Y20334091D01*
X48263123Y20084091D02*
X48338123D01*
X47538123D02*
Y20334091D01*
Y20084091D02*
X47613123D01*
X45888120Y20134091D02*
Y20284091D01*
Y20584091D02*
X46138120D01*
X45888120Y20284091D02*
X46138120D01*
X45888120Y20584091D02*
Y20734091D01*
Y20184091D02*
Y20684091D01*
X45488120Y19934091D02*
X47613123D01*
X45488120Y20804091D02*
X47218121D01*
X45688120Y20134091D02*
X45888120D01*
X45688120Y20734091D02*
X45888120D01*
X45688120Y20684091D02*
X45888120D01*
X45688120Y20184091D02*
X45888120D01*
X45488120Y8684085D02*
X46318121D01*
X45488120Y6599084D02*
X46318121D01*
X45888120Y8034085D02*
X46138120D01*
X45888120Y8334085D02*
X46138120D01*
X45888120Y7249084D02*
X46138120D01*
X45888120Y6949084D02*
X46138120D01*
X46418121Y6699084D02*
Y8584085D01*
X46318121Y8684085D02*
X46418121Y8584085D01*
X46318121Y6599084D02*
X46418121Y6699084D01*
X45488120Y7259084D02*
Y8024085D01*
Y8344085D02*
Y8684085D01*
X45888120Y8334085D02*
Y8484085D01*
X45688120Y8344085D02*
Y8484085D01*
X45888120D01*
X45488120Y8024085D02*
X45688120D01*
X45488120Y8344085D02*
X45688120D01*
Y7884084D02*
X45888120D01*
Y8034085D01*
X45688120Y7884084D02*
Y8024085D01*
X45488120Y6599084D02*
Y6939084D01*
X45688120Y6799084D02*
Y6939084D01*
X45888120Y6799084D02*
Y6949084D01*
X45688120Y6799084D02*
X45888120D01*
X45488120Y7259084D02*
X45688120D01*
X45488120Y6939084D02*
X45688120D01*
Y7399084D02*
X45888120D01*
X45688120Y7259084D02*
Y7399084D01*
X45888120Y7249084D02*
Y7399084D01*
X45688120Y6849084D02*
Y7349084D01*
X45888120Y6849084D02*
Y7349084D01*
X45688120D02*
X45888120D01*
X45688120Y6849084D02*
X45888120D01*
Y7934084D02*
Y8434085D01*
X45688120Y7934084D02*
Y8434085D01*
Y7934084D02*
X45888120D01*
X45688120Y8434085D02*
X45888120D01*
X45188120Y20034091D02*
Y20834091D01*
X45488120D01*
Y20034091D02*
Y20834091D01*
X45188120Y20034091D02*
X45488120D01*
%TF.MD5,f9f167af030adac469e6d83836cfab82*%
M02*
