%TF.GenerationSoftware,Altium Limited,Altium Designer,19.1.5 (86)*%
G04 Layer_Color=0*
%FSLAX45Y45*%
%MOMM*%
%TF.FileFunction,Profile,NP*%
%TF.Part,Single*%
G01*
G75*
%TA.AperFunction,Profile*%
%ADD38C,0.02540*%
D38*
X97Y0D02*
X39000000D01*
X39000000Y21000000D01*
X97D01*
Y0D01*
%TF.MD5,bd7338edb51b3ad2219646c2dad20a22*%
M02*
