Removed Pin From Net: NetName=AA0 Pin=P19-1
Removed Pin From Net: NetName=AA1 Pin=P19-2
Removed Pin From Net: NetName=AA2 Pin=P19-3
Removed Pin From Net: NetName=AA3 Pin=P19-4
Removed Pin From Net: NetName=AA4 Pin=P19-5
Removed Pin From Net: NetName=AA5 Pin=P19-6
Removed Pin From Net: NetName=AA6 Pin=P19-7
Removed Pin From Net: NetName=AA7 Pin=P19-8
Removed Pin From Net: NetName=PLC_GND Pin=P19-9
Removed Pin From Net: NetName=PLC_GND Pin=P19-10
Removed Pin From Net: NetName=PLC_GND Pin=P19-11
Removed Pin From Net: NetName=PLC_GND Pin=P19-12
Removed Member From Class: ClassName=Velo Temp Rear V0 Member=P19
