# DbArchiveInfo
Manager/User	ElementName	TypeName	DetailNr	_archive.._type	_archive.._archive	_archive.._class	_archive.._interv	_archive.._interv_type	_archive.._std_type	_archive.._std_tol	_archive.._std_time	_archive.._round_val	_archive.._round_inv
UI (1)/0	CAEN/CAENLAB/board00/channel000.actual.iMon	FwCaenChannelA1580		45	1
UI (1)/0	CAEN/CAENLAB/board00/channel000.actual.iMon	FwCaenChannelA1580	1	3		_ValueArchive_6	0	0	0	0.005	01.01.1970 00:00:00.000	0	0
UI (1)/0	CAEN/CAENLAB/board00/channel000.actual.vMon	FwCaenChannelA1580		45	1
UI (1)/0	CAEN/CAENLAB/board00/channel000.actual.vMon	FwCaenChannelA1580	1	3		_ValueArchive_6	0	0	0	1.0	01.01.1970 00:00:00.000	0	0
UI (1)/0	CAEN/CAENLAB/board00/channel000.actual.OvC	FwCaenChannelA1580		45	1
UI (1)/0	CAEN/CAENLAB/board00/channel000.actual.OvC	FwCaenChannelA1580	1	3		_ValueArchive_7	0	0	4	0	01.01.1970 00:00:00.000	0	0
UI (1)/0	CAEN/CAENLAB/board00/channel001.actual.iMon	FwCaenChannelA1580		45	1
UI (1)/0	CAEN/CAENLAB/board00/channel001.actual.iMon	FwCaenChannelA1580	1	3		_ValueArchive_6	0	0	0	0.005	01.01.1970 00:00:00.000	0	0
UI (1)/0	CAEN/CAENLAB/board00/channel001.actual.vMon	FwCaenChannelA1580		45	1
UI (1)/0	CAEN/CAENLAB/board00/channel001.actual.vMon	FwCaenChannelA1580	1	3		_ValueArchive_6	0	0	0	1.0	01.01.1970 00:00:00.000	0	0
UI (1)/0	CAEN/CAENLAB/board00/channel001.actual.OvC	FwCaenChannelA1580		45	1
UI (1)/0	CAEN/CAENLAB/board00/channel001.actual.OvC	FwCaenChannelA1580	1	3		_ValueArchive_7	0	0	4	0	01.01.1970 00:00:00.000	0	0
UI (1)/0	CAEN/CAENLAB/board00/channel002.actual.iMon	FwCaenChannelA1580		45	1
UI (1)/0	CAEN/CAENLAB/board00/channel002.actual.iMon	FwCaenChannelA1580	1	3		_ValueArchive_6	0	0	0	0.005	01.01.1970 00:00:00.000	0	0
UI (1)/0	CAEN/CAENLAB/board00/channel002.actual.vMon	FwCaenChannelA1580		45	1
UI (1)/0	CAEN/CAENLAB/board00/channel002.actual.vMon	FwCaenChannelA1580	1	3		_ValueArchive_6	0	0	0	1.0	01.01.1970 00:00:00.000	0	0
UI (1)/0	CAEN/CAENLAB/board00/channel002.actual.OvC	FwCaenChannelA1580		45	1
UI (1)/0	CAEN/CAENLAB/board00/channel002.actual.OvC	FwCaenChannelA1580	1	3		_ValueArchive_7	0	0	4	0	01.01.1970 00:00:00.000	0	0
UI (1)/0	CAEN/CAENLAB/board00/channel003.actual.iMon	FwCaenChannelA1580		45	1
UI (1)/0	CAEN/CAENLAB/board00/channel003.actual.iMon	FwCaenChannelA1580	1	3		_ValueArchive_6	0	0	0	0.005	01.01.1970 00:00:00.000	0	0
UI (1)/0	CAEN/CAENLAB/board00/channel003.actual.vMon	FwCaenChannelA1580		45	1
UI (1)/0	CAEN/CAENLAB/board00/channel003.actual.vMon	FwCaenChannelA1580	1	3		_ValueArchive_6	0	0	0	1.0	01.01.1970 00:00:00.000	0	0
UI (1)/0	CAEN/CAENLAB/board00/channel003.actual.OvC	FwCaenChannelA1580		45	1
UI (1)/0	CAEN/CAENLAB/board00/channel003.actual.OvC	FwCaenChannelA1580	1	3		_ValueArchive_7	0	0	4	0	01.01.1970 00:00:00.000	0	0