# DbArchiveInfo
Manager/User	ElementName	TypeName	DetailNr	_archive.._type	_archive.._archive	_archive.._class	_archive.._interv	_archive.._interv_type	_archive.._std_type	_archive.._std_tol	_archive.._std_time	_archive.._round_val	_archive.._round_inv
UI (1)/0	CAEN/CAENLAB/board00/channel000.actual.iMon	FwCaenChannelA1580		45	1
UI (1)/0	CAEN/CAENLAB/board00/channel000.actual.iMon	FwCaenChannelA1580	1	3		_ValueArchive_6	0	0	0	0.005	01.01.1970 00:00:00.000	0	0
UI (1)/0	CAEN/CAENLAB/board00/channel000.actual.vMon	FwCaenChannelA1580		45	1
UI (1)/0	CAEN/CAENLAB/board00/channel000.actual.vMon	FwCaenChannelA1580	1	3		_ValueArchive_6	0	0	0	1.0	01.01.1970 00:00:00.000	0	0
UI (1)/0	CAEN/CAENLAB/board00/channel000.actual.OvC	FwCaenChannelA1580		45	1
UI (1)/0	CAEN/CAENLAB/board00/channel000.actual.OvC	FwCaenChannelA1580	1	3		_ValueArchive_7	0	0	4	0	01.01.1970 00:00:00.000	0	0
UI (1)/0	CAEN/CAENLAB/board00/channel001.actual.iMon	FwCaenChannelA1580		45	1
UI (1)/0	CAEN/CAENLAB/board00/channel001.actual.iMon	FwCaenChannelA1580	1	3		_ValueArchive_6	0	0	0	0.005	01.01.1970 00:00:00.000	0	0
UI (1)/0	CAEN/CAENLAB/board00/channel001.actual.vMon	FwCaenChannelA1580		45	1
UI (1)/0	CAEN/CAENLAB/board00/channel001.actual.vMon	FwCaenChannelA1580	1	3		_ValueArchive_6	0	0	0	1.0	01.01.1970 00:00:00.000	0	0
UI (1)/0	CAEN/CAENLAB/board00/channel001.actual.OvC	FwCaenChannelA1580		45	1
UI (1)/0	CAEN/CAENLAB/board00/channel001.actual.OvC	FwCaenChannelA1580	1	3		_ValueArchive_7	0	0	4	0	01.01.1970 00:00:00.000	0	0
UI (1)/0	CAEN/CAENLAB/board00/channel002.actual.iMon	FwCaenChannelA1580		45	1
UI (1)/0	CAEN/CAENLAB/board00/channel002.actual.iMon	FwCaenChannelA1580	1	3		_ValueArchive_6	0	0	0	0.005	01.01.1970 00:00:00.000	0	0
UI (1)/0	CAEN/CAENLAB/board00/channel002.actual.vMon	FwCaenChannelA1580		45	1
UI (1)/0	CAEN/CAENLAB/board00/channel002.actual.vMon	FwCaenChannelA1580	1	3		_ValueArchive_6	0	0	0	1.0	01.01.1970 00:00:00.000	0	0
UI (1)/0	CAEN/CAENLAB/board00/channel002.actual.OvC	FwCaenChannelA1580		45	1
UI (1)/0	CAEN/CAENLAB/board00/channel002.actual.OvC	FwCaenChannelA1580	1	3		_ValueArchive_7	0	0	4	0	01.01.1970 00:00:00.000	0	0
UI (1)/0	CAEN/CAENLAB/board00/channel003.actual.iMon	FwCaenChannelA1580		45	1
UI (1)/0	CAEN/CAENLAB/board00/channel003.actual.iMon	FwCaenChannelA1580	1	3		_ValueArchive_6	0	0	0	0.005	01.01.1970 00:00:00.000	0	0
UI (1)/0	CAEN/CAENLAB/board00/channel003.actual.vMon	FwCaenChannelA1580		45	1
UI (1)/0	CAEN/CAENLAB/board00/channel003.actual.vMon	FwCaenChannelA1580	1	3		_ValueArchive_6	0	0	0	1.0	01.01.1970 00:00:00.000	0	0
UI (1)/0	CAEN/CAENLAB/board00/channel003.actual.OvC	FwCaenChannelA1580		45	1
UI (1)/0	CAEN/CAENLAB/board00/channel003.actual.OvC	FwCaenChannelA1580	1	3		_ValueArchive_7	0	0	4	0	01.01.1970 00:00:00.000	0	0
UI (1)/0	CAEN/CAENLAB/board00/channel004.actual.iMon	FwCaenChannelA1580		45	1
UI (1)/0	CAEN/CAENLAB/board00/channel004.actual.iMon	FwCaenChannelA1580	1	3		_ValueArchive_6	0	0	0	0.005	01.01.1970 00:00:00.000	0	0
UI (1)/0	CAEN/CAENLAB/board00/channel004.actual.vMon	FwCaenChannelA1580		45	1
UI (1)/0	CAEN/CAENLAB/board00/channel004.actual.vMon	FwCaenChannelA1580	1	3		_ValueArchive_6	0	0	0	1.0	01.01.1970 00:00:00.000	0	0
UI (1)/0	CAEN/CAENLAB/board00/channel004.actual.OvC	FwCaenChannelA1580		45	1
UI (1)/0	CAEN/CAENLAB/board00/channel004.actual.OvC	FwCaenChannelA1580	1	3		_ValueArchive_7	0	0	4	0	01.01.1970 00:00:00.000	0	0
UI (1)/0	CAEN/CAENLAB/board00/channel005.actual.iMon	FwCaenChannelA1580		45	1
UI (1)/0	CAEN/CAENLAB/board00/channel005.actual.iMon	FwCaenChannelA1580	1	3		_ValueArchive_6	0	0	0	0.005	01.01.1970 00:00:00.000	0	0
UI (1)/0	CAEN/CAENLAB/board00/channel005.actual.vMon	FwCaenChannelA1580		45	1
UI (1)/0	CAEN/CAENLAB/board00/channel005.actual.vMon	FwCaenChannelA1580	1	3		_ValueArchive_6	0	0	0	1.0	01.01.1970 00:00:00.000	0	0
UI (1)/0	CAEN/CAENLAB/board00/channel005.actual.OvC	FwCaenChannelA1580		45	1
UI (1)/0	CAEN/CAENLAB/board00/channel005.actual.OvC	FwCaenChannelA1580	1	3		_ValueArchive_7	0	0	4	0	01.01.1970 00:00:00.000	0	0
UI (1)/0	CAEN/CAENLAB/board00/channel006.actual.iMon	FwCaenChannelA1580		45	1
UI (1)/0	CAEN/CAENLAB/board00/channel006.actual.iMon	FwCaenChannelA1580	1	3		_ValueArchive_6	0	0	0	0.005	01.01.1970 00:00:00.000	0	0
UI (1)/0	CAEN/CAENLAB/board00/channel006.actual.vMon	FwCaenChannelA1580		45	1
UI (1)/0	CAEN/CAENLAB/board00/channel006.actual.vMon	FwCaenChannelA1580	1	3		_ValueArchive_6	0	0	0	1.0	01.01.1970 00:00:00.000	0	0
UI (1)/0	CAEN/CAENLAB/board00/channel006.actual.OvC	FwCaenChannelA1580		45	1
UI (1)/0	CAEN/CAENLAB/board00/channel006.actual.OvC	FwCaenChannelA1580	1	3		_ValueArchive_7	0	0	4	0	01.01.1970 00:00:00.000	0	0
UI (1)/0	CAEN/CAENLAB/board00/channel007.actual.iMon	FwCaenChannelA1580		45	1
UI (1)/0	CAEN/CAENLAB/board00/channel007.actual.iMon	FwCaenChannelA1580	1	3		_ValueArchive_6	0	0	0	0.005	01.01.1970 00:00:00.000	0	0
UI (1)/0	CAEN/CAENLAB/board00/channel007.actual.vMon	FwCaenChannelA1580		45	1
UI (1)/0	CAEN/CAENLAB/board00/channel007.actual.vMon	FwCaenChannelA1580	1	3		_ValueArchive_6	0	0	0	1.0	01.01.1970 00:00:00.000	0	0
UI (1)/0	CAEN/CAENLAB/board00/channel007.actual.OvC	FwCaenChannelA1580		45	1
UI (1)/0	CAEN/CAENLAB/board00/channel007.actual.OvC	FwCaenChannelA1580	1	3		_ValueArchive_7	0	0	4	0	01.01.1970 00:00:00.000	0	0
UI (1)/0	CAEN/CAENLAB/board00/channel008.actual.iMon	FwCaenChannelA1580		45	1
UI (1)/0	CAEN/CAENLAB/board00/channel008.actual.iMon	FwCaenChannelA1580	1	3		_ValueArchive_6	0	0	0	0.005	01.01.1970 00:00:00.000	0	0
UI (1)/0	CAEN/CAENLAB/board00/channel008.actual.vMon	FwCaenChannelA1580		45	1
UI (1)/0	CAEN/CAENLAB/board00/channel008.actual.vMon	FwCaenChannelA1580	1	3		_ValueArchive_6	0	0	0	1.0	01.01.1970 00:00:00.000	0	0
UI (1)/0	CAEN/CAENLAB/board00/channel008.actual.OvC	FwCaenChannelA1580		45	1
UI (1)/0	CAEN/CAENLAB/board00/channel008.actual.OvC	FwCaenChannelA1580	1	3		_ValueArchive_7	0	0	4	0	01.01.1970 00:00:00.000	0	0
UI (1)/0	CAEN/CAENLAB/board00/channel009.actual.iMon	FwCaenChannelA1580		45	1
UI (1)/0	CAEN/CAENLAB/board00/channel009.actual.iMon	FwCaenChannelA1580	1	3		_ValueArchive_6	0	0	0	0.005	01.01.1970 00:00:00.000	0	0
UI (1)/0	CAEN/CAENLAB/board00/channel009.actual.vMon	FwCaenChannelA1580		45	1
UI (1)/0	CAEN/CAENLAB/board00/channel009.actual.vMon	FwCaenChannelA1580	1	3		_ValueArchive_6	0	0	0	1.0	01.01.1970 00:00:00.000	0	0
UI (1)/0	CAEN/CAENLAB/board00/channel009.actual.OvC	FwCaenChannelA1580		45	1
UI (1)/0	CAEN/CAENLAB/board00/channel009.actual.OvC	FwCaenChannelA1580	1	3		_ValueArchive_7	0	0	4	0	01.01.1970 00:00:00.000	0	0
UI (1)/0	CAEN/CAENLAB/board00/channel010.actual.iMon	FwCaenChannelA1580		45	1
UI (1)/0	CAEN/CAENLAB/board00/channel010.actual.iMon	FwCaenChannelA1580	1	3		_ValueArchive_6	0	0	0	0.005	01.01.1970 00:00:00.000	0	0
UI (1)/0	CAEN/CAENLAB/board00/channel010.actual.vMon	FwCaenChannelA1580		45	1
UI (1)/0	CAEN/CAENLAB/board00/channel010.actual.vMon	FwCaenChannelA1580	1	3		_ValueArchive_6	0	0	0	1.0	01.01.1970 00:00:00.000	0	0
UI (1)/0	CAEN/CAENLAB/board00/channel010.actual.OvC	FwCaenChannelA1580		45	1
UI (1)/0	CAEN/CAENLAB/board00/channel010.actual.OvC	FwCaenChannelA1580	1	3		_ValueArchive_7	0	0	4	0	01.01.1970 00:00:00.000	0	0
UI (1)/0	CAEN/CAENLAB/board00/channel011.actual.iMon	FwCaenChannelA1580		45	1
UI (1)/0	CAEN/CAENLAB/board00/channel011.actual.iMon	FwCaenChannelA1580	1	3		_ValueArchive_6	0	0	0	0.005	01.01.1970 00:00:00.000	0	0
UI (1)/0	CAEN/CAENLAB/board00/channel011.actual.vMon	FwCaenChannelA1580		45	1
UI (1)/0	CAEN/CAENLAB/board00/channel011.actual.vMon	FwCaenChannelA1580	1	3		_ValueArchive_6	0	0	0	1.0	01.01.1970 00:00:00.000	0	0
UI (1)/0	CAEN/CAENLAB/board00/channel011.actual.OvC	FwCaenChannelA1580		45	1
UI (1)/0	CAEN/CAENLAB/board00/channel011.actual.OvC	FwCaenChannelA1580	1	3		_ValueArchive_7	0	0	4	0	01.01.1970 00:00:00.000	0	0
UI (1)/0	CAEN/CAENLAB/board00/channel012.actual.iMon	FwCaenChannelA1580		45	1
UI (1)/0	CAEN/CAENLAB/board00/channel012.actual.iMon	FwCaenChannelA1580	1	3		_ValueArchive_6	0	0	0	0.005	01.01.1970 00:00:00.000	0	0
UI (1)/0	CAEN/CAENLAB/board00/channel012.actual.vMon	FwCaenChannelA1580		45	1
UI (1)/0	CAEN/CAENLAB/board00/channel012.actual.vMon	FwCaenChannelA1580	1	3		_ValueArchive_6	0	0	0	1.0	01.01.1970 00:00:00.000	0	0
UI (1)/0	CAEN/CAENLAB/board00/channel012.actual.OvC	FwCaenChannelA1580		45	1
UI (1)/0	CAEN/CAENLAB/board00/channel012.actual.OvC	FwCaenChannelA1580	1	3		_ValueArchive_7	0	0	4	0	01.01.1970 00:00:00.000	0	0
UI (1)/0	CAEN/CAENLAB/board00/channel013.actual.iMon	FwCaenChannelA1580		45	1
UI (1)/0	CAEN/CAENLAB/board00/channel013.actual.iMon	FwCaenChannelA1580	1	3		_ValueArchive_6	0	0	0	0.005	01.01.1970 00:00:00.000	0	0
UI (1)/0	CAEN/CAENLAB/board00/channel013.actual.vMon	FwCaenChannelA1580		45	1
UI (1)/0	CAEN/CAENLAB/board00/channel013.actual.vMon	FwCaenChannelA1580	1	3		_ValueArchive_6	0	0	0	1.0	01.01.1970 00:00:00.000	0	0
UI (1)/0	CAEN/CAENLAB/board00/channel013.actual.OvC	FwCaenChannelA1580		45	1
UI (1)/0	CAEN/CAENLAB/board00/channel013.actual.OvC	FwCaenChannelA1580	1	3		_ValueArchive_7	0	0	4	0	01.01.1970 00:00:00.000	0	0
UI (1)/0	CAEN/CAENLAB/board00/channel014.actual.iMon	FwCaenChannelA1580		45	1
UI (1)/0	CAEN/CAENLAB/board00/channel014.actual.iMon	FwCaenChannelA1580	1	3		_ValueArchive_6	0	0	0	0.005	01.01.1970 00:00:00.000	0	0
UI (1)/0	CAEN/CAENLAB/board00/channel014.actual.vMon	FwCaenChannelA1580		45	1
UI (1)/0	CAEN/CAENLAB/board00/channel014.actual.vMon	FwCaenChannelA1580	1	3		_ValueArchive_6	0	0	0	1.0	01.01.1970 00:00:00.000	0	0
UI (1)/0	CAEN/CAENLAB/board00/channel014.actual.OvC	FwCaenChannelA1580		45	1
UI (1)/0	CAEN/CAENLAB/board00/channel014.actual.OvC	FwCaenChannelA1580	1	3		_ValueArchive_7	0	0	4	0	01.01.1970 00:00:00.000	0	0
UI (1)/0	CAEN/CAENLAB/board00/channel015.actual.iMon	FwCaenChannelA1580		45	1
UI (1)/0	CAEN/CAENLAB/board00/channel015.actual.iMon	FwCaenChannelA1580	1	3		_ValueArchive_6	0	0	0	0.005	01.01.1970 00:00:00.000	0	0
UI (1)/0	CAEN/CAENLAB/board00/channel015.actual.vMon	FwCaenChannelA1580		45	1
UI (1)/0	CAEN/CAENLAB/board00/channel015.actual.vMon	FwCaenChannelA1580	1	3		_ValueArchive_6	0	0	0	1.0	01.01.1970 00:00:00.000	0	0
UI (1)/0	CAEN/CAENLAB/board00/channel015.actual.OvC	FwCaenChannelA1580		45	1
UI (1)/0	CAEN/CAENLAB/board00/channel015.actual.OvC	FwCaenChannelA1580	1	3		_ValueArchive_7	0	0	4	0	01.01.1970 00:00:00.000	0	0
