{
  "ip": "128.141.48.76",
  "vme_base_address": "0x00320000",
  "buffer_length": "0x0A",s
  "buffer_n_post_samples": "0x200",
  "internal_sawtooth": true,
  "channel_config": [{
    "channel": 0,
    "enable": 1,
    "dc_offset": 0
  },{
    "channel": 1,
    "enable": 0,
    "dc_offset": 0
  },{
    "channel": 2,
    "enable": 0,
    "dc_offset": 0
  },{
    "channel": 3,
    "enable": 0,
    "dc_offset": 0
  },{
    "channel": 4,
    "enable": 0,
    "dc_offset": 0.1
  },{
    "channel": 5,
    "enable": 0,
    "dc_offset": 0.1
  },{
    "channel": 6,
    "enable": 0,
    "dc_offset": -0.1
  },{
    "channel": 7,
    "enable": 0,
    "dc_offset": -0.1
  }]
}