JobOptionsSvc        INFO # =======> /project/bfys/graven/master/Gaudi/GaudiExamples/options/Services.opts
JobOptionsSvc        INFO # (12,1): AuditorSvc.Auditors = ["ChronoAuditor"]
JobOptionsSvc        INFO # =======> /project/bfys/graven/master/Gaudi/GaudiExamples/options/Common.opts
JobOptionsSvc        INFO # (9,1): ApplicationMgr.StatusCodeCheck = 1
JobOptionsSvc        INFO # =======> /project/bfys/graven/master/Gaudi/GaudiExamples/options/AlgTools.opts
JobOptionsSvc        INFO # (9,1): ApplicationMgr.TopAlg = ["MyAlgorithm/MyAlg"]
JobOptionsSvc        INFO # (12,1): MessageSvc.OutputLevel = 3
JobOptionsSvc        INFO # (17,1): ApplicationMgr.EvtMax = 10
JobOptionsSvc        INFO # (18,1): ApplicationMgr.EvtSel = "NONE"
JobOptionsSvc        INFO # (25,1): MyAlg.MyTool.Int = 101
JobOptionsSvc        INFO # (26,1): MyAlg.MyTool.Double = 101.1e+10
JobOptionsSvc        INFO # (27,1): MyAlg.MyTool.String = "hundred one"
JobOptionsSvc        INFO # (28,1): MyAlg.MyTool.Bool = 0
JobOptionsSvc        INFO # (30,1): ToolSvc.MyTool.Int = 201
JobOptionsSvc        INFO # (31,1): ToolSvc.MyTool.Double = 201.1e+10
JobOptionsSvc        INFO # (32,1): ToolSvc.MyTool.String = "two hundred and one"
JobOptionsSvc        INFO # (33,1): ToolSvc.MyTool.Bool = 1
JobOptionsSvc        INFO # (35,1): ToolSvc.MyTool.OutputLevel = 3
JobOptionsSvc        INFO # (36,1): MyAlgorithm.OutputLevel = 2
JobOptionsSvc        INFO # (41,1): ApplicationMgr.TopAlg += ["TestToolAlg"]
JobOptionsSvc        INFO # (42,1): TestToolAlg.Tools += ["TestTool/ToolA"]
JobOptionsSvc        INFO # (43,1): ToolSvc.ToolA.Tools = ["TestTool/ToolB"]
JobOptionsSvc        INFO # (44,1): ToolSvc.ToolB.Tools = ["TestTool/ToolA"]
JobOptionsSvc        INFO # (45,1): ToolSvc.ToolA.OutputLevel = 2
JobOptionsSvc        INFO # (46,1): ToolSvc.ToolB.OutputLevel = 2
JobOptionsSvc        INFO Job options successfully read in from /project/bfys/graven/master/Gaudi/GaudiExamples/options/AlgTools.opts
ApplicationMgr    SUCCESS
====================================================================================================================================
                                                   Welcome to ApplicationMgr (GaudiCoreSvc v30r5)
                                          running on stbc-i5.nikhef.nl on Sun Jan 27 20:46:48 2019
====================================================================================================================================
ApplicationMgr       INFO Application Manager Configured successfully
StatusCodeSvc        INFO initialize
MyAlg                INFO initializing....
ToolSvc.MyTool       INFO intialize() has been called
ToolSvc.MyTool       INFO Int    = 201
ToolSvc.MyTool       INFO Double = 2.011e+12
ToolSvc.MyTool       INFO String = two hundred and one
ToolSvc.MyTool       INFO Bool   = 1
ToolSvc.MyGaudi...   INFO intialize() has been called
ToolSvc.MyGaudi...   INFO Int    = 100
ToolSvc.MyGaudi...   INFO Double = 100
ToolSvc.MyGaudi...   INFO String = hundred
ToolSvc.MyGaudi...   INFO Bool   = 1
MyAlg.MyTool         INFO intialize() has been called
MyAlg.MyTool         INFO Int    = 101
MyAlg.MyTool         INFO Double = 1.011e+12
MyAlg.MyTool         INFO String = hundred one
MyAlg.MyTool         INFO Bool   = 0
MyAlg.MyGaudiTool    INFO intialize() has been called
MyAlg.MyGaudiTool    INFO Int    = 100
MyAlg.MyGaudiTool    INFO Double = 100
MyAlg.MyGaudiTool    INFO String = hundred
MyAlg.MyGaudiTool    INFO Bool   = 1
MyAlg.ToolWithName   INFO intialize() has been called
MyAlg.ToolWithName   INFO Int    = 100
MyAlg.ToolWithName   INFO Double = 100
MyAlg.ToolWithName   INFO String = hundred
MyAlg.ToolWithName   INFO Bool   = 1
MyAlg                INFO ....initialization done
ToolSvc.ToolA       DEBUG Property update for OutputLevel : new value = 2
ToolSvc.ToolA       DEBUG Initialize
ToolSvc.ToolA       DEBUG Initialize base class GaudiCommon<CounterHolder<AlgTool>>
ToolSvc.ToolA       DEBUG could not locate CounterSummarySvc, no counter summary will be made
ToolSvc.ToolA       DEBUG List of ALL properties of TestTool/ToolSvc.ToolA  #properties = 26
ToolSvc.ToolA       DEBUG Property ['Name': Value] =  'Tools':[ 'TestTool/ToolB' ]
ToolSvc.ToolA       DEBUG Property ['Name': Value] =  'ContextService':'AlgContextSvc'
ToolSvc.ToolA       DEBUG Property ['Name': Value] =  'StatEntityList':[  ]
ToolSvc.ToolA       DEBUG Property ['Name': Value] =  'CounterList':[ '.*' ]
ToolSvc.ToolA       DEBUG Property ['Name': Value] =  'UseEfficiencyRowFormat':True
ToolSvc.ToolA       DEBUG Property ['Name': Value] =  'EfficiencyRowFormat':' |*%|-48.48s|%|50t||%|10d| |%|11.5g| |(%|#9.6g| +- %|-#9.6g|)%%|   -------   |   -------   |'
ToolSvc.ToolA       DEBUG Property ['Name': Value] =  'RegularRowFormat':' | %|-48.48s|%|50t||%|10d| |%|11.7g| |%|#11.5g| |%|#11.5g| |%|#12.5g| |%|#12.5g| |'
ToolSvc.ToolA       DEBUG Property ['Name': Value] =  'StatTableHeader':' |    Counter                                      |     #     |    sum     | mean/eff^* | rms/err^*  |     min     |     max     |'
ToolSvc.ToolA       DEBUG Property ['Name': Value] =  'RootInTES':''
ToolSvc.ToolA       DEBUG Property ['Name': Value] =  'Context':''
ToolSvc.ToolA       DEBUG Property ['Name': Value] =  'TypePrint':True
ToolSvc.ToolA       DEBUG Property ['Name': Value] =  'PrintEmptyCounters':False
ToolSvc.ToolA       DEBUG Property ['Name': Value] =  'StatPrint':True
ToolSvc.ToolA       DEBUG Property ['Name': Value] =  'PropertiesPrint':False
ToolSvc.ToolA       DEBUG Property ['Name': Value] =  'ErrorsPrint':True
ToolSvc.ToolA       DEBUG Property ['Name': Value] =  'AuditRestart':False
ToolSvc.ToolA       DEBUG Property ['Name': Value] =  'AuditReinitialize':False
ToolSvc.ToolA       DEBUG Property ['Name': Value] =  'AuditFinalize':False
ToolSvc.ToolA       DEBUG Property ['Name': Value] =  'AuditStop':False
ToolSvc.ToolA       DEBUG Property ['Name': Value] =  'AuditStart':False
ToolSvc.ToolA       DEBUG Property ['Name': Value] =  'AuditInitialize':False
ToolSvc.ToolA       DEBUG Property ['Name': Value] =  'AuditTools':False
ToolSvc.ToolA       DEBUG Property ['Name': Value] =  'MonitorService':'MonitorSvc'
ToolSvc.ToolA       DEBUG Property ['Name': Value] =  'OutputLevel':2
ToolSvc.ToolA       DEBUG Property ['Name': Value] =  'ExtraOutputs':[]
ToolSvc.ToolA       DEBUG Property ['Name': Value] =  'ExtraInputs':[]
ToolSvc.ToolA       DEBUG Loading tool ToolB of type TestTool
ToolSvc.ToolB       DEBUG Property update for OutputLevel : new value = 2
ToolSvc.ToolB       DEBUG Initialize
ToolSvc.ToolB       DEBUG Initialize base class GaudiCommon<CounterHolder<AlgTool>>
ToolSvc.ToolB       DEBUG could not locate CounterSummarySvc, no counter summary will be made
ToolSvc.ToolB       DEBUG List of ALL properties of TestTool/ToolSvc.ToolB  #properties = 26
ToolSvc.ToolB       DEBUG Property ['Name': Value] =  'Tools':[ 'TestTool/ToolA' ]
ToolSvc.ToolB       DEBUG Property ['Name': Value] =  'ContextService':'AlgContextSvc'
ToolSvc.ToolB       DEBUG Property ['Name': Value] =  'StatEntityList':[  ]
ToolSvc.ToolB       DEBUG Property ['Name': Value] =  'CounterList':[ '.*' ]
ToolSvc.ToolB       DEBUG Property ['Name': Value] =  'UseEfficiencyRowFormat':True
ToolSvc.ToolB       DEBUG Property ['Name': Value] =  'EfficiencyRowFormat':' |*%|-48.48s|%|50t||%|10d| |%|11.5g| |(%|#9.6g| +- %|-#9.6g|)%%|   -------   |   -------   |'
ToolSvc.ToolB       DEBUG Property ['Name': Value] =  'RegularRowFormat':' | %|-48.48s|%|50t||%|10d| |%|11.7g| |%|#11.5g| |%|#11.5g| |%|#12.5g| |%|#12.5g| |'
ToolSvc.ToolB       DEBUG Property ['Name': Value] =  'StatTableHeader':' |    Counter                                      |     #     |    sum     | mean/eff^* | rms/err^*  |     min     |     max     |'
ToolSvc.ToolB       DEBUG Property ['Name': Value] =  'RootInTES':''
ToolSvc.ToolB       DEBUG Property ['Name': Value] =  'Context':''
ToolSvc.ToolB       DEBUG Property ['Name': Value] =  'TypePrint':True
ToolSvc.ToolB       DEBUG Property ['Name': Value] =  'PrintEmptyCounters':False
ToolSvc.ToolB       DEBUG Property ['Name': Value] =  'StatPrint':True
ToolSvc.ToolB       DEBUG Property ['Name': Value] =  'PropertiesPrint':False
ToolSvc.ToolB       DEBUG Property ['Name': Value] =  'ErrorsPrint':True
ToolSvc.ToolB       DEBUG Property ['Name': Value] =  'AuditRestart':False
ToolSvc.ToolB       DEBUG Property ['Name': Value] =  'AuditReinitialize':False
ToolSvc.ToolB       DEBUG Property ['Name': Value] =  'AuditFinalize':False
ToolSvc.ToolB       DEBUG Property ['Name': Value] =  'AuditStop':False
ToolSvc.ToolB       DEBUG Property ['Name': Value] =  'AuditStart':False
ToolSvc.ToolB       DEBUG Property ['Name': Value] =  'AuditInitialize':False
ToolSvc.ToolB       DEBUG Property ['Name': Value] =  'AuditTools':False
ToolSvc.ToolB       DEBUG Property ['Name': Value] =  'MonitorService':'MonitorSvc'
ToolSvc.ToolB       DEBUG Property ['Name': Value] =  'OutputLevel':2
ToolSvc.ToolB       DEBUG Property ['Name': Value] =  'ExtraOutputs':[]
ToolSvc.ToolB       DEBUG Property ['Name': Value] =  'ExtraInputs':[]
ToolSvc.ToolB       DEBUG Loading tool ToolA of type TestTool
ToolSvc.ToolB       DEBUG Registering tool ToolSvc.ToolA
ToolSvc.ToolA       DEBUG Registering tool ToolSvc.ToolB
EventLoopMgr      WARNING Unable to locate service "EventSelector"
EventLoopMgr      WARNING No events will be processed from external input.
HistogramPersis...WARNING Histograms saving not required.
ApplicationMgr       INFO Application Manager Initialized successfully
ApplicationMgr       INFO Application Manager Started successfully
MyAlg                INFO executing....
ToolSvc.MyTool       INFO doIt() has been called
ToolSvc.MyGaudi...   INFO doIt() has been called
ToolSvc.MyGaudi...   INFO MyGaudiTool:: public tool called by
MyAlg.MyTool         INFO doIt() has been called
MyAlg.MyGaudiTool    INFO doIt() has been called
MyAlg.ToolWithName   INFO doIt() has been called
MyAlg.MyGaudiTool    INFO doItAgain() has been called
MyAlg                INFO executing....
ToolSvc.MyTool       INFO doIt() has been called
ToolSvc.MyGaudi...   INFO doIt() has been called
ToolSvc.MyGaudi...   INFO MyGaudiTool:: public tool called by
MyAlg.MyTool         INFO doIt() has been called
MyAlg.MyGaudiTool    INFO doIt() has been called
MyAlg.ToolWithName   INFO doIt() has been called
MyAlg.MyGaudiTool    INFO doItAgain() has been called
MyAlg                INFO executing....
ToolSvc.MyTool       INFO doIt() has been called
ToolSvc.MyGaudi...   INFO doIt() has been called
ToolSvc.MyGaudi...   INFO MyGaudiTool:: public tool called by
MyAlg.MyTool         INFO doIt() has been called
MyAlg.MyGaudiTool    INFO doIt() has been called
MyAlg.ToolWithName   INFO doIt() has been called
MyAlg.MyGaudiTool    INFO doItAgain() has been called
MyAlg                INFO executing....
ToolSvc.MyTool       INFO doIt() has been called
ToolSvc.MyGaudi...   INFO doIt() has been called
ToolSvc.MyGaudi...   INFO MyGaudiTool:: public tool called by
MyAlg.MyTool         INFO doIt() has been called
MyAlg.MyGaudiTool    INFO doIt() has been called
MyAlg.ToolWithName   INFO doIt() has been called
MyAlg.MyGaudiTool    INFO doItAgain() has been called
MyAlg                INFO executing....
ToolSvc.MyTool       INFO doIt() has been called
ToolSvc.MyGaudi...   INFO doIt() has been called
ToolSvc.MyGaudi...   INFO MyGaudiTool:: public tool called by
MyAlg.MyTool         INFO doIt() has been called
MyAlg.MyGaudiTool    INFO doIt() has been called
MyAlg.ToolWithName   INFO doIt() has been called
MyAlg.MyGaudiTool    INFO doItAgain() has been called
MyAlg                INFO executing....
ToolSvc.MyTool       INFO doIt() has been called
ToolSvc.MyGaudi...   INFO doIt() has been called
ToolSvc.MyGaudi...   INFO MyGaudiTool:: public tool called by
MyAlg.MyTool         INFO doIt() has been called
MyAlg.MyGaudiTool    INFO doIt() has been called
MyAlg.ToolWithName   INFO doIt() has been called
MyAlg.MyGaudiTool    INFO doItAgain() has been called
MyAlg                INFO executing....
ToolSvc.MyTool       INFO doIt() has been called
ToolSvc.MyGaudi...   INFO doIt() has been called
ToolSvc.MyGaudi...   INFO MyGaudiTool:: public tool called by
MyAlg.MyTool         INFO doIt() has been called
MyAlg.MyGaudiTool    INFO doIt() has been called
MyAlg.ToolWithName   INFO doIt() has been called
MyAlg.MyGaudiTool    INFO doItAgain() has been called
MyAlg                INFO executing....
ToolSvc.MyTool       INFO doIt() has been called
ToolSvc.MyGaudi...   INFO doIt() has been called
ToolSvc.MyGaudi...   INFO MyGaudiTool:: public tool called by
MyAlg.MyTool         INFO doIt() has been called
MyAlg.MyGaudiTool    INFO doIt() has been called
MyAlg.ToolWithName   INFO doIt() has been called
MyAlg.MyGaudiTool    INFO doItAgain() has been called
MyAlg                INFO executing....
ToolSvc.MyTool       INFO doIt() has been called
ToolSvc.MyGaudi...   INFO doIt() has been called
ToolSvc.MyGaudi...   INFO MyGaudiTool:: public tool called by
MyAlg.MyTool         INFO doIt() has been called
MyAlg.MyGaudiTool    INFO doIt() has been called
MyAlg.ToolWithName   INFO doIt() has been called
MyAlg.MyGaudiTool    INFO doItAgain() has been called
MyAlg                INFO executing....
ToolSvc.MyTool       INFO doIt() has been called
ToolSvc.MyGaudi...   INFO doIt() has been called
ToolSvc.MyGaudi...   INFO MyGaudiTool:: The INFO message is suppressed : 'public tool called by'
MyAlg.MyTool         INFO doIt() has been called
MyAlg.MyGaudiTool    INFO doIt() has been called
MyAlg.ToolWithName   INFO doIt() has been called
MyAlg.MyGaudiTool    INFO doItAgain() has been called
ApplicationMgr       INFO Application Manager Stopped successfully
MyAlg                INFO finalizing....
EventLoopMgr         INFO Histograms converted successfully according to request.
ToolSvc              INFO Removing all tools created by ToolSvc
MyAlg.ToolWithName   INFO finalize() has been called
MyAlg.MyGaudiTool    INFO finalize() has been called
MyAlg.MyTool         INFO finalize() has been called
ToolSvc.MyGaudi...   INFO finalize() has been called
ToolSvc.MyTool       INFO finalize() has been called
ToolSvc.ToolB       DEBUG Finalize
ToolSvc.ToolB       DEBUG  ==> Finalize the base class GaudiTool
ToolSvc.ToolB       DEBUG Tools to release : ToolSvc.ToolA
ToolSvc.ToolB       DEBUG Releasing tool 'ToolSvc.ToolA'
ToolSvc.ToolB       DEBUG De-Registering tool ToolSvc.ToolA
ToolSvc.ToolB       DEBUG The tool 'ToolSvc.ToolA' of type 'TestTool' is released
ToolSvc.ToolB       DEBUG Services to release :
ToolSvc.ToolA       DEBUG Finalize
ToolSvc.ToolA       DEBUG  ==> Finalize the base class GaudiTool
ToolSvc.ToolA       DEBUG Tools to release : ToolSvc.ToolB
ToolSvc.ToolA       DEBUG Releasing tool 'ToolSvc.ToolB'
ToolSvc.ToolA       DEBUG De-Registering tool ToolSvc.ToolB
ToolSvc.ToolA       DEBUG The tool 'ToolSvc.ToolB' of type 'TestTool' is released
ToolSvc.ToolA       DEBUG Services to release :
MyAlg.ToolWithName   INFO destructor has been called
MyAlg.MyGaudiTool    INFO destructor has been called
MyAlg.MyTool         INFO destructor has been called
ToolSvc.MyGaudi...   INFO destructor has been called
ToolSvc.MyTool       INFO destructor has been called
ApplicationMgr       INFO Application Manager Finalized successfully
ApplicationMgr       INFO Application Manager Terminated successfully
