{
    "inputDir": "/home/data",
    "filePattern": "Faser-(.+)-(\\d+)-\\d\\d\\d\\d\\d.raw",
    "archiveDir": "/eos/project/f/faser-commissioning/B21Data",
    "archiveServer": "eosproject-f.cern.ch",
    "account": "faserdaq",
    "password": "TBA",
    "influxdb": "https://TBA:TBA@dbod-faser-influx-prod.cern.ch:8080/write?db=DAQData"
}
