{"hostUrl": "http://faser-daq-010.cern.ch:5000",
 "maxTransitionTime": 30,
 "initCommand": "../HVControl/setLEDPulser.py 100 580 0",
 "finalizeCommand": "../HVControl/setLEDPulser.py 100 0 0",
 "defaults": {
     "runtype": "Test",
     "maxRunTime": 200,
     "maxEvents": 10000,
     "postCommand": null,
     "endcomment": "enough stat."
 },
 "template": {
     "vars": { "ledSetting": [580,585,590,595,600,605]
	     },
     "step": {
	 "cfgFile": "tlbDigiTI12DualCaloTest.json",
	 "startcomment": "LED scan A={ledSetting}",
	 "preCommand": "../HVControl/setLEDPulser.py 100 {ledSetting} 0"
     }
 }
}

