{
    "configuration": {
      "version": 11,
      "group": "faser",
      "components": [
        { "$ref" : "Templates/emulator.json#TriggerGenerator" },
        { "$ref" : "Templates/emulator.json#FrontendEmulator01" },
        { "$ref" : "Templates/emulator.json#FrontendEmulator02" },
        { "$ref" : "Templates/emulator.json#FrontendReceiver01" },
        { "$ref" : "Templates/emulator.json#FrontendReceiver02" },
        {
          "name": "eventbuilder01",
          "host": "localhost",
          "port": 5500,
          "modules":[{
            "name": "eventbuilder01",
            "type": "EventBuilderFaser",
            "settings":         { "$ref": "Templates/eventBuilder.json#EventBuilder/settings" },
            "connections": {
              "receivers": [
                { "chid": 0,"port": 8101, "host": "localhost", "type": "ZMQPair", "transport": "tcp", "queue":{"$ref": "top.json#queue"} },
                { "chid": 1,"port": 8102, "host": "localhost", "type": "ZMQPair", "transport": "tcp", "queue":{"$ref": "top.json#queue"} }
              ],
              "senders":  { "$ref": "Templates/eventBuilder.json#EventBuilder/connections/senders" }
            }
          }],
          "loglevel":         { "$ref": "top.json#loglevel" },
            "metrics_settings": { "$ref": "top.json#metrics_settings" }
        },
        { "$ref": "Templates/eventCompressor.json#EventCompressor" },
        { "$ref": "Templates/fileWriter.json#FileWriterCompression" },
        { "$ref": "Templates/emulator.json#FrontEndMonitor01" },
        { "$ref": "Templates/emulator.json#EmulatorMonitor" }
      ]
    }
  }