formatting

12 jobs for NN_onevirtualless in 27 minutes and 51 seconds (queued for 1 second)
latest
Status Job ID Name Coverage
  Build
passed #7933963
cvmfs
build:gcc8:opt

00:04:32

passed #7933965
cvmfs
build:gcc9:dbg

00:08:22

passed #7933964
cvmfs
build:gcc9:opt

00:04:47

passed #7933966
cvmfs
build:gcc9:opt:python3

00:06:36

passed #7933967
check-formatting

00:00:38

 
  Test
passed #7933968
check-copyright

00:01:04

failed #7933969
cvmfs
test:gcc8:opt

00:08:29

failed #7933971
cvmfs
test:gcc9:dbg

00:19:27

passed #7933970
cvmfs
test:gcc9:opt

00:06:59

passed #7933972
cvmfs
test:gcc9:opt:python3

00:06:47

passed #7933973
cvmfs
test_public_headers_build

00:03:45

passed #7933974
test-python3

00:02:21

 
Name Stage Failure
failed
test:gcc9:dbg Test
make: *** [test] Error 1
================================================================================
The following tests FAILED:
238 - GaudiHive.experiments.atlas.mc_reco_full_precedence_dump (Failed)
================================================================================
Uploading artifacts...
test_report: found 3419 matching files
Uploading artifacts to coordinator... ok
id=7933971 responseStatus=201 Created token=Kk5_QHjS
ERROR: Job failed: exit code 1
failed
test:gcc8:opt Test
make: *** [test] Error 1
================================================================================
The following tests FAILED:
143 - GaudiExamples.gaudiconfig2.histograms (Failed)
================================================================================
Uploading artifacts...
test_report: found 3415 matching files
Uploading artifacts to coordinator... ok
id=7933969 responseStatus=201 Created token=igLmKGoB
ERROR: Job failed: exit code 1