add a few more compiler warnings

10 jobs for add-more-compiler-diagnostics in 39 minutes and 36 seconds (queued for 1 second)
latest
Status Job ID Name Coverage
  Build
passed #5744628
cvmfs
build:gcc8:dbg

00:25:16

passed #5744627
cvmfs
build:gcc8:opt

00:14:51

passed #5744629
cvmfs
build:gcc8:opt:python3

00:17:32

passed #5744630
check-formatting

00:01:39

 
  Test
failed #5753214
cvmfs
test:gcc8:dbg

00:08:17

failed #5753213
cvmfs
test:gcc8:opt

00:06:36

failed #5744633
cvmfs
test:gcc8:opt:python3

00:05:54

passed #5744634
cvmfs
test_public_headers_build

00:03:42

failed #5744632
cvmfs
test:gcc8:dbg

00:20:49

failed #5744631
cvmfs
test:gcc8:opt

00:16:02

 
Name Stage Failure
failed
test:gcc8:dbg Test
make: *** [test] Error 1
================================================================================
The following tests FAILED:
1 - cmake.CMakeModules (Failed)
================================================================================
Uploading artifacts...
test_report: found 3313 matching files
Uploading artifacts to coordinator... ok
id=5753214 responseStatus=201 Created token=jdFyzXyx
ERROR: Job failed: exit code 1
failed
test:gcc8:opt Test
make: *** [test] Error 1
================================================================================
The following tests FAILED:
1 - cmake.CMakeModules (Failed)
================================================================================
Uploading artifacts...
test_report: found 3304 matching files
Uploading artifacts to coordinator... ok
id=5753213 responseStatus=201 Created token=4uF2GY_S
ERROR: Job failed: exit code 1
failed
test:gcc8:opt:python3 Test
make: *** [test] Error 1
================================================================================
The following tests FAILED:
1 - cmake.CMakeModules (Failed)
================================================================================
Uploading artifacts...
test_report: found 3304 matching files
Uploading artifacts to coordinator... ok
id=5744633 responseStatus=201 Created token=5EavjuZn
ERROR: Job failed: exit code 1