Merge branch 'Dev' of https://gitlab.cern.ch/cms_tk_ph2/Ph2_ACF into irene/InterfaceDev

Conflicts:
	HWDescription/SSA.cc
	HWInterface/D19cFWInterface.cc
	HWInterface/D19cFWInterface.h
	HWInterface/D19cOpticalInterface.cc
	HWInterface/FEConfigurationInterface.h
	HWInterface/MPAInterface.cc
	HWInterface/SSAInterface.cc
	HWInterface/lpGBTInterface.cc
	NetworkUtils
	Utils/D19cPSEventAS.cc
	settings/address_tables/uDTC_OT_address_table.xml
	src/feh_ps_test.cc
	tools/BackEndAlignment.cc
	tools/OTHybridTester.cc
	tools/PSHybridTester.cc
14 jobs for irene/InterfaceDev in 9 minutes and 57 seconds (queued for 1 second)
Name Stage Failure
failed
build:StandAlone_wEUDAQ Build
[ 74%] Linking CXX executable ../../bin/calibrate_SSAtest
[ 74%] Linking CXX executable ../../bin/SyncExample
[ 74%] Linking CXX executable ../../bin/SSAscurve
[ 74%] Built target SyncExample
[ 74%] Built target calibrate_SSAtest
[ 74%] Built target SSAscurve
make: *** [all] Error 2
Cleaning up project directory and file based variables
ERROR: Job failed: exit code 1

failed
build:StandAlone_wTC_USB_SEH Build
[ 75%] Linking CXX executable ../../bin/SSAscurve
[ 75%] Linking CXX executable ../../bin/calibrate_SSAtest
[ 75%] Linking CXX executable ../../bin/SyncExample
[ 75%] Built target SyncExample
[ 75%] Built target calibrate_SSAtest
[ 75%] Built target SSAscurve
make: *** [all] Error 2
Cleaning up project directory and file based variables
ERROR: Job failed: exit code 1

failed
build:StandAlone_woDS Build
[ 74%] Linking CXX executable ../../bin/SyncExample
[ 75%] Linking CXX executable ../../bin/calibrate_SSAtest
[ 76%] Linking CXX executable ../../bin/SSAscurve
[ 76%] Built target SyncExample
[ 76%] Built target calibrate_SSAtest
[ 76%] Built target SSAscurve
make: *** [all] Error 2
Cleaning up project directory and file based variables
ERROR: Job failed: exit code 1

failed
build:StandAlone_wTC_USB_ROH Build
[ 75%] Linking CXX executable ../../bin/calibrate_SSAtest
[ 75%] Linking CXX executable ../../bin/SyncExample
[ 75%] Linking CXX executable ../../bin/SSAscurve
[ 75%] Built target SyncExample
[ 75%] Built target calibrate_SSAtest
[ 75%] Built target SSAscurve
make: *** [all] Error 2
Cleaning up project directory and file based variables
ERROR: Job failed: exit code 1