(footprint "PinHeader_2x08_P2.54mm_Vertical" (version 20221018) (generator pcbnew)
  (layer "F.Cu")
  (descr "Through hole straight pin header, 2x08, 2.54mm pitch, double rows")
  (tags "Through hole pin header THT 2x08 2.54mm double row")
  (property "Info" "IPE-AVT")
  (property "Sheetfile" "atca_1U_backplane.kicad_sch")
  (property "Sheetname" "")
  (property "ki_description" "Generic connector, double row, 02x08, odd/even pin numbering scheme (row 1 odd numbers, row 2 even numbers), script generated (kicad-library-utils/schlib/autogen/connector/)")
  (property "ki_keywords" "connector")
  (attr through_hole)
  (fp_text reference "REF**" (at 1.27 -2.33) (layer "F.SilkS")
      (effects (font (size 1 1) (thickness 0.15)))
    (tstamp 11626653-cd34-4a5a-9edb-41dd0f8c5547)
  )
  (fp_text value "Conn_02x08_Odd_Even" (at 4.75 9 90) (layer "F.Fab")
      (effects (font (size 1 1) (thickness 0.15)))
    (tstamp 0075e337-9480-4625-92f9-5c34ac7e8183)
  )
  (fp_text user "${REFERENCE}" (at 1.27 8.89 90) (layer "F.Fab")
      (effects (font (size 1 1) (thickness 0.15)))
    (tstamp a9b570ff-850a-4616-aa5e-d0f8f39dc418)
  )
  (fp_line (start -1.33 -1.33) (end 0 -1.33)
    (stroke (width 0.12) (type solid)) (layer "F.SilkS") (tstamp 07c99ae7-ede3-4027-b17c-9942620a07d1))
  (fp_line (start -1.33 0) (end -1.33 -1.33)
    (stroke (width 0.12) (type solid)) (layer "F.SilkS") (tstamp 93c0cd12-4fda-4e79-9526-ca1f32fb7e42))
  (fp_line (start -1.33 1.27) (end -1.33 19.11)
    (stroke (width 0.12) (type solid)) (layer "F.SilkS") (tstamp 3e1c7599-7088-48b8-9c22-ae8dd80393a5))
  (fp_line (start -1.33 1.27) (end 1.27 1.27)
    (stroke (width 0.12) (type solid)) (layer "F.SilkS") (tstamp ed2397cc-2032-4747-bbe1-975b5c82743b))
  (fp_line (start -1.33 19.11) (end 3.87 19.11)
    (stroke (width 0.12) (type solid)) (layer "F.SilkS") (tstamp 11ffbbaa-0c58-4844-a70f-506ba29b1956))
  (fp_line (start 1.27 -1.33) (end 3.87 -1.33)
    (stroke (width 0.12) (type solid)) (layer "F.SilkS") (tstamp 6f2ae76c-7dfe-4835-817f-5f596a1e6132))
  (fp_line (start 1.27 1.27) (end 1.27 -1.33)
    (stroke (width 0.12) (type solid)) (layer "F.SilkS") (tstamp 575c58b2-1e43-4490-a46b-cfa31d0bccf2))
  (fp_line (start 3.87 -1.33) (end 3.87 19.11)
    (stroke (width 0.12) (type solid)) (layer "F.SilkS") (tstamp 0f5cce95-d69e-480f-8ced-88ce51507855))
  (fp_line (start -1.8 -1.8) (end -1.8 19.55)
    (stroke (width 0.05) (type solid)) (layer "F.CrtYd") (tstamp 9824fb72-2290-46fb-a2a1-d4eeb94da6e9))
  (fp_line (start -1.8 19.55) (end 4.35 19.55)
    (stroke (width 0.05) (type solid)) (layer "F.CrtYd") (tstamp dd27e5ca-dc8b-410d-a59d-8f403783ae10))
  (fp_line (start 4.35 -1.8) (end -1.8 -1.8)
    (stroke (width 0.05) (type solid)) (layer "F.CrtYd") (tstamp 0a31a331-e779-4ae3-a4da-435687a72db2))
  (fp_line (start 4.35 19.55) (end 4.35 -1.8)
    (stroke (width 0.05) (type solid)) (layer "F.CrtYd") (tstamp 6c9e92bd-69c5-4f79-b87a-0beb81c51d03))
  (fp_line (start -1.27 0) (end 0 -1.27)
    (stroke (width 0.1) (type solid)) (layer "F.Fab") (tstamp 6769ce9c-96ea-4ded-99c6-ff070e641d78))
  (fp_line (start -1.27 19.05) (end -1.27 0)
    (stroke (width 0.1) (type solid)) (layer "F.Fab") (tstamp c554de32-fdab-4144-ac89-af49d59ec702))
  (fp_line (start 0 -1.27) (end 3.81 -1.27)
    (stroke (width 0.1) (type solid)) (layer "F.Fab") (tstamp f835a6ad-7f7e-424c-950d-4468ef97e489))
  (fp_line (start 3.81 -1.27) (end 3.81 19.05)
    (stroke (width 0.1) (type solid)) (layer "F.Fab") (tstamp 245c2d5a-8916-46b3-bf54-aa02ce1632a5))
  (fp_line (start 3.81 19.05) (end -1.27 19.05)
    (stroke (width 0.1) (type solid)) (layer "F.Fab") (tstamp bb7b4c22-9475-457a-a244-f8e66574bb76))
  (pad "1" thru_hole rect (at 0 0 180) (size 1.7 1.7) (drill 1) (layers "*.Cu" "*.Mask") (tstamp da8e9b7b-d63b-4dd4-bb45-6a3bee8262dd))
  (pad "2" thru_hole oval (at 2.54 0 180) (size 1.7 1.7) (drill 1) (layers "*.Cu" "*.Mask") (tstamp 3b62d9bb-0959-4801-9c8c-f8d885832aa0))
  (pad "3" thru_hole oval (at 0 2.54 180) (size 1.7 1.7) (drill 1) (layers "*.Cu" "*.Mask") (tstamp 427e1cd1-f200-40cc-b312-751c6a470ff7))
  (pad "4" thru_hole oval (at 2.54 2.54 180) (size 1.7 1.7) (drill 1) (layers "*.Cu" "*.Mask") (tstamp a95658a5-e998-48f4-ac9e-36e3f2c15987))
  (pad "5" thru_hole oval (at 0 5.08 180) (size 1.7 1.7) (drill 1) (layers "*.Cu" "*.Mask") (tstamp daa190ee-4858-4f1b-9a48-533d0603e53f))
  (pad "6" thru_hole oval (at 2.54 5.08 180) (size 1.7 1.7) (drill 1) (layers "*.Cu" "*.Mask") (tstamp 9ef74228-33eb-48eb-90d3-75e16b7e4634))
  (pad "7" thru_hole oval (at 0 7.62 180) (size 1.7 1.7) (drill 1) (layers "*.Cu" "*.Mask") (tstamp 3a04d033-6b20-4a4b-86f1-47d63a7f4392))
  (pad "8" thru_hole oval (at 2.54 7.62 180) (size 1.7 1.7) (drill 1) (layers "*.Cu" "*.Mask") (tstamp 66c2305c-7592-4d04-be36-cd7f82698661))
  (pad "9" thru_hole oval (at 0 10.16 180) (size 1.7 1.7) (drill 1) (layers "*.Cu" "*.Mask") (tstamp 17580288-984e-4763-986b-e18340a97146))
  (pad "10" thru_hole oval (at 2.54 10.16 180) (size 1.7 1.7) (drill 1) (layers "*.Cu" "*.Mask") (tstamp 5762c3ed-c089-4dd3-ad85-b714ec44186b))
  (pad "11" thru_hole oval (at 0 12.7 180) (size 1.7 1.7) (drill 1) (layers "*.Cu" "*.Mask") (tstamp 37ebc002-0d2f-4689-9b2f-f44cfd1e5da0))
  (pad "12" thru_hole oval (at 2.54 12.7 180) (size 1.7 1.7) (drill 1) (layers "*.Cu" "*.Mask") (tstamp f2a1ad2c-cc31-4554-9aa2-2b15f7c58d42))
  (pad "13" thru_hole oval (at 0 15.24 180) (size 1.7 1.7) (drill 1) (layers "*.Cu" "*.Mask") (tstamp 2d058235-6733-4d97-acc9-d6e9e833601c))
  (pad "14" thru_hole oval (at 2.54 15.24 180) (size 1.7 1.7) (drill 1) (layers "*.Cu" "*.Mask") (tstamp 1d067912-b4db-4978-91d5-7ad2ce0d954a))
  (pad "15" thru_hole oval (at 0 17.78 180) (size 1.7 1.7) (drill 1) (layers "*.Cu" "*.Mask") (tstamp e503e7af-1142-41fd-b725-67849c9de80e))
  (pad "16" thru_hole oval (at 2.54 17.78 180) (size 1.7 1.7) (drill 1) (layers "*.Cu" "*.Mask") (tstamp ba20dc47-6b09-4467-93ed-220fe5b00649))
  (model "${KISYS3DMOD}/Connector_PinHeader_2.54mm.3dshapes/PinHeader_2x08_P2.54mm_Vertical.wrl"
    (offset (xyz 0 0 0))
    (scale (xyz 1 1 1))
    (rotate (xyz 0 0 0))
  )
)
