(footprint "IPE_LOGO_MASK_2.5x1.4mm" (version 20221018) (generator pcbnew)
  (layer "F.Cu")
  (attr smd board_only exclude_from_pos_files exclude_from_bom)
  (fp_text reference "REF**" (at 0 0) (layer "F.SilkS") hide
      (effects (font (size 1.524 1.524) (thickness 0.3)))
    (tstamp 8f47174e-ec8d-4807-a3da-0d215eec6259)
  )
  (fp_text value "LOGO" (at 0.75 0) (layer "F.SilkS") hide
      (effects (font (size 1.524 1.524) (thickness 0.3)))
    (tstamp b72deaf0-de6f-4c74-baf6-40c2c15b9808)
  )
  (fp_poly
    (pts
      (xy -0.955963 -0.392545)
      (xy -1.263072 -0.392545)
      (xy -1.263072 -0.699654)
      (xy -0.955963 -0.699654)
      (xy -0.955963 -0.392545)
    )

    (stroke (width 0.01) (type solid)) (fill solid) (layer "F.Mask") (tstamp 06b3bc03-63a5-419e-9086-d3f467c6629d))
  (fp_poly
    (pts
      (xy -0.953654 0.699655)
      (xy -1.263072 0.699655)
      (xy -1.263072 -0.154709)
      (xy -0.953654 -0.154709)
      (xy -0.953654 0.699655)
    )

    (stroke (width 0.01) (type solid)) (fill solid) (layer "F.Mask") (tstamp 211b4c19-215c-472d-b0e2-ffae60a5802a))
  (fp_poly
    (pts
      (xy 1.263073 0.699655)
      (xy -0.281709 0.699655)
      (xy -0.281709 0.390236)
      (xy 1.263073 0.390236)
      (xy 1.263073 0.699655)
    )

    (stroke (width 0.01) (type solid)) (fill solid) (layer "F.Mask") (tstamp 96726790-54e9-4748-b971-c6a3cee540a8))
  (fp_poly
    (pts
      (xy 1.263073 0.154709)
      (xy 0.371348 0.154709)
      (xy 0.382073 0.142586)
      (xy 0.410059 0.10935)
      (xy 0.434391 0.076902)
      (xy 0.455703 0.04432)
      (xy 0.47463 0.010679)
      (xy 0.480061 -0.000006)
      (xy 0.497177 -0.037183)
      (xy 0.511728 -0.074406)
      (xy 0.523354 -0.110671)
      (xy 0.531091 -0.142008)
      (xy 0.533728 -0.154709)
      (xy 1.263073 -0.154709)
      (xy 1.263073 0.154709)
    )

    (stroke (width 0.01) (type solid)) (fill solid) (layer "F.Mask") (tstamp 7e4a84d5-3861-4860-9faf-152f7ea641b9))
  (fp_poly
    (pts
      (xy 1.263073 -0.390236)
      (xy 0.533728 -0.390236)
      (xy 0.530998 -0.403514)
      (xy 0.523999 -0.432123)
      (xy 0.514459 -0.462883)
      (xy 0.502858 -0.494454)
      (xy 0.489675 -0.525492)
      (xy 0.480579 -0.544556)
      (xy 0.462109 -0.579028)
      (xy 0.442288 -0.610958)
      (xy 0.420178 -0.641739)
      (xy 0.39484 -0.672765)
      (xy 0.392048 -0.675986)
      (xy 0.371427 -0.699654)
      (xy 1.263073 -0.699654)
      (xy 1.263073 -0.390236)
    )

    (stroke (width 0.01) (type solid)) (fill solid) (layer "F.Mask") (tstamp 8b7cf589-2bbb-44b3-a6b2-9400fc6b5450))
  (fp_poly
    (pts
      (xy -0.348837 -0.699638)
      (xy -0.295947 -0.699588)
      (xy -0.247642 -0.699505)
      (xy -0.203926 -0.699389)
      (xy -0.164802 -0.69924)
      (xy -0.130273 -0.699058)
      (xy -0.100342 -0.698842)
      (xy -0.075013 -0.698594)
      (xy -0.054288 -0.698312)
      (xy -0.038171 -0.697998)
      (xy -0.026665 -0.69765)
      (xy -0.019774 -0.69727)
      (xy -0.018959 -0.697191)
      (xy 0.024968 -0.690109)
      (xy 0.067304 -0.678792)
      (xy 0.107819 -0.66342)
      (xy 0.14628 -0.64417)
      (xy 0.182458 -0.621221)
      (xy 0.21612 -0.594753)
      (xy 0.247037 -0.564943)
      (xy 0.274976 -0.531972)
      (xy 0.299708 -0.496016)
      (xy 0.320999 -0.457256)
      (xy 0.336103 -0.422543)
      (xy 0.348243 -0.3851)
      (xy 0.356722 -0.345551)
      (xy 0.361501 -0.304655)
      (xy 0.362541 -0.26317)
      (xy 0.359802 -0.221856)
      (xy 0.353246 -0.181473)
      (xy 0.349378 -0.1651)
      (xy 0.338223 -0.129364)
      (xy 0.323469 -0.093532)
      (xy 0.305791 -0.059058)
      (xy 0.285865 -0.027393)
      (xy 0.284516 -0.025479)
      (xy 0.273948 -0.011666)
      (xy 0.26081 0.003846)
      (xy 0.246169 0.019916)
      (xy 0.231095 0.035404)
      (xy 0.216657 0.049169)
      (xy 0.205854 0.058521)
      (xy 0.173518 0.082242)
      (xy 0.138545 0.103172)
      (xy 0.101921 0.120806)
      (xy 0.064633 0.134641)
      (xy 0.046579 0.139839)
      (xy 0.038247 0.142009)
      (xy 0.030736 0.143933)
      (xy 0.023729 0.145627)
      (xy 0.016906 0.147105)
      (xy 0.009949 0.148385)
      (xy 0.00254 0.149481)
      (xy -0.00564 0.15041)
      (xy -0.01491 0.151188)
      (xy -0.025588 0.151829)
      (xy -0.037993 0.152351)
      (xy -0.052443 0.152769)
      (xy -0.069256 0.153099)
      (xy -0.088752 0.153356)
      (xy -0.111249 0.153557)
      (xy -0.137065 0.153718)
      (xy -0.166518 0.153853)
      (xy -0.199928 0.15398)
      (xy -0.237613 0.154113)
      (xy -0.240722 0.154124)
      (xy -0.464127 0.154922)
      (xy -0.464127 0.699655)
      (xy -0.771236 0.699655)
      (xy -0.771236 -0.154709)
      (xy -0.411132 -0.154709)
      (xy -0.357766 -0.154721)
      (xy -0.308918 -0.154758)
      (xy -0.264486 -0.154821)
      (xy -0.22437 -0.154909)
      (xy -0.188468 -0.155024)
      (xy -0.15668 -0.155167)
      (xy -0.128904 -0.155338)
      (xy -0.105041 -0.155539)
      (xy -0.084988 -0.155768)
      (xy -0.068646 -0.156028)
      (xy -0.055913 -0.156319)
      (xy -0.046688 -0.156642)
      (xy -0.04087 -0.156997)
      (xy -0.038791 -0.157261)
      (xy -0.018115 -0.163849)
      (xy 0.00115 -0.174397)
      (xy 0.01831 -0.18831)
      (xy 0.032671 -0.204991)
      (xy 0.043539 -0.223846)
      (xy 0.046088 -0.230033)
      (xy 0.052456 -0.252916)
      (xy 0.054235 -0.275369)
      (xy 0.051418 -0.297536)
      (xy 0.043999 -0.319563)
      (xy 0.041601 -0.324706)
      (xy 0.029776 -0.343811)
      (xy 0.014581 -0.360336)
      (xy -0.003317 -0.37373)
      (xy -0.023252 -0.383446)
      (xy -0.033562 -0.386697)
      (xy -0.03579 -0.38717)
      (xy -0.03881 -0.3876)
      (xy -0.042837 -0.387989)
      (xy -0.048085 -0.388339)
      (xy -0.054769 -0.388651)
      (xy -0.063106 -0.388928)
      (xy -0.073309 -0.389171)
      (xy -0.085594 -0.389383)
      (xy -0.100175 -0.389567)
      (xy -0.117269 -0.389722)
      (xy -0.137089 -0.389853)
      (xy -0.159851 -0.389961)
      (xy -0.185769 -0.390047)
      (xy -0.21506 -0.390115)
      (xy -0.247937 -0.390165)
      (xy -0.284617 -0.3902)
      (xy -0.325313 -0.390223)
      (xy -0.370241 -0.390234)
      (xy -0.409194 -0.390236)
      (xy -0.771236 -0.390236)
      (xy -0.771236 -0.699654)
      (xy -0.406309 -0.699654)
      (xy -0.348837 -0.699638)
    )

    (stroke (width 0.01) (type solid)) (fill solid) (layer "F.Mask") (tstamp bc209882-b4f2-4f1a-abae-6142e3276961))
)
