%TF.GenerationSoftware,KiCad,Pcbnew,8.0.1-8.0.1-1~ubuntu22.04.1*%
%TF.CreationDate,2024-04-02T17:28:53+02:00*%
%TF.ProjectId,atca_2u_backplane_loopback,61746361-5f32-4755-9f62-61636b706c61,V1.0*%
%TF.SameCoordinates,Original*%
%TF.FileFunction,Drillmap*%
%TF.FilePolarity,Positive*%
%FSLAX45Y45*%
G04 Gerber Fmt 4.5, Leading zero omitted, Abs format (unit mm)*
G04 Created by KiCad (PCBNEW 8.0.1-8.0.1-1~ubuntu22.04.1) date 2024-04-02 17:28:53*
%MOMM*%
%LPD*%
G01*
G04 APERTURE LIST*
%ADD10C,0.050000*%
%ADD11C,0.200000*%
%ADD12C,0.175260*%
%ADD13C,0.210000*%
%ADD14C,0.249999*%
%ADD15C,0.320000*%
%ADD16C,0.325000*%
G04 APERTURE END LIST*
D10*
X1936200Y-10421200D02*
X26605000Y-10420000D01*
X26681200Y-10344000D02*
X26681200Y-4231200D01*
X26605000Y-4155000D02*
X1936200Y-4155000D01*
X1860000Y-4231200D02*
X1860000Y-10345000D01*
X26681200Y-10344000D02*
G75*
G02*
X26605000Y-10420000I-76200J200D01*
G01*
X1936200Y-10421200D02*
G75*
G02*
X1860000Y-10345000I0J76200D01*
G01*
X26605000Y-4155000D02*
G75*
G02*
X26681200Y-4231200I0J-76200D01*
G01*
X1860000Y-4231200D02*
G75*
G02*
X1936200Y-4155000I76200J0D01*
G01*
D11*
D12*
X16892370Y-9131370D02*
X17067630Y-9306630D01*
X17067630Y-9131370D02*
X16892370Y-9306630D01*
D13*
X2930000Y-9100000D02*
G75*
G02*
X2720000Y-9100000I-105000J0D01*
G01*
X2720000Y-9100000D02*
G75*
G02*
X2930000Y-9100000I105000J0D01*
G01*
D14*
X17385000Y-8135000D02*
X17385000Y-8385000D01*
X17260000Y-8260000D02*
X17510000Y-8260000D01*
X20240000Y-8135000D02*
X20240000Y-8385000D01*
X20115000Y-8260000D02*
X20365000Y-8260000D01*
D15*
X3178138Y-8323138D02*
X3178138Y-8096862D01*
X2951862Y-8096862D01*
X2951862Y-8323138D01*
X3178138Y-8323138D01*
D16*
X5240000Y-7827500D02*
X5402500Y-7665000D01*
X5240000Y-7502500D01*
X5077500Y-7665000D01*
X5240000Y-7827500D01*
X7780000Y-7827500D02*
X7942500Y-7665000D01*
X7780000Y-7502500D01*
X7617500Y-7665000D01*
X7780000Y-7827500D01*
D11*
X2118277Y-10735184D02*
X2118277Y-10535184D01*
X2118277Y-10535184D02*
X2165896Y-10535184D01*
X2165896Y-10535184D02*
X2194467Y-10544708D01*
X2194467Y-10544708D02*
X2213515Y-10563755D01*
X2213515Y-10563755D02*
X2223039Y-10582803D01*
X2223039Y-10582803D02*
X2232563Y-10620898D01*
X2232563Y-10620898D02*
X2232563Y-10649470D01*
X2232563Y-10649470D02*
X2223039Y-10687565D01*
X2223039Y-10687565D02*
X2213515Y-10706612D01*
X2213515Y-10706612D02*
X2194467Y-10725660D01*
X2194467Y-10725660D02*
X2165896Y-10735184D01*
X2165896Y-10735184D02*
X2118277Y-10735184D01*
X2318277Y-10735184D02*
X2318277Y-10601850D01*
X2318277Y-10639946D02*
X2327801Y-10620898D01*
X2327801Y-10620898D02*
X2337324Y-10611374D01*
X2337324Y-10611374D02*
X2356372Y-10601850D01*
X2356372Y-10601850D02*
X2375420Y-10601850D01*
X2442086Y-10735184D02*
X2442086Y-10601850D01*
X2442086Y-10535184D02*
X2432563Y-10544708D01*
X2432563Y-10544708D02*
X2442086Y-10554231D01*
X2442086Y-10554231D02*
X2451610Y-10544708D01*
X2451610Y-10544708D02*
X2442086Y-10535184D01*
X2442086Y-10535184D02*
X2442086Y-10554231D01*
X2565896Y-10735184D02*
X2546848Y-10725660D01*
X2546848Y-10725660D02*
X2537324Y-10706612D01*
X2537324Y-10706612D02*
X2537324Y-10535184D01*
X2670658Y-10735184D02*
X2651610Y-10725660D01*
X2651610Y-10725660D02*
X2642086Y-10706612D01*
X2642086Y-10706612D02*
X2642086Y-10535184D01*
X2899229Y-10735184D02*
X2899229Y-10535184D01*
X2899229Y-10535184D02*
X2965896Y-10678041D01*
X2965896Y-10678041D02*
X3032562Y-10535184D01*
X3032562Y-10535184D02*
X3032562Y-10735184D01*
X3213515Y-10735184D02*
X3213515Y-10630422D01*
X3213515Y-10630422D02*
X3203991Y-10611374D01*
X3203991Y-10611374D02*
X3184943Y-10601850D01*
X3184943Y-10601850D02*
X3146848Y-10601850D01*
X3146848Y-10601850D02*
X3127801Y-10611374D01*
X3213515Y-10725660D02*
X3194467Y-10735184D01*
X3194467Y-10735184D02*
X3146848Y-10735184D01*
X3146848Y-10735184D02*
X3127801Y-10725660D01*
X3127801Y-10725660D02*
X3118277Y-10706612D01*
X3118277Y-10706612D02*
X3118277Y-10687565D01*
X3118277Y-10687565D02*
X3127801Y-10668517D01*
X3127801Y-10668517D02*
X3146848Y-10658993D01*
X3146848Y-10658993D02*
X3194467Y-10658993D01*
X3194467Y-10658993D02*
X3213515Y-10649470D01*
X3308753Y-10601850D02*
X3308753Y-10801850D01*
X3308753Y-10611374D02*
X3327801Y-10601850D01*
X3327801Y-10601850D02*
X3365896Y-10601850D01*
X3365896Y-10601850D02*
X3384943Y-10611374D01*
X3384943Y-10611374D02*
X3394467Y-10620898D01*
X3394467Y-10620898D02*
X3403991Y-10639946D01*
X3403991Y-10639946D02*
X3403991Y-10697089D01*
X3403991Y-10697089D02*
X3394467Y-10716136D01*
X3394467Y-10716136D02*
X3384943Y-10725660D01*
X3384943Y-10725660D02*
X3365896Y-10735184D01*
X3365896Y-10735184D02*
X3327801Y-10735184D01*
X3327801Y-10735184D02*
X3308753Y-10725660D01*
X3489705Y-10716136D02*
X3499229Y-10725660D01*
X3499229Y-10725660D02*
X3489705Y-10735184D01*
X3489705Y-10735184D02*
X3480182Y-10725660D01*
X3480182Y-10725660D02*
X3489705Y-10716136D01*
X3489705Y-10716136D02*
X3489705Y-10735184D01*
X3489705Y-10611374D02*
X3499229Y-10620898D01*
X3499229Y-10620898D02*
X3489705Y-10630422D01*
X3489705Y-10630422D02*
X3480182Y-10620898D01*
X3480182Y-10620898D02*
X3489705Y-10611374D01*
X3489705Y-10611374D02*
X3489705Y-10630422D01*
D12*
X1682240Y-10976070D02*
X1857500Y-11151330D01*
X1857500Y-10976070D02*
X1682240Y-11151330D01*
D11*
X2223039Y-11155184D02*
X2108753Y-11155184D01*
X2165896Y-11155184D02*
X2165896Y-10955184D01*
X2165896Y-10955184D02*
X2146848Y-10983755D01*
X2146848Y-10983755D02*
X2127801Y-11002803D01*
X2127801Y-11002803D02*
X2108753Y-11012327D01*
X2308753Y-11136136D02*
X2318277Y-11145660D01*
X2318277Y-11145660D02*
X2308753Y-11155184D01*
X2308753Y-11155184D02*
X2299229Y-11145660D01*
X2299229Y-11145660D02*
X2308753Y-11136136D01*
X2308753Y-11136136D02*
X2308753Y-11155184D01*
X2384944Y-10955184D02*
X2518277Y-10955184D01*
X2518277Y-10955184D02*
X2432563Y-11155184D01*
X2689705Y-10955184D02*
X2594467Y-10955184D01*
X2594467Y-10955184D02*
X2584944Y-11050422D01*
X2584944Y-11050422D02*
X2594467Y-11040898D01*
X2594467Y-11040898D02*
X2613515Y-11031374D01*
X2613515Y-11031374D02*
X2661134Y-11031374D01*
X2661134Y-11031374D02*
X2680182Y-11040898D01*
X2680182Y-11040898D02*
X2689705Y-11050422D01*
X2689705Y-11050422D02*
X2699229Y-11069470D01*
X2699229Y-11069470D02*
X2699229Y-11117089D01*
X2699229Y-11117089D02*
X2689705Y-11136136D01*
X2689705Y-11136136D02*
X2680182Y-11145660D01*
X2680182Y-11145660D02*
X2661134Y-11155184D01*
X2661134Y-11155184D02*
X2613515Y-11155184D01*
X2613515Y-11155184D02*
X2594467Y-11145660D01*
X2594467Y-11145660D02*
X2584944Y-11136136D01*
X2765896Y-10955184D02*
X2889705Y-10955184D01*
X2889705Y-10955184D02*
X2823039Y-11031374D01*
X2823039Y-11031374D02*
X2851610Y-11031374D01*
X2851610Y-11031374D02*
X2870658Y-11040898D01*
X2870658Y-11040898D02*
X2880182Y-11050422D01*
X2880182Y-11050422D02*
X2889705Y-11069470D01*
X2889705Y-11069470D02*
X2889705Y-11117089D01*
X2889705Y-11117089D02*
X2880182Y-11136136D01*
X2880182Y-11136136D02*
X2870658Y-11145660D01*
X2870658Y-11145660D02*
X2851610Y-11155184D01*
X2851610Y-11155184D02*
X2794467Y-11155184D01*
X2794467Y-11155184D02*
X2775420Y-11145660D01*
X2775420Y-11145660D02*
X2765896Y-11136136D01*
X2975420Y-11155184D02*
X2975420Y-11021850D01*
X2975420Y-11040898D02*
X2984943Y-11031374D01*
X2984943Y-11031374D02*
X3003991Y-11021850D01*
X3003991Y-11021850D02*
X3032563Y-11021850D01*
X3032563Y-11021850D02*
X3051610Y-11031374D01*
X3051610Y-11031374D02*
X3061134Y-11050422D01*
X3061134Y-11050422D02*
X3061134Y-11155184D01*
X3061134Y-11050422D02*
X3070658Y-11031374D01*
X3070658Y-11031374D02*
X3089705Y-11021850D01*
X3089705Y-11021850D02*
X3118277Y-11021850D01*
X3118277Y-11021850D02*
X3137324Y-11031374D01*
X3137324Y-11031374D02*
X3146848Y-11050422D01*
X3146848Y-11050422D02*
X3146848Y-11155184D01*
X3242086Y-11155184D02*
X3242086Y-11021850D01*
X3242086Y-11040898D02*
X3251610Y-11031374D01*
X3251610Y-11031374D02*
X3270658Y-11021850D01*
X3270658Y-11021850D02*
X3299229Y-11021850D01*
X3299229Y-11021850D02*
X3318277Y-11031374D01*
X3318277Y-11031374D02*
X3327801Y-11050422D01*
X3327801Y-11050422D02*
X3327801Y-11155184D01*
X3327801Y-11050422D02*
X3337324Y-11031374D01*
X3337324Y-11031374D02*
X3356372Y-11021850D01*
X3356372Y-11021850D02*
X3384943Y-11021850D01*
X3384943Y-11021850D02*
X3403991Y-11031374D01*
X3403991Y-11031374D02*
X3413515Y-11050422D01*
X3413515Y-11050422D02*
X3413515Y-11155184D01*
X3803991Y-10945660D02*
X3632563Y-11202803D01*
X4061134Y-10955184D02*
X4080182Y-10955184D01*
X4080182Y-10955184D02*
X4099229Y-10964708D01*
X4099229Y-10964708D02*
X4108753Y-10974231D01*
X4108753Y-10974231D02*
X4118277Y-10993279D01*
X4118277Y-10993279D02*
X4127801Y-11031374D01*
X4127801Y-11031374D02*
X4127801Y-11078993D01*
X4127801Y-11078993D02*
X4118277Y-11117089D01*
X4118277Y-11117089D02*
X4108753Y-11136136D01*
X4108753Y-11136136D02*
X4099229Y-11145660D01*
X4099229Y-11145660D02*
X4080182Y-11155184D01*
X4080182Y-11155184D02*
X4061134Y-11155184D01*
X4061134Y-11155184D02*
X4042086Y-11145660D01*
X4042086Y-11145660D02*
X4032563Y-11136136D01*
X4032563Y-11136136D02*
X4023039Y-11117089D01*
X4023039Y-11117089D02*
X4013515Y-11078993D01*
X4013515Y-11078993D02*
X4013515Y-11031374D01*
X4013515Y-11031374D02*
X4023039Y-10993279D01*
X4023039Y-10993279D02*
X4032563Y-10974231D01*
X4032563Y-10974231D02*
X4042086Y-10964708D01*
X4042086Y-10964708D02*
X4061134Y-10955184D01*
X4213515Y-11136136D02*
X4223039Y-11145660D01*
X4223039Y-11145660D02*
X4213515Y-11155184D01*
X4213515Y-11155184D02*
X4203991Y-11145660D01*
X4203991Y-11145660D02*
X4213515Y-11136136D01*
X4213515Y-11136136D02*
X4213515Y-11155184D01*
X4346848Y-10955184D02*
X4365896Y-10955184D01*
X4365896Y-10955184D02*
X4384944Y-10964708D01*
X4384944Y-10964708D02*
X4394468Y-10974231D01*
X4394468Y-10974231D02*
X4403991Y-10993279D01*
X4403991Y-10993279D02*
X4413515Y-11031374D01*
X4413515Y-11031374D02*
X4413515Y-11078993D01*
X4413515Y-11078993D02*
X4403991Y-11117089D01*
X4403991Y-11117089D02*
X4394468Y-11136136D01*
X4394468Y-11136136D02*
X4384944Y-11145660D01*
X4384944Y-11145660D02*
X4365896Y-11155184D01*
X4365896Y-11155184D02*
X4346848Y-11155184D01*
X4346848Y-11155184D02*
X4327801Y-11145660D01*
X4327801Y-11145660D02*
X4318277Y-11136136D01*
X4318277Y-11136136D02*
X4308753Y-11117089D01*
X4308753Y-11117089D02*
X4299229Y-11078993D01*
X4299229Y-11078993D02*
X4299229Y-11031374D01*
X4299229Y-11031374D02*
X4308753Y-10993279D01*
X4308753Y-10993279D02*
X4318277Y-10974231D01*
X4318277Y-10974231D02*
X4327801Y-10964708D01*
X4327801Y-10964708D02*
X4346848Y-10955184D01*
X4584944Y-10955184D02*
X4546848Y-10955184D01*
X4546848Y-10955184D02*
X4527801Y-10964708D01*
X4527801Y-10964708D02*
X4518277Y-10974231D01*
X4518277Y-10974231D02*
X4499229Y-11002803D01*
X4499229Y-11002803D02*
X4489706Y-11040898D01*
X4489706Y-11040898D02*
X4489706Y-11117089D01*
X4489706Y-11117089D02*
X4499229Y-11136136D01*
X4499229Y-11136136D02*
X4508753Y-11145660D01*
X4508753Y-11145660D02*
X4527801Y-11155184D01*
X4527801Y-11155184D02*
X4565896Y-11155184D01*
X4565896Y-11155184D02*
X4584944Y-11145660D01*
X4584944Y-11145660D02*
X4594468Y-11136136D01*
X4594468Y-11136136D02*
X4603991Y-11117089D01*
X4603991Y-11117089D02*
X4603991Y-11069470D01*
X4603991Y-11069470D02*
X4594468Y-11050422D01*
X4594468Y-11050422D02*
X4584944Y-11040898D01*
X4584944Y-11040898D02*
X4565896Y-11031374D01*
X4565896Y-11031374D02*
X4527801Y-11031374D01*
X4527801Y-11031374D02*
X4508753Y-11040898D01*
X4508753Y-11040898D02*
X4499229Y-11050422D01*
X4499229Y-11050422D02*
X4489706Y-11069470D01*
X4699229Y-11155184D02*
X4737325Y-11155184D01*
X4737325Y-11155184D02*
X4756372Y-11145660D01*
X4756372Y-11145660D02*
X4765896Y-11136136D01*
X4765896Y-11136136D02*
X4784944Y-11107565D01*
X4784944Y-11107565D02*
X4794468Y-11069470D01*
X4794468Y-11069470D02*
X4794468Y-10993279D01*
X4794468Y-10993279D02*
X4784944Y-10974231D01*
X4784944Y-10974231D02*
X4775420Y-10964708D01*
X4775420Y-10964708D02*
X4756372Y-10955184D01*
X4756372Y-10955184D02*
X4718277Y-10955184D01*
X4718277Y-10955184D02*
X4699229Y-10964708D01*
X4699229Y-10964708D02*
X4689706Y-10974231D01*
X4689706Y-10974231D02*
X4680182Y-10993279D01*
X4680182Y-10993279D02*
X4680182Y-11040898D01*
X4680182Y-11040898D02*
X4689706Y-11059946D01*
X4689706Y-11059946D02*
X4699229Y-11069470D01*
X4699229Y-11069470D02*
X4718277Y-11078993D01*
X4718277Y-11078993D02*
X4756372Y-11078993D01*
X4756372Y-11078993D02*
X4775420Y-11069470D01*
X4775420Y-11069470D02*
X4784944Y-11059946D01*
X4784944Y-11059946D02*
X4794468Y-11040898D01*
X4918277Y-10955184D02*
X4937325Y-10955184D01*
X4937325Y-10955184D02*
X4956372Y-10964708D01*
X4956372Y-10964708D02*
X4965896Y-10974231D01*
X4965896Y-10974231D02*
X4975420Y-10993279D01*
X4975420Y-10993279D02*
X4984944Y-11031374D01*
X4984944Y-11031374D02*
X4984944Y-11078993D01*
X4984944Y-11078993D02*
X4975420Y-11117089D01*
X4975420Y-11117089D02*
X4965896Y-11136136D01*
X4965896Y-11136136D02*
X4956372Y-11145660D01*
X4956372Y-11145660D02*
X4937325Y-11155184D01*
X4937325Y-11155184D02*
X4918277Y-11155184D01*
X4918277Y-11155184D02*
X4899229Y-11145660D01*
X4899229Y-11145660D02*
X4889706Y-11136136D01*
X4889706Y-11136136D02*
X4880182Y-11117089D01*
X4880182Y-11117089D02*
X4870658Y-11078993D01*
X4870658Y-11078993D02*
X4870658Y-11031374D01*
X4870658Y-11031374D02*
X4880182Y-10993279D01*
X4880182Y-10993279D02*
X4889706Y-10974231D01*
X4889706Y-10974231D02*
X4899229Y-10964708D01*
X4899229Y-10964708D02*
X4918277Y-10955184D01*
X5061134Y-10955184D02*
X5061134Y-10993279D01*
X5137325Y-10955184D02*
X5137325Y-10993279D01*
X5432563Y-11231374D02*
X5423039Y-11221850D01*
X5423039Y-11221850D02*
X5403991Y-11193279D01*
X5403991Y-11193279D02*
X5394468Y-11174231D01*
X5394468Y-11174231D02*
X5384944Y-11145660D01*
X5384944Y-11145660D02*
X5375420Y-11098041D01*
X5375420Y-11098041D02*
X5375420Y-11059946D01*
X5375420Y-11059946D02*
X5384944Y-11012327D01*
X5384944Y-11012327D02*
X5394468Y-10983755D01*
X5394468Y-10983755D02*
X5403991Y-10964708D01*
X5403991Y-10964708D02*
X5423039Y-10936136D01*
X5423039Y-10936136D02*
X5432563Y-10926612D01*
X5613515Y-11155184D02*
X5499230Y-11155184D01*
X5556372Y-11155184D02*
X5556372Y-10955184D01*
X5556372Y-10955184D02*
X5537325Y-10983755D01*
X5537325Y-10983755D02*
X5518277Y-11002803D01*
X5518277Y-11002803D02*
X5499230Y-11012327D01*
X5851610Y-11155184D02*
X5851610Y-10955184D01*
X5937325Y-11155184D02*
X5937325Y-11050422D01*
X5937325Y-11050422D02*
X5927801Y-11031374D01*
X5927801Y-11031374D02*
X5908753Y-11021850D01*
X5908753Y-11021850D02*
X5880182Y-11021850D01*
X5880182Y-11021850D02*
X5861134Y-11031374D01*
X5861134Y-11031374D02*
X5851610Y-11040898D01*
X6061134Y-11155184D02*
X6042087Y-11145660D01*
X6042087Y-11145660D02*
X6032563Y-11136136D01*
X6032563Y-11136136D02*
X6023039Y-11117089D01*
X6023039Y-11117089D02*
X6023039Y-11059946D01*
X6023039Y-11059946D02*
X6032563Y-11040898D01*
X6032563Y-11040898D02*
X6042087Y-11031374D01*
X6042087Y-11031374D02*
X6061134Y-11021850D01*
X6061134Y-11021850D02*
X6089706Y-11021850D01*
X6089706Y-11021850D02*
X6108753Y-11031374D01*
X6108753Y-11031374D02*
X6118277Y-11040898D01*
X6118277Y-11040898D02*
X6127801Y-11059946D01*
X6127801Y-11059946D02*
X6127801Y-11117089D01*
X6127801Y-11117089D02*
X6118277Y-11136136D01*
X6118277Y-11136136D02*
X6108753Y-11145660D01*
X6108753Y-11145660D02*
X6089706Y-11155184D01*
X6089706Y-11155184D02*
X6061134Y-11155184D01*
X6242087Y-11155184D02*
X6223039Y-11145660D01*
X6223039Y-11145660D02*
X6213515Y-11126612D01*
X6213515Y-11126612D02*
X6213515Y-10955184D01*
X6394468Y-11145660D02*
X6375420Y-11155184D01*
X6375420Y-11155184D02*
X6337325Y-11155184D01*
X6337325Y-11155184D02*
X6318277Y-11145660D01*
X6318277Y-11145660D02*
X6308753Y-11126612D01*
X6308753Y-11126612D02*
X6308753Y-11050422D01*
X6308753Y-11050422D02*
X6318277Y-11031374D01*
X6318277Y-11031374D02*
X6337325Y-11021850D01*
X6337325Y-11021850D02*
X6375420Y-11021850D01*
X6375420Y-11021850D02*
X6394468Y-11031374D01*
X6394468Y-11031374D02*
X6403991Y-11050422D01*
X6403991Y-11050422D02*
X6403991Y-11069470D01*
X6403991Y-11069470D02*
X6308753Y-11088517D01*
X6470658Y-11231374D02*
X6480182Y-11221850D01*
X6480182Y-11221850D02*
X6499230Y-11193279D01*
X6499230Y-11193279D02*
X6508753Y-11174231D01*
X6508753Y-11174231D02*
X6518277Y-11145660D01*
X6518277Y-11145660D02*
X6527801Y-11098041D01*
X6527801Y-11098041D02*
X6527801Y-11059946D01*
X6527801Y-11059946D02*
X6518277Y-11012327D01*
X6518277Y-11012327D02*
X6508753Y-10983755D01*
X6508753Y-10983755D02*
X6499230Y-10964708D01*
X6499230Y-10964708D02*
X6480182Y-10936136D01*
X6480182Y-10936136D02*
X6470658Y-10926612D01*
X6832563Y-11231374D02*
X6823039Y-11221850D01*
X6823039Y-11221850D02*
X6803991Y-11193279D01*
X6803991Y-11193279D02*
X6794468Y-11174231D01*
X6794468Y-11174231D02*
X6784944Y-11145660D01*
X6784944Y-11145660D02*
X6775420Y-11098041D01*
X6775420Y-11098041D02*
X6775420Y-11059946D01*
X6775420Y-11059946D02*
X6784944Y-11012327D01*
X6784944Y-11012327D02*
X6794468Y-10983755D01*
X6794468Y-10983755D02*
X6803991Y-10964708D01*
X6803991Y-10964708D02*
X6823039Y-10936136D01*
X6823039Y-10936136D02*
X6832563Y-10926612D01*
X6908753Y-11021850D02*
X6908753Y-11155184D01*
X6908753Y-11040898D02*
X6918277Y-11031374D01*
X6918277Y-11031374D02*
X6937325Y-11021850D01*
X6937325Y-11021850D02*
X6965896Y-11021850D01*
X6965896Y-11021850D02*
X6984944Y-11031374D01*
X6984944Y-11031374D02*
X6994468Y-11050422D01*
X6994468Y-11050422D02*
X6994468Y-11155184D01*
X7118277Y-11155184D02*
X7099230Y-11145660D01*
X7099230Y-11145660D02*
X7089706Y-11136136D01*
X7089706Y-11136136D02*
X7080182Y-11117089D01*
X7080182Y-11117089D02*
X7080182Y-11059946D01*
X7080182Y-11059946D02*
X7089706Y-11040898D01*
X7089706Y-11040898D02*
X7099230Y-11031374D01*
X7099230Y-11031374D02*
X7118277Y-11021850D01*
X7118277Y-11021850D02*
X7146849Y-11021850D01*
X7146849Y-11021850D02*
X7165896Y-11031374D01*
X7165896Y-11031374D02*
X7175420Y-11040898D01*
X7175420Y-11040898D02*
X7184944Y-11059946D01*
X7184944Y-11059946D02*
X7184944Y-11117089D01*
X7184944Y-11117089D02*
X7175420Y-11136136D01*
X7175420Y-11136136D02*
X7165896Y-11145660D01*
X7165896Y-11145660D02*
X7146849Y-11155184D01*
X7146849Y-11155184D02*
X7118277Y-11155184D01*
X7242087Y-11021850D02*
X7318277Y-11021850D01*
X7270658Y-10955184D02*
X7270658Y-11126612D01*
X7270658Y-11126612D02*
X7280182Y-11145660D01*
X7280182Y-11145660D02*
X7299230Y-11155184D01*
X7299230Y-11155184D02*
X7318277Y-11155184D01*
X7537325Y-11021850D02*
X7537325Y-11221850D01*
X7537325Y-11031374D02*
X7556372Y-11021850D01*
X7556372Y-11021850D02*
X7594468Y-11021850D01*
X7594468Y-11021850D02*
X7613515Y-11031374D01*
X7613515Y-11031374D02*
X7623039Y-11040898D01*
X7623039Y-11040898D02*
X7632563Y-11059946D01*
X7632563Y-11059946D02*
X7632563Y-11117089D01*
X7632563Y-11117089D02*
X7623039Y-11136136D01*
X7623039Y-11136136D02*
X7613515Y-11145660D01*
X7613515Y-11145660D02*
X7594468Y-11155184D01*
X7594468Y-11155184D02*
X7556372Y-11155184D01*
X7556372Y-11155184D02*
X7537325Y-11145660D01*
X7746849Y-11155184D02*
X7727801Y-11145660D01*
X7727801Y-11145660D02*
X7718277Y-11126612D01*
X7718277Y-11126612D02*
X7718277Y-10955184D01*
X7908753Y-11155184D02*
X7908753Y-11050422D01*
X7908753Y-11050422D02*
X7899230Y-11031374D01*
X7899230Y-11031374D02*
X7880182Y-11021850D01*
X7880182Y-11021850D02*
X7842087Y-11021850D01*
X7842087Y-11021850D02*
X7823039Y-11031374D01*
X7908753Y-11145660D02*
X7889706Y-11155184D01*
X7889706Y-11155184D02*
X7842087Y-11155184D01*
X7842087Y-11155184D02*
X7823039Y-11145660D01*
X7823039Y-11145660D02*
X7813515Y-11126612D01*
X7813515Y-11126612D02*
X7813515Y-11107565D01*
X7813515Y-11107565D02*
X7823039Y-11088517D01*
X7823039Y-11088517D02*
X7842087Y-11078993D01*
X7842087Y-11078993D02*
X7889706Y-11078993D01*
X7889706Y-11078993D02*
X7908753Y-11069470D01*
X7975420Y-11021850D02*
X8051611Y-11021850D01*
X8003992Y-10955184D02*
X8003992Y-11126612D01*
X8003992Y-11126612D02*
X8013515Y-11145660D01*
X8013515Y-11145660D02*
X8032563Y-11155184D01*
X8032563Y-11155184D02*
X8051611Y-11155184D01*
X8194468Y-11145660D02*
X8175420Y-11155184D01*
X8175420Y-11155184D02*
X8137325Y-11155184D01*
X8137325Y-11155184D02*
X8118277Y-11145660D01*
X8118277Y-11145660D02*
X8108753Y-11126612D01*
X8108753Y-11126612D02*
X8108753Y-11050422D01*
X8108753Y-11050422D02*
X8118277Y-11031374D01*
X8118277Y-11031374D02*
X8137325Y-11021850D01*
X8137325Y-11021850D02*
X8175420Y-11021850D01*
X8175420Y-11021850D02*
X8194468Y-11031374D01*
X8194468Y-11031374D02*
X8203992Y-11050422D01*
X8203992Y-11050422D02*
X8203992Y-11069470D01*
X8203992Y-11069470D02*
X8108753Y-11088517D01*
X8375420Y-11155184D02*
X8375420Y-10955184D01*
X8375420Y-11145660D02*
X8356373Y-11155184D01*
X8356373Y-11155184D02*
X8318277Y-11155184D01*
X8318277Y-11155184D02*
X8299230Y-11145660D01*
X8299230Y-11145660D02*
X8289706Y-11136136D01*
X8289706Y-11136136D02*
X8280182Y-11117089D01*
X8280182Y-11117089D02*
X8280182Y-11059946D01*
X8280182Y-11059946D02*
X8289706Y-11040898D01*
X8289706Y-11040898D02*
X8299230Y-11031374D01*
X8299230Y-11031374D02*
X8318277Y-11021850D01*
X8318277Y-11021850D02*
X8356373Y-11021850D01*
X8356373Y-11021850D02*
X8375420Y-11031374D01*
X8451611Y-11231374D02*
X8461135Y-11221850D01*
X8461135Y-11221850D02*
X8480182Y-11193279D01*
X8480182Y-11193279D02*
X8489706Y-11174231D01*
X8489706Y-11174231D02*
X8499230Y-11145660D01*
X8499230Y-11145660D02*
X8508754Y-11098041D01*
X8508754Y-11098041D02*
X8508754Y-11059946D01*
X8508754Y-11059946D02*
X8499230Y-11012327D01*
X8499230Y-11012327D02*
X8489706Y-10983755D01*
X8489706Y-10983755D02*
X8480182Y-10964708D01*
X8480182Y-10964708D02*
X8461135Y-10936136D01*
X8461135Y-10936136D02*
X8451611Y-10926612D01*
X1857500Y-11358960D02*
G75*
G02*
X1657500Y-11358960I-100000J0D01*
G01*
X1657500Y-11358960D02*
G75*
G02*
X1857500Y-11358960I100000J0D01*
G01*
X2108753Y-11269491D02*
X2118277Y-11259968D01*
X2118277Y-11259968D02*
X2137324Y-11250444D01*
X2137324Y-11250444D02*
X2184944Y-11250444D01*
X2184944Y-11250444D02*
X2203991Y-11259968D01*
X2203991Y-11259968D02*
X2213515Y-11269491D01*
X2213515Y-11269491D02*
X2223039Y-11288539D01*
X2223039Y-11288539D02*
X2223039Y-11307587D01*
X2223039Y-11307587D02*
X2213515Y-11336158D01*
X2213515Y-11336158D02*
X2099229Y-11450444D01*
X2099229Y-11450444D02*
X2223039Y-11450444D01*
X2308753Y-11431396D02*
X2318277Y-11440920D01*
X2318277Y-11440920D02*
X2308753Y-11450444D01*
X2308753Y-11450444D02*
X2299229Y-11440920D01*
X2299229Y-11440920D02*
X2308753Y-11431396D01*
X2308753Y-11431396D02*
X2308753Y-11450444D01*
X2508753Y-11450444D02*
X2394467Y-11450444D01*
X2451610Y-11450444D02*
X2451610Y-11250444D01*
X2451610Y-11250444D02*
X2432563Y-11279015D01*
X2432563Y-11279015D02*
X2413515Y-11298063D01*
X2413515Y-11298063D02*
X2394467Y-11307587D01*
X2632563Y-11250444D02*
X2651610Y-11250444D01*
X2651610Y-11250444D02*
X2670658Y-11259968D01*
X2670658Y-11259968D02*
X2680182Y-11269491D01*
X2680182Y-11269491D02*
X2689705Y-11288539D01*
X2689705Y-11288539D02*
X2699229Y-11326634D01*
X2699229Y-11326634D02*
X2699229Y-11374253D01*
X2699229Y-11374253D02*
X2689705Y-11412348D01*
X2689705Y-11412348D02*
X2680182Y-11431396D01*
X2680182Y-11431396D02*
X2670658Y-11440920D01*
X2670658Y-11440920D02*
X2651610Y-11450444D01*
X2651610Y-11450444D02*
X2632563Y-11450444D01*
X2632563Y-11450444D02*
X2613515Y-11440920D01*
X2613515Y-11440920D02*
X2603991Y-11431396D01*
X2603991Y-11431396D02*
X2594467Y-11412348D01*
X2594467Y-11412348D02*
X2584944Y-11374253D01*
X2584944Y-11374253D02*
X2584944Y-11326634D01*
X2584944Y-11326634D02*
X2594467Y-11288539D01*
X2594467Y-11288539D02*
X2603991Y-11269491D01*
X2603991Y-11269491D02*
X2613515Y-11259968D01*
X2613515Y-11259968D02*
X2632563Y-11250444D01*
X2823039Y-11250444D02*
X2842086Y-11250444D01*
X2842086Y-11250444D02*
X2861134Y-11259968D01*
X2861134Y-11259968D02*
X2870658Y-11269491D01*
X2870658Y-11269491D02*
X2880182Y-11288539D01*
X2880182Y-11288539D02*
X2889705Y-11326634D01*
X2889705Y-11326634D02*
X2889705Y-11374253D01*
X2889705Y-11374253D02*
X2880182Y-11412348D01*
X2880182Y-11412348D02*
X2870658Y-11431396D01*
X2870658Y-11431396D02*
X2861134Y-11440920D01*
X2861134Y-11440920D02*
X2842086Y-11450444D01*
X2842086Y-11450444D02*
X2823039Y-11450444D01*
X2823039Y-11450444D02*
X2803991Y-11440920D01*
X2803991Y-11440920D02*
X2794467Y-11431396D01*
X2794467Y-11431396D02*
X2784944Y-11412348D01*
X2784944Y-11412348D02*
X2775420Y-11374253D01*
X2775420Y-11374253D02*
X2775420Y-11326634D01*
X2775420Y-11326634D02*
X2784944Y-11288539D01*
X2784944Y-11288539D02*
X2794467Y-11269491D01*
X2794467Y-11269491D02*
X2803991Y-11259968D01*
X2803991Y-11259968D02*
X2823039Y-11250444D01*
X2975420Y-11450444D02*
X2975420Y-11317110D01*
X2975420Y-11336158D02*
X2984943Y-11326634D01*
X2984943Y-11326634D02*
X3003991Y-11317110D01*
X3003991Y-11317110D02*
X3032563Y-11317110D01*
X3032563Y-11317110D02*
X3051610Y-11326634D01*
X3051610Y-11326634D02*
X3061134Y-11345682D01*
X3061134Y-11345682D02*
X3061134Y-11450444D01*
X3061134Y-11345682D02*
X3070658Y-11326634D01*
X3070658Y-11326634D02*
X3089705Y-11317110D01*
X3089705Y-11317110D02*
X3118277Y-11317110D01*
X3118277Y-11317110D02*
X3137324Y-11326634D01*
X3137324Y-11326634D02*
X3146848Y-11345682D01*
X3146848Y-11345682D02*
X3146848Y-11450444D01*
X3242086Y-11450444D02*
X3242086Y-11317110D01*
X3242086Y-11336158D02*
X3251610Y-11326634D01*
X3251610Y-11326634D02*
X3270658Y-11317110D01*
X3270658Y-11317110D02*
X3299229Y-11317110D01*
X3299229Y-11317110D02*
X3318277Y-11326634D01*
X3318277Y-11326634D02*
X3327801Y-11345682D01*
X3327801Y-11345682D02*
X3327801Y-11450444D01*
X3327801Y-11345682D02*
X3337324Y-11326634D01*
X3337324Y-11326634D02*
X3356372Y-11317110D01*
X3356372Y-11317110D02*
X3384943Y-11317110D01*
X3384943Y-11317110D02*
X3403991Y-11326634D01*
X3403991Y-11326634D02*
X3413515Y-11345682D01*
X3413515Y-11345682D02*
X3413515Y-11450444D01*
X3803991Y-11240920D02*
X3632563Y-11498063D01*
X4061134Y-11250444D02*
X4080182Y-11250444D01*
X4080182Y-11250444D02*
X4099229Y-11259968D01*
X4099229Y-11259968D02*
X4108753Y-11269491D01*
X4108753Y-11269491D02*
X4118277Y-11288539D01*
X4118277Y-11288539D02*
X4127801Y-11326634D01*
X4127801Y-11326634D02*
X4127801Y-11374253D01*
X4127801Y-11374253D02*
X4118277Y-11412348D01*
X4118277Y-11412348D02*
X4108753Y-11431396D01*
X4108753Y-11431396D02*
X4099229Y-11440920D01*
X4099229Y-11440920D02*
X4080182Y-11450444D01*
X4080182Y-11450444D02*
X4061134Y-11450444D01*
X4061134Y-11450444D02*
X4042086Y-11440920D01*
X4042086Y-11440920D02*
X4032563Y-11431396D01*
X4032563Y-11431396D02*
X4023039Y-11412348D01*
X4023039Y-11412348D02*
X4013515Y-11374253D01*
X4013515Y-11374253D02*
X4013515Y-11326634D01*
X4013515Y-11326634D02*
X4023039Y-11288539D01*
X4023039Y-11288539D02*
X4032563Y-11269491D01*
X4032563Y-11269491D02*
X4042086Y-11259968D01*
X4042086Y-11259968D02*
X4061134Y-11250444D01*
X4213515Y-11431396D02*
X4223039Y-11440920D01*
X4223039Y-11440920D02*
X4213515Y-11450444D01*
X4213515Y-11450444D02*
X4203991Y-11440920D01*
X4203991Y-11440920D02*
X4213515Y-11431396D01*
X4213515Y-11431396D02*
X4213515Y-11450444D01*
X4346848Y-11250444D02*
X4365896Y-11250444D01*
X4365896Y-11250444D02*
X4384944Y-11259968D01*
X4384944Y-11259968D02*
X4394468Y-11269491D01*
X4394468Y-11269491D02*
X4403991Y-11288539D01*
X4403991Y-11288539D02*
X4413515Y-11326634D01*
X4413515Y-11326634D02*
X4413515Y-11374253D01*
X4413515Y-11374253D02*
X4403991Y-11412348D01*
X4403991Y-11412348D02*
X4394468Y-11431396D01*
X4394468Y-11431396D02*
X4384944Y-11440920D01*
X4384944Y-11440920D02*
X4365896Y-11450444D01*
X4365896Y-11450444D02*
X4346848Y-11450444D01*
X4346848Y-11450444D02*
X4327801Y-11440920D01*
X4327801Y-11440920D02*
X4318277Y-11431396D01*
X4318277Y-11431396D02*
X4308753Y-11412348D01*
X4308753Y-11412348D02*
X4299229Y-11374253D01*
X4299229Y-11374253D02*
X4299229Y-11326634D01*
X4299229Y-11326634D02*
X4308753Y-11288539D01*
X4308753Y-11288539D02*
X4318277Y-11269491D01*
X4318277Y-11269491D02*
X4327801Y-11259968D01*
X4327801Y-11259968D02*
X4346848Y-11250444D01*
X4527801Y-11336158D02*
X4508753Y-11326634D01*
X4508753Y-11326634D02*
X4499229Y-11317110D01*
X4499229Y-11317110D02*
X4489706Y-11298063D01*
X4489706Y-11298063D02*
X4489706Y-11288539D01*
X4489706Y-11288539D02*
X4499229Y-11269491D01*
X4499229Y-11269491D02*
X4508753Y-11259968D01*
X4508753Y-11259968D02*
X4527801Y-11250444D01*
X4527801Y-11250444D02*
X4565896Y-11250444D01*
X4565896Y-11250444D02*
X4584944Y-11259968D01*
X4584944Y-11259968D02*
X4594468Y-11269491D01*
X4594468Y-11269491D02*
X4603991Y-11288539D01*
X4603991Y-11288539D02*
X4603991Y-11298063D01*
X4603991Y-11298063D02*
X4594468Y-11317110D01*
X4594468Y-11317110D02*
X4584944Y-11326634D01*
X4584944Y-11326634D02*
X4565896Y-11336158D01*
X4565896Y-11336158D02*
X4527801Y-11336158D01*
X4527801Y-11336158D02*
X4508753Y-11345682D01*
X4508753Y-11345682D02*
X4499229Y-11355206D01*
X4499229Y-11355206D02*
X4489706Y-11374253D01*
X4489706Y-11374253D02*
X4489706Y-11412348D01*
X4489706Y-11412348D02*
X4499229Y-11431396D01*
X4499229Y-11431396D02*
X4508753Y-11440920D01*
X4508753Y-11440920D02*
X4527801Y-11450444D01*
X4527801Y-11450444D02*
X4565896Y-11450444D01*
X4565896Y-11450444D02*
X4584944Y-11440920D01*
X4584944Y-11440920D02*
X4594468Y-11431396D01*
X4594468Y-11431396D02*
X4603991Y-11412348D01*
X4603991Y-11412348D02*
X4603991Y-11374253D01*
X4603991Y-11374253D02*
X4594468Y-11355206D01*
X4594468Y-11355206D02*
X4584944Y-11345682D01*
X4584944Y-11345682D02*
X4565896Y-11336158D01*
X4680182Y-11269491D02*
X4689706Y-11259968D01*
X4689706Y-11259968D02*
X4708753Y-11250444D01*
X4708753Y-11250444D02*
X4756372Y-11250444D01*
X4756372Y-11250444D02*
X4775420Y-11259968D01*
X4775420Y-11259968D02*
X4784944Y-11269491D01*
X4784944Y-11269491D02*
X4794468Y-11288539D01*
X4794468Y-11288539D02*
X4794468Y-11307587D01*
X4794468Y-11307587D02*
X4784944Y-11336158D01*
X4784944Y-11336158D02*
X4670658Y-11450444D01*
X4670658Y-11450444D02*
X4794468Y-11450444D01*
X4861134Y-11250444D02*
X4994468Y-11250444D01*
X4994468Y-11250444D02*
X4908753Y-11450444D01*
X5061134Y-11250444D02*
X5061134Y-11288539D01*
X5137325Y-11250444D02*
X5137325Y-11288539D01*
X5432563Y-11526634D02*
X5423039Y-11517110D01*
X5423039Y-11517110D02*
X5403991Y-11488539D01*
X5403991Y-11488539D02*
X5394468Y-11469491D01*
X5394468Y-11469491D02*
X5384944Y-11440920D01*
X5384944Y-11440920D02*
X5375420Y-11393301D01*
X5375420Y-11393301D02*
X5375420Y-11355206D01*
X5375420Y-11355206D02*
X5384944Y-11307587D01*
X5384944Y-11307587D02*
X5394468Y-11279015D01*
X5394468Y-11279015D02*
X5403991Y-11259968D01*
X5403991Y-11259968D02*
X5423039Y-11231396D01*
X5423039Y-11231396D02*
X5432563Y-11221872D01*
X5613515Y-11450444D02*
X5499230Y-11450444D01*
X5556372Y-11450444D02*
X5556372Y-11250444D01*
X5556372Y-11250444D02*
X5537325Y-11279015D01*
X5537325Y-11279015D02*
X5518277Y-11298063D01*
X5518277Y-11298063D02*
X5499230Y-11307587D01*
X5851610Y-11450444D02*
X5851610Y-11250444D01*
X5937325Y-11450444D02*
X5937325Y-11345682D01*
X5937325Y-11345682D02*
X5927801Y-11326634D01*
X5927801Y-11326634D02*
X5908753Y-11317110D01*
X5908753Y-11317110D02*
X5880182Y-11317110D01*
X5880182Y-11317110D02*
X5861134Y-11326634D01*
X5861134Y-11326634D02*
X5851610Y-11336158D01*
X6061134Y-11450444D02*
X6042087Y-11440920D01*
X6042087Y-11440920D02*
X6032563Y-11431396D01*
X6032563Y-11431396D02*
X6023039Y-11412348D01*
X6023039Y-11412348D02*
X6023039Y-11355206D01*
X6023039Y-11355206D02*
X6032563Y-11336158D01*
X6032563Y-11336158D02*
X6042087Y-11326634D01*
X6042087Y-11326634D02*
X6061134Y-11317110D01*
X6061134Y-11317110D02*
X6089706Y-11317110D01*
X6089706Y-11317110D02*
X6108753Y-11326634D01*
X6108753Y-11326634D02*
X6118277Y-11336158D01*
X6118277Y-11336158D02*
X6127801Y-11355206D01*
X6127801Y-11355206D02*
X6127801Y-11412348D01*
X6127801Y-11412348D02*
X6118277Y-11431396D01*
X6118277Y-11431396D02*
X6108753Y-11440920D01*
X6108753Y-11440920D02*
X6089706Y-11450444D01*
X6089706Y-11450444D02*
X6061134Y-11450444D01*
X6242087Y-11450444D02*
X6223039Y-11440920D01*
X6223039Y-11440920D02*
X6213515Y-11421872D01*
X6213515Y-11421872D02*
X6213515Y-11250444D01*
X6394468Y-11440920D02*
X6375420Y-11450444D01*
X6375420Y-11450444D02*
X6337325Y-11450444D01*
X6337325Y-11450444D02*
X6318277Y-11440920D01*
X6318277Y-11440920D02*
X6308753Y-11421872D01*
X6308753Y-11421872D02*
X6308753Y-11345682D01*
X6308753Y-11345682D02*
X6318277Y-11326634D01*
X6318277Y-11326634D02*
X6337325Y-11317110D01*
X6337325Y-11317110D02*
X6375420Y-11317110D01*
X6375420Y-11317110D02*
X6394468Y-11326634D01*
X6394468Y-11326634D02*
X6403991Y-11345682D01*
X6403991Y-11345682D02*
X6403991Y-11364729D01*
X6403991Y-11364729D02*
X6308753Y-11383777D01*
X6470658Y-11526634D02*
X6480182Y-11517110D01*
X6480182Y-11517110D02*
X6499230Y-11488539D01*
X6499230Y-11488539D02*
X6508753Y-11469491D01*
X6508753Y-11469491D02*
X6518277Y-11440920D01*
X6518277Y-11440920D02*
X6527801Y-11393301D01*
X6527801Y-11393301D02*
X6527801Y-11355206D01*
X6527801Y-11355206D02*
X6518277Y-11307587D01*
X6518277Y-11307587D02*
X6508753Y-11279015D01*
X6508753Y-11279015D02*
X6499230Y-11259968D01*
X6499230Y-11259968D02*
X6480182Y-11231396D01*
X6480182Y-11231396D02*
X6470658Y-11221872D01*
X6832563Y-11526634D02*
X6823039Y-11517110D01*
X6823039Y-11517110D02*
X6803991Y-11488539D01*
X6803991Y-11488539D02*
X6794468Y-11469491D01*
X6794468Y-11469491D02*
X6784944Y-11440920D01*
X6784944Y-11440920D02*
X6775420Y-11393301D01*
X6775420Y-11393301D02*
X6775420Y-11355206D01*
X6775420Y-11355206D02*
X6784944Y-11307587D01*
X6784944Y-11307587D02*
X6794468Y-11279015D01*
X6794468Y-11279015D02*
X6803991Y-11259968D01*
X6803991Y-11259968D02*
X6823039Y-11231396D01*
X6823039Y-11231396D02*
X6832563Y-11221872D01*
X6908753Y-11317110D02*
X6908753Y-11450444D01*
X6908753Y-11336158D02*
X6918277Y-11326634D01*
X6918277Y-11326634D02*
X6937325Y-11317110D01*
X6937325Y-11317110D02*
X6965896Y-11317110D01*
X6965896Y-11317110D02*
X6984944Y-11326634D01*
X6984944Y-11326634D02*
X6994468Y-11345682D01*
X6994468Y-11345682D02*
X6994468Y-11450444D01*
X7118277Y-11450444D02*
X7099230Y-11440920D01*
X7099230Y-11440920D02*
X7089706Y-11431396D01*
X7089706Y-11431396D02*
X7080182Y-11412348D01*
X7080182Y-11412348D02*
X7080182Y-11355206D01*
X7080182Y-11355206D02*
X7089706Y-11336158D01*
X7089706Y-11336158D02*
X7099230Y-11326634D01*
X7099230Y-11326634D02*
X7118277Y-11317110D01*
X7118277Y-11317110D02*
X7146849Y-11317110D01*
X7146849Y-11317110D02*
X7165896Y-11326634D01*
X7165896Y-11326634D02*
X7175420Y-11336158D01*
X7175420Y-11336158D02*
X7184944Y-11355206D01*
X7184944Y-11355206D02*
X7184944Y-11412348D01*
X7184944Y-11412348D02*
X7175420Y-11431396D01*
X7175420Y-11431396D02*
X7165896Y-11440920D01*
X7165896Y-11440920D02*
X7146849Y-11450444D01*
X7146849Y-11450444D02*
X7118277Y-11450444D01*
X7242087Y-11317110D02*
X7318277Y-11317110D01*
X7270658Y-11250444D02*
X7270658Y-11421872D01*
X7270658Y-11421872D02*
X7280182Y-11440920D01*
X7280182Y-11440920D02*
X7299230Y-11450444D01*
X7299230Y-11450444D02*
X7318277Y-11450444D01*
X7537325Y-11317110D02*
X7537325Y-11517110D01*
X7537325Y-11326634D02*
X7556372Y-11317110D01*
X7556372Y-11317110D02*
X7594468Y-11317110D01*
X7594468Y-11317110D02*
X7613515Y-11326634D01*
X7613515Y-11326634D02*
X7623039Y-11336158D01*
X7623039Y-11336158D02*
X7632563Y-11355206D01*
X7632563Y-11355206D02*
X7632563Y-11412348D01*
X7632563Y-11412348D02*
X7623039Y-11431396D01*
X7623039Y-11431396D02*
X7613515Y-11440920D01*
X7613515Y-11440920D02*
X7594468Y-11450444D01*
X7594468Y-11450444D02*
X7556372Y-11450444D01*
X7556372Y-11450444D02*
X7537325Y-11440920D01*
X7746849Y-11450444D02*
X7727801Y-11440920D01*
X7727801Y-11440920D02*
X7718277Y-11421872D01*
X7718277Y-11421872D02*
X7718277Y-11250444D01*
X7908753Y-11450444D02*
X7908753Y-11345682D01*
X7908753Y-11345682D02*
X7899230Y-11326634D01*
X7899230Y-11326634D02*
X7880182Y-11317110D01*
X7880182Y-11317110D02*
X7842087Y-11317110D01*
X7842087Y-11317110D02*
X7823039Y-11326634D01*
X7908753Y-11440920D02*
X7889706Y-11450444D01*
X7889706Y-11450444D02*
X7842087Y-11450444D01*
X7842087Y-11450444D02*
X7823039Y-11440920D01*
X7823039Y-11440920D02*
X7813515Y-11421872D01*
X7813515Y-11421872D02*
X7813515Y-11402825D01*
X7813515Y-11402825D02*
X7823039Y-11383777D01*
X7823039Y-11383777D02*
X7842087Y-11374253D01*
X7842087Y-11374253D02*
X7889706Y-11374253D01*
X7889706Y-11374253D02*
X7908753Y-11364729D01*
X7975420Y-11317110D02*
X8051611Y-11317110D01*
X8003992Y-11250444D02*
X8003992Y-11421872D01*
X8003992Y-11421872D02*
X8013515Y-11440920D01*
X8013515Y-11440920D02*
X8032563Y-11450444D01*
X8032563Y-11450444D02*
X8051611Y-11450444D01*
X8194468Y-11440920D02*
X8175420Y-11450444D01*
X8175420Y-11450444D02*
X8137325Y-11450444D01*
X8137325Y-11450444D02*
X8118277Y-11440920D01*
X8118277Y-11440920D02*
X8108753Y-11421872D01*
X8108753Y-11421872D02*
X8108753Y-11345682D01*
X8108753Y-11345682D02*
X8118277Y-11326634D01*
X8118277Y-11326634D02*
X8137325Y-11317110D01*
X8137325Y-11317110D02*
X8175420Y-11317110D01*
X8175420Y-11317110D02*
X8194468Y-11326634D01*
X8194468Y-11326634D02*
X8203992Y-11345682D01*
X8203992Y-11345682D02*
X8203992Y-11364729D01*
X8203992Y-11364729D02*
X8108753Y-11383777D01*
X8375420Y-11450444D02*
X8375420Y-11250444D01*
X8375420Y-11440920D02*
X8356373Y-11450444D01*
X8356373Y-11450444D02*
X8318277Y-11450444D01*
X8318277Y-11450444D02*
X8299230Y-11440920D01*
X8299230Y-11440920D02*
X8289706Y-11431396D01*
X8289706Y-11431396D02*
X8280182Y-11412348D01*
X8280182Y-11412348D02*
X8280182Y-11355206D01*
X8280182Y-11355206D02*
X8289706Y-11336158D01*
X8289706Y-11336158D02*
X8299230Y-11326634D01*
X8299230Y-11326634D02*
X8318277Y-11317110D01*
X8318277Y-11317110D02*
X8356373Y-11317110D01*
X8356373Y-11317110D02*
X8375420Y-11326634D01*
X8451611Y-11526634D02*
X8461135Y-11517110D01*
X8461135Y-11517110D02*
X8480182Y-11488539D01*
X8480182Y-11488539D02*
X8489706Y-11469491D01*
X8489706Y-11469491D02*
X8499230Y-11440920D01*
X8499230Y-11440920D02*
X8508754Y-11393301D01*
X8508754Y-11393301D02*
X8508754Y-11355206D01*
X8508754Y-11355206D02*
X8499230Y-11307587D01*
X8499230Y-11307587D02*
X8489706Y-11279015D01*
X8489706Y-11279015D02*
X8480182Y-11259968D01*
X8480182Y-11259968D02*
X8461135Y-11231396D01*
X8461135Y-11231396D02*
X8451611Y-11221872D01*
X1757500Y-11578960D02*
X1757500Y-11778960D01*
X1657500Y-11678960D02*
X1857500Y-11678960D01*
X2108753Y-11589491D02*
X2118277Y-11579968D01*
X2118277Y-11579968D02*
X2137324Y-11570444D01*
X2137324Y-11570444D02*
X2184944Y-11570444D01*
X2184944Y-11570444D02*
X2203991Y-11579968D01*
X2203991Y-11579968D02*
X2213515Y-11589491D01*
X2213515Y-11589491D02*
X2223039Y-11608539D01*
X2223039Y-11608539D02*
X2223039Y-11627587D01*
X2223039Y-11627587D02*
X2213515Y-11656158D01*
X2213515Y-11656158D02*
X2099229Y-11770444D01*
X2099229Y-11770444D02*
X2223039Y-11770444D01*
X2308753Y-11751396D02*
X2318277Y-11760920D01*
X2318277Y-11760920D02*
X2308753Y-11770444D01*
X2308753Y-11770444D02*
X2299229Y-11760920D01*
X2299229Y-11760920D02*
X2308753Y-11751396D01*
X2308753Y-11751396D02*
X2308753Y-11770444D01*
X2499229Y-11570444D02*
X2403991Y-11570444D01*
X2403991Y-11570444D02*
X2394467Y-11665682D01*
X2394467Y-11665682D02*
X2403991Y-11656158D01*
X2403991Y-11656158D02*
X2423039Y-11646634D01*
X2423039Y-11646634D02*
X2470658Y-11646634D01*
X2470658Y-11646634D02*
X2489705Y-11656158D01*
X2489705Y-11656158D02*
X2499229Y-11665682D01*
X2499229Y-11665682D02*
X2508753Y-11684729D01*
X2508753Y-11684729D02*
X2508753Y-11732348D01*
X2508753Y-11732348D02*
X2499229Y-11751396D01*
X2499229Y-11751396D02*
X2489705Y-11760920D01*
X2489705Y-11760920D02*
X2470658Y-11770444D01*
X2470658Y-11770444D02*
X2423039Y-11770444D01*
X2423039Y-11770444D02*
X2403991Y-11760920D01*
X2403991Y-11760920D02*
X2394467Y-11751396D01*
X2632563Y-11570444D02*
X2651610Y-11570444D01*
X2651610Y-11570444D02*
X2670658Y-11579968D01*
X2670658Y-11579968D02*
X2680182Y-11589491D01*
X2680182Y-11589491D02*
X2689705Y-11608539D01*
X2689705Y-11608539D02*
X2699229Y-11646634D01*
X2699229Y-11646634D02*
X2699229Y-11694253D01*
X2699229Y-11694253D02*
X2689705Y-11732348D01*
X2689705Y-11732348D02*
X2680182Y-11751396D01*
X2680182Y-11751396D02*
X2670658Y-11760920D01*
X2670658Y-11760920D02*
X2651610Y-11770444D01*
X2651610Y-11770444D02*
X2632563Y-11770444D01*
X2632563Y-11770444D02*
X2613515Y-11760920D01*
X2613515Y-11760920D02*
X2603991Y-11751396D01*
X2603991Y-11751396D02*
X2594467Y-11732348D01*
X2594467Y-11732348D02*
X2584944Y-11694253D01*
X2584944Y-11694253D02*
X2584944Y-11646634D01*
X2584944Y-11646634D02*
X2594467Y-11608539D01*
X2594467Y-11608539D02*
X2603991Y-11589491D01*
X2603991Y-11589491D02*
X2613515Y-11579968D01*
X2613515Y-11579968D02*
X2632563Y-11570444D01*
X2823039Y-11570444D02*
X2842086Y-11570444D01*
X2842086Y-11570444D02*
X2861134Y-11579968D01*
X2861134Y-11579968D02*
X2870658Y-11589491D01*
X2870658Y-11589491D02*
X2880182Y-11608539D01*
X2880182Y-11608539D02*
X2889705Y-11646634D01*
X2889705Y-11646634D02*
X2889705Y-11694253D01*
X2889705Y-11694253D02*
X2880182Y-11732348D01*
X2880182Y-11732348D02*
X2870658Y-11751396D01*
X2870658Y-11751396D02*
X2861134Y-11760920D01*
X2861134Y-11760920D02*
X2842086Y-11770444D01*
X2842086Y-11770444D02*
X2823039Y-11770444D01*
X2823039Y-11770444D02*
X2803991Y-11760920D01*
X2803991Y-11760920D02*
X2794467Y-11751396D01*
X2794467Y-11751396D02*
X2784944Y-11732348D01*
X2784944Y-11732348D02*
X2775420Y-11694253D01*
X2775420Y-11694253D02*
X2775420Y-11646634D01*
X2775420Y-11646634D02*
X2784944Y-11608539D01*
X2784944Y-11608539D02*
X2794467Y-11589491D01*
X2794467Y-11589491D02*
X2803991Y-11579968D01*
X2803991Y-11579968D02*
X2823039Y-11570444D01*
X2975420Y-11770444D02*
X2975420Y-11637110D01*
X2975420Y-11656158D02*
X2984943Y-11646634D01*
X2984943Y-11646634D02*
X3003991Y-11637110D01*
X3003991Y-11637110D02*
X3032563Y-11637110D01*
X3032563Y-11637110D02*
X3051610Y-11646634D01*
X3051610Y-11646634D02*
X3061134Y-11665682D01*
X3061134Y-11665682D02*
X3061134Y-11770444D01*
X3061134Y-11665682D02*
X3070658Y-11646634D01*
X3070658Y-11646634D02*
X3089705Y-11637110D01*
X3089705Y-11637110D02*
X3118277Y-11637110D01*
X3118277Y-11637110D02*
X3137324Y-11646634D01*
X3137324Y-11646634D02*
X3146848Y-11665682D01*
X3146848Y-11665682D02*
X3146848Y-11770444D01*
X3242086Y-11770444D02*
X3242086Y-11637110D01*
X3242086Y-11656158D02*
X3251610Y-11646634D01*
X3251610Y-11646634D02*
X3270658Y-11637110D01*
X3270658Y-11637110D02*
X3299229Y-11637110D01*
X3299229Y-11637110D02*
X3318277Y-11646634D01*
X3318277Y-11646634D02*
X3327801Y-11665682D01*
X3327801Y-11665682D02*
X3327801Y-11770444D01*
X3327801Y-11665682D02*
X3337324Y-11646634D01*
X3337324Y-11646634D02*
X3356372Y-11637110D01*
X3356372Y-11637110D02*
X3384943Y-11637110D01*
X3384943Y-11637110D02*
X3403991Y-11646634D01*
X3403991Y-11646634D02*
X3413515Y-11665682D01*
X3413515Y-11665682D02*
X3413515Y-11770444D01*
X3803991Y-11560920D02*
X3632563Y-11818063D01*
X4061134Y-11570444D02*
X4080182Y-11570444D01*
X4080182Y-11570444D02*
X4099229Y-11579968D01*
X4099229Y-11579968D02*
X4108753Y-11589491D01*
X4108753Y-11589491D02*
X4118277Y-11608539D01*
X4118277Y-11608539D02*
X4127801Y-11646634D01*
X4127801Y-11646634D02*
X4127801Y-11694253D01*
X4127801Y-11694253D02*
X4118277Y-11732348D01*
X4118277Y-11732348D02*
X4108753Y-11751396D01*
X4108753Y-11751396D02*
X4099229Y-11760920D01*
X4099229Y-11760920D02*
X4080182Y-11770444D01*
X4080182Y-11770444D02*
X4061134Y-11770444D01*
X4061134Y-11770444D02*
X4042086Y-11760920D01*
X4042086Y-11760920D02*
X4032563Y-11751396D01*
X4032563Y-11751396D02*
X4023039Y-11732348D01*
X4023039Y-11732348D02*
X4013515Y-11694253D01*
X4013515Y-11694253D02*
X4013515Y-11646634D01*
X4013515Y-11646634D02*
X4023039Y-11608539D01*
X4023039Y-11608539D02*
X4032563Y-11589491D01*
X4032563Y-11589491D02*
X4042086Y-11579968D01*
X4042086Y-11579968D02*
X4061134Y-11570444D01*
X4213515Y-11751396D02*
X4223039Y-11760920D01*
X4223039Y-11760920D02*
X4213515Y-11770444D01*
X4213515Y-11770444D02*
X4203991Y-11760920D01*
X4203991Y-11760920D02*
X4213515Y-11751396D01*
X4213515Y-11751396D02*
X4213515Y-11770444D01*
X4346848Y-11570444D02*
X4365896Y-11570444D01*
X4365896Y-11570444D02*
X4384944Y-11579968D01*
X4384944Y-11579968D02*
X4394468Y-11589491D01*
X4394468Y-11589491D02*
X4403991Y-11608539D01*
X4403991Y-11608539D02*
X4413515Y-11646634D01*
X4413515Y-11646634D02*
X4413515Y-11694253D01*
X4413515Y-11694253D02*
X4403991Y-11732348D01*
X4403991Y-11732348D02*
X4394468Y-11751396D01*
X4394468Y-11751396D02*
X4384944Y-11760920D01*
X4384944Y-11760920D02*
X4365896Y-11770444D01*
X4365896Y-11770444D02*
X4346848Y-11770444D01*
X4346848Y-11770444D02*
X4327801Y-11760920D01*
X4327801Y-11760920D02*
X4318277Y-11751396D01*
X4318277Y-11751396D02*
X4308753Y-11732348D01*
X4308753Y-11732348D02*
X4299229Y-11694253D01*
X4299229Y-11694253D02*
X4299229Y-11646634D01*
X4299229Y-11646634D02*
X4308753Y-11608539D01*
X4308753Y-11608539D02*
X4318277Y-11589491D01*
X4318277Y-11589491D02*
X4327801Y-11579968D01*
X4327801Y-11579968D02*
X4346848Y-11570444D01*
X4508753Y-11770444D02*
X4546848Y-11770444D01*
X4546848Y-11770444D02*
X4565896Y-11760920D01*
X4565896Y-11760920D02*
X4575420Y-11751396D01*
X4575420Y-11751396D02*
X4594468Y-11722825D01*
X4594468Y-11722825D02*
X4603991Y-11684729D01*
X4603991Y-11684729D02*
X4603991Y-11608539D01*
X4603991Y-11608539D02*
X4594468Y-11589491D01*
X4594468Y-11589491D02*
X4584944Y-11579968D01*
X4584944Y-11579968D02*
X4565896Y-11570444D01*
X4565896Y-11570444D02*
X4527801Y-11570444D01*
X4527801Y-11570444D02*
X4508753Y-11579968D01*
X4508753Y-11579968D02*
X4499229Y-11589491D01*
X4499229Y-11589491D02*
X4489706Y-11608539D01*
X4489706Y-11608539D02*
X4489706Y-11656158D01*
X4489706Y-11656158D02*
X4499229Y-11675206D01*
X4499229Y-11675206D02*
X4508753Y-11684729D01*
X4508753Y-11684729D02*
X4527801Y-11694253D01*
X4527801Y-11694253D02*
X4565896Y-11694253D01*
X4565896Y-11694253D02*
X4584944Y-11684729D01*
X4584944Y-11684729D02*
X4594468Y-11675206D01*
X4594468Y-11675206D02*
X4603991Y-11656158D01*
X4718277Y-11656158D02*
X4699229Y-11646634D01*
X4699229Y-11646634D02*
X4689706Y-11637110D01*
X4689706Y-11637110D02*
X4680182Y-11618063D01*
X4680182Y-11618063D02*
X4680182Y-11608539D01*
X4680182Y-11608539D02*
X4689706Y-11589491D01*
X4689706Y-11589491D02*
X4699229Y-11579968D01*
X4699229Y-11579968D02*
X4718277Y-11570444D01*
X4718277Y-11570444D02*
X4756372Y-11570444D01*
X4756372Y-11570444D02*
X4775420Y-11579968D01*
X4775420Y-11579968D02*
X4784944Y-11589491D01*
X4784944Y-11589491D02*
X4794468Y-11608539D01*
X4794468Y-11608539D02*
X4794468Y-11618063D01*
X4794468Y-11618063D02*
X4784944Y-11637110D01*
X4784944Y-11637110D02*
X4775420Y-11646634D01*
X4775420Y-11646634D02*
X4756372Y-11656158D01*
X4756372Y-11656158D02*
X4718277Y-11656158D01*
X4718277Y-11656158D02*
X4699229Y-11665682D01*
X4699229Y-11665682D02*
X4689706Y-11675206D01*
X4689706Y-11675206D02*
X4680182Y-11694253D01*
X4680182Y-11694253D02*
X4680182Y-11732348D01*
X4680182Y-11732348D02*
X4689706Y-11751396D01*
X4689706Y-11751396D02*
X4699229Y-11760920D01*
X4699229Y-11760920D02*
X4718277Y-11770444D01*
X4718277Y-11770444D02*
X4756372Y-11770444D01*
X4756372Y-11770444D02*
X4775420Y-11760920D01*
X4775420Y-11760920D02*
X4784944Y-11751396D01*
X4784944Y-11751396D02*
X4794468Y-11732348D01*
X4794468Y-11732348D02*
X4794468Y-11694253D01*
X4794468Y-11694253D02*
X4784944Y-11675206D01*
X4784944Y-11675206D02*
X4775420Y-11665682D01*
X4775420Y-11665682D02*
X4756372Y-11656158D01*
X4965896Y-11637110D02*
X4965896Y-11770444D01*
X4918277Y-11560920D02*
X4870658Y-11703777D01*
X4870658Y-11703777D02*
X4994468Y-11703777D01*
X5061134Y-11570444D02*
X5061134Y-11608539D01*
X5137325Y-11570444D02*
X5137325Y-11608539D01*
X5432563Y-11846634D02*
X5423039Y-11837110D01*
X5423039Y-11837110D02*
X5403991Y-11808539D01*
X5403991Y-11808539D02*
X5394468Y-11789491D01*
X5394468Y-11789491D02*
X5384944Y-11760920D01*
X5384944Y-11760920D02*
X5375420Y-11713301D01*
X5375420Y-11713301D02*
X5375420Y-11675206D01*
X5375420Y-11675206D02*
X5384944Y-11627587D01*
X5384944Y-11627587D02*
X5394468Y-11599015D01*
X5394468Y-11599015D02*
X5403991Y-11579968D01*
X5403991Y-11579968D02*
X5423039Y-11551396D01*
X5423039Y-11551396D02*
X5432563Y-11541872D01*
X5499230Y-11589491D02*
X5508753Y-11579968D01*
X5508753Y-11579968D02*
X5527801Y-11570444D01*
X5527801Y-11570444D02*
X5575420Y-11570444D01*
X5575420Y-11570444D02*
X5594468Y-11579968D01*
X5594468Y-11579968D02*
X5603991Y-11589491D01*
X5603991Y-11589491D02*
X5613515Y-11608539D01*
X5613515Y-11608539D02*
X5613515Y-11627587D01*
X5613515Y-11627587D02*
X5603991Y-11656158D01*
X5603991Y-11656158D02*
X5489706Y-11770444D01*
X5489706Y-11770444D02*
X5613515Y-11770444D01*
X5851610Y-11770444D02*
X5851610Y-11570444D01*
X5937325Y-11770444D02*
X5937325Y-11665682D01*
X5937325Y-11665682D02*
X5927801Y-11646634D01*
X5927801Y-11646634D02*
X5908753Y-11637110D01*
X5908753Y-11637110D02*
X5880182Y-11637110D01*
X5880182Y-11637110D02*
X5861134Y-11646634D01*
X5861134Y-11646634D02*
X5851610Y-11656158D01*
X6061134Y-11770444D02*
X6042087Y-11760920D01*
X6042087Y-11760920D02*
X6032563Y-11751396D01*
X6032563Y-11751396D02*
X6023039Y-11732348D01*
X6023039Y-11732348D02*
X6023039Y-11675206D01*
X6023039Y-11675206D02*
X6032563Y-11656158D01*
X6032563Y-11656158D02*
X6042087Y-11646634D01*
X6042087Y-11646634D02*
X6061134Y-11637110D01*
X6061134Y-11637110D02*
X6089706Y-11637110D01*
X6089706Y-11637110D02*
X6108753Y-11646634D01*
X6108753Y-11646634D02*
X6118277Y-11656158D01*
X6118277Y-11656158D02*
X6127801Y-11675206D01*
X6127801Y-11675206D02*
X6127801Y-11732348D01*
X6127801Y-11732348D02*
X6118277Y-11751396D01*
X6118277Y-11751396D02*
X6108753Y-11760920D01*
X6108753Y-11760920D02*
X6089706Y-11770444D01*
X6089706Y-11770444D02*
X6061134Y-11770444D01*
X6242087Y-11770444D02*
X6223039Y-11760920D01*
X6223039Y-11760920D02*
X6213515Y-11741872D01*
X6213515Y-11741872D02*
X6213515Y-11570444D01*
X6394468Y-11760920D02*
X6375420Y-11770444D01*
X6375420Y-11770444D02*
X6337325Y-11770444D01*
X6337325Y-11770444D02*
X6318277Y-11760920D01*
X6318277Y-11760920D02*
X6308753Y-11741872D01*
X6308753Y-11741872D02*
X6308753Y-11665682D01*
X6308753Y-11665682D02*
X6318277Y-11646634D01*
X6318277Y-11646634D02*
X6337325Y-11637110D01*
X6337325Y-11637110D02*
X6375420Y-11637110D01*
X6375420Y-11637110D02*
X6394468Y-11646634D01*
X6394468Y-11646634D02*
X6403991Y-11665682D01*
X6403991Y-11665682D02*
X6403991Y-11684729D01*
X6403991Y-11684729D02*
X6308753Y-11703777D01*
X6480182Y-11760920D02*
X6499230Y-11770444D01*
X6499230Y-11770444D02*
X6537325Y-11770444D01*
X6537325Y-11770444D02*
X6556372Y-11760920D01*
X6556372Y-11760920D02*
X6565896Y-11741872D01*
X6565896Y-11741872D02*
X6565896Y-11732348D01*
X6565896Y-11732348D02*
X6556372Y-11713301D01*
X6556372Y-11713301D02*
X6537325Y-11703777D01*
X6537325Y-11703777D02*
X6508753Y-11703777D01*
X6508753Y-11703777D02*
X6489706Y-11694253D01*
X6489706Y-11694253D02*
X6480182Y-11675206D01*
X6480182Y-11675206D02*
X6480182Y-11665682D01*
X6480182Y-11665682D02*
X6489706Y-11646634D01*
X6489706Y-11646634D02*
X6508753Y-11637110D01*
X6508753Y-11637110D02*
X6537325Y-11637110D01*
X6537325Y-11637110D02*
X6556372Y-11646634D01*
X6632563Y-11846634D02*
X6642087Y-11837110D01*
X6642087Y-11837110D02*
X6661134Y-11808539D01*
X6661134Y-11808539D02*
X6670658Y-11789491D01*
X6670658Y-11789491D02*
X6680182Y-11760920D01*
X6680182Y-11760920D02*
X6689706Y-11713301D01*
X6689706Y-11713301D02*
X6689706Y-11675206D01*
X6689706Y-11675206D02*
X6680182Y-11627587D01*
X6680182Y-11627587D02*
X6670658Y-11599015D01*
X6670658Y-11599015D02*
X6661134Y-11579968D01*
X6661134Y-11579968D02*
X6642087Y-11551396D01*
X6642087Y-11551396D02*
X6632563Y-11541872D01*
X6994468Y-11846634D02*
X6984944Y-11837110D01*
X6984944Y-11837110D02*
X6965896Y-11808539D01*
X6965896Y-11808539D02*
X6956372Y-11789491D01*
X6956372Y-11789491D02*
X6946849Y-11760920D01*
X6946849Y-11760920D02*
X6937325Y-11713301D01*
X6937325Y-11713301D02*
X6937325Y-11675206D01*
X6937325Y-11675206D02*
X6946849Y-11627587D01*
X6946849Y-11627587D02*
X6956372Y-11599015D01*
X6956372Y-11599015D02*
X6965896Y-11579968D01*
X6965896Y-11579968D02*
X6984944Y-11551396D01*
X6984944Y-11551396D02*
X6994468Y-11541872D01*
X7070658Y-11637110D02*
X7070658Y-11770444D01*
X7070658Y-11656158D02*
X7080182Y-11646634D01*
X7080182Y-11646634D02*
X7099230Y-11637110D01*
X7099230Y-11637110D02*
X7127801Y-11637110D01*
X7127801Y-11637110D02*
X7146849Y-11646634D01*
X7146849Y-11646634D02*
X7156372Y-11665682D01*
X7156372Y-11665682D02*
X7156372Y-11770444D01*
X7280182Y-11770444D02*
X7261134Y-11760920D01*
X7261134Y-11760920D02*
X7251611Y-11751396D01*
X7251611Y-11751396D02*
X7242087Y-11732348D01*
X7242087Y-11732348D02*
X7242087Y-11675206D01*
X7242087Y-11675206D02*
X7251611Y-11656158D01*
X7251611Y-11656158D02*
X7261134Y-11646634D01*
X7261134Y-11646634D02*
X7280182Y-11637110D01*
X7280182Y-11637110D02*
X7308753Y-11637110D01*
X7308753Y-11637110D02*
X7327801Y-11646634D01*
X7327801Y-11646634D02*
X7337325Y-11656158D01*
X7337325Y-11656158D02*
X7346849Y-11675206D01*
X7346849Y-11675206D02*
X7346849Y-11732348D01*
X7346849Y-11732348D02*
X7337325Y-11751396D01*
X7337325Y-11751396D02*
X7327801Y-11760920D01*
X7327801Y-11760920D02*
X7308753Y-11770444D01*
X7308753Y-11770444D02*
X7280182Y-11770444D01*
X7403992Y-11637110D02*
X7480182Y-11637110D01*
X7432563Y-11570444D02*
X7432563Y-11741872D01*
X7432563Y-11741872D02*
X7442087Y-11760920D01*
X7442087Y-11760920D02*
X7461134Y-11770444D01*
X7461134Y-11770444D02*
X7480182Y-11770444D01*
X7699230Y-11637110D02*
X7699230Y-11837110D01*
X7699230Y-11646634D02*
X7718277Y-11637110D01*
X7718277Y-11637110D02*
X7756373Y-11637110D01*
X7756373Y-11637110D02*
X7775420Y-11646634D01*
X7775420Y-11646634D02*
X7784944Y-11656158D01*
X7784944Y-11656158D02*
X7794468Y-11675206D01*
X7794468Y-11675206D02*
X7794468Y-11732348D01*
X7794468Y-11732348D02*
X7784944Y-11751396D01*
X7784944Y-11751396D02*
X7775420Y-11760920D01*
X7775420Y-11760920D02*
X7756373Y-11770444D01*
X7756373Y-11770444D02*
X7718277Y-11770444D01*
X7718277Y-11770444D02*
X7699230Y-11760920D01*
X7908753Y-11770444D02*
X7889706Y-11760920D01*
X7889706Y-11760920D02*
X7880182Y-11741872D01*
X7880182Y-11741872D02*
X7880182Y-11570444D01*
X8070658Y-11770444D02*
X8070658Y-11665682D01*
X8070658Y-11665682D02*
X8061134Y-11646634D01*
X8061134Y-11646634D02*
X8042087Y-11637110D01*
X8042087Y-11637110D02*
X8003992Y-11637110D01*
X8003992Y-11637110D02*
X7984944Y-11646634D01*
X8070658Y-11760920D02*
X8051611Y-11770444D01*
X8051611Y-11770444D02*
X8003992Y-11770444D01*
X8003992Y-11770444D02*
X7984944Y-11760920D01*
X7984944Y-11760920D02*
X7975420Y-11741872D01*
X7975420Y-11741872D02*
X7975420Y-11722825D01*
X7975420Y-11722825D02*
X7984944Y-11703777D01*
X7984944Y-11703777D02*
X8003992Y-11694253D01*
X8003992Y-11694253D02*
X8051611Y-11694253D01*
X8051611Y-11694253D02*
X8070658Y-11684729D01*
X8137325Y-11637110D02*
X8213515Y-11637110D01*
X8165896Y-11570444D02*
X8165896Y-11741872D01*
X8165896Y-11741872D02*
X8175420Y-11760920D01*
X8175420Y-11760920D02*
X8194468Y-11770444D01*
X8194468Y-11770444D02*
X8213515Y-11770444D01*
X8356373Y-11760920D02*
X8337325Y-11770444D01*
X8337325Y-11770444D02*
X8299230Y-11770444D01*
X8299230Y-11770444D02*
X8280182Y-11760920D01*
X8280182Y-11760920D02*
X8270658Y-11741872D01*
X8270658Y-11741872D02*
X8270658Y-11665682D01*
X8270658Y-11665682D02*
X8280182Y-11646634D01*
X8280182Y-11646634D02*
X8299230Y-11637110D01*
X8299230Y-11637110D02*
X8337325Y-11637110D01*
X8337325Y-11637110D02*
X8356373Y-11646634D01*
X8356373Y-11646634D02*
X8365896Y-11665682D01*
X8365896Y-11665682D02*
X8365896Y-11684729D01*
X8365896Y-11684729D02*
X8270658Y-11703777D01*
X8537325Y-11770444D02*
X8537325Y-11570444D01*
X8537325Y-11760920D02*
X8518277Y-11770444D01*
X8518277Y-11770444D02*
X8480182Y-11770444D01*
X8480182Y-11770444D02*
X8461135Y-11760920D01*
X8461135Y-11760920D02*
X8451611Y-11751396D01*
X8451611Y-11751396D02*
X8442087Y-11732348D01*
X8442087Y-11732348D02*
X8442087Y-11675206D01*
X8442087Y-11675206D02*
X8451611Y-11656158D01*
X8451611Y-11656158D02*
X8461135Y-11646634D01*
X8461135Y-11646634D02*
X8480182Y-11637110D01*
X8480182Y-11637110D02*
X8518277Y-11637110D01*
X8518277Y-11637110D02*
X8537325Y-11646634D01*
X8613516Y-11846634D02*
X8623039Y-11837110D01*
X8623039Y-11837110D02*
X8642087Y-11808539D01*
X8642087Y-11808539D02*
X8651611Y-11789491D01*
X8651611Y-11789491D02*
X8661135Y-11760920D01*
X8661135Y-11760920D02*
X8670658Y-11713301D01*
X8670658Y-11713301D02*
X8670658Y-11675206D01*
X8670658Y-11675206D02*
X8661135Y-11627587D01*
X8661135Y-11627587D02*
X8651611Y-11599015D01*
X8651611Y-11599015D02*
X8642087Y-11579968D01*
X8642087Y-11579968D02*
X8623039Y-11551396D01*
X8623039Y-11551396D02*
X8613516Y-11541872D01*
X1828211Y-12069671D02*
X1828211Y-11928249D01*
X1686789Y-11928249D01*
X1686789Y-12069671D01*
X1828211Y-12069671D01*
X2099229Y-11890444D02*
X2223039Y-11890444D01*
X2223039Y-11890444D02*
X2156372Y-11966634D01*
X2156372Y-11966634D02*
X2184944Y-11966634D01*
X2184944Y-11966634D02*
X2203991Y-11976158D01*
X2203991Y-11976158D02*
X2213515Y-11985682D01*
X2213515Y-11985682D02*
X2223039Y-12004729D01*
X2223039Y-12004729D02*
X2223039Y-12052348D01*
X2223039Y-12052348D02*
X2213515Y-12071396D01*
X2213515Y-12071396D02*
X2203991Y-12080920D01*
X2203991Y-12080920D02*
X2184944Y-12090444D01*
X2184944Y-12090444D02*
X2127801Y-12090444D01*
X2127801Y-12090444D02*
X2108753Y-12080920D01*
X2108753Y-12080920D02*
X2099229Y-12071396D01*
X2308753Y-12071396D02*
X2318277Y-12080920D01*
X2318277Y-12080920D02*
X2308753Y-12090444D01*
X2308753Y-12090444D02*
X2299229Y-12080920D01*
X2299229Y-12080920D02*
X2308753Y-12071396D01*
X2308753Y-12071396D02*
X2308753Y-12090444D01*
X2394467Y-11909491D02*
X2403991Y-11899968D01*
X2403991Y-11899968D02*
X2423039Y-11890444D01*
X2423039Y-11890444D02*
X2470658Y-11890444D01*
X2470658Y-11890444D02*
X2489705Y-11899968D01*
X2489705Y-11899968D02*
X2499229Y-11909491D01*
X2499229Y-11909491D02*
X2508753Y-11928539D01*
X2508753Y-11928539D02*
X2508753Y-11947587D01*
X2508753Y-11947587D02*
X2499229Y-11976158D01*
X2499229Y-11976158D02*
X2384944Y-12090444D01*
X2384944Y-12090444D02*
X2508753Y-12090444D01*
X2632563Y-11890444D02*
X2651610Y-11890444D01*
X2651610Y-11890444D02*
X2670658Y-11899968D01*
X2670658Y-11899968D02*
X2680182Y-11909491D01*
X2680182Y-11909491D02*
X2689705Y-11928539D01*
X2689705Y-11928539D02*
X2699229Y-11966634D01*
X2699229Y-11966634D02*
X2699229Y-12014253D01*
X2699229Y-12014253D02*
X2689705Y-12052348D01*
X2689705Y-12052348D02*
X2680182Y-12071396D01*
X2680182Y-12071396D02*
X2670658Y-12080920D01*
X2670658Y-12080920D02*
X2651610Y-12090444D01*
X2651610Y-12090444D02*
X2632563Y-12090444D01*
X2632563Y-12090444D02*
X2613515Y-12080920D01*
X2613515Y-12080920D02*
X2603991Y-12071396D01*
X2603991Y-12071396D02*
X2594467Y-12052348D01*
X2594467Y-12052348D02*
X2584944Y-12014253D01*
X2584944Y-12014253D02*
X2584944Y-11966634D01*
X2584944Y-11966634D02*
X2594467Y-11928539D01*
X2594467Y-11928539D02*
X2603991Y-11909491D01*
X2603991Y-11909491D02*
X2613515Y-11899968D01*
X2613515Y-11899968D02*
X2632563Y-11890444D01*
X2823039Y-11890444D02*
X2842086Y-11890444D01*
X2842086Y-11890444D02*
X2861134Y-11899968D01*
X2861134Y-11899968D02*
X2870658Y-11909491D01*
X2870658Y-11909491D02*
X2880182Y-11928539D01*
X2880182Y-11928539D02*
X2889705Y-11966634D01*
X2889705Y-11966634D02*
X2889705Y-12014253D01*
X2889705Y-12014253D02*
X2880182Y-12052348D01*
X2880182Y-12052348D02*
X2870658Y-12071396D01*
X2870658Y-12071396D02*
X2861134Y-12080920D01*
X2861134Y-12080920D02*
X2842086Y-12090444D01*
X2842086Y-12090444D02*
X2823039Y-12090444D01*
X2823039Y-12090444D02*
X2803991Y-12080920D01*
X2803991Y-12080920D02*
X2794467Y-12071396D01*
X2794467Y-12071396D02*
X2784944Y-12052348D01*
X2784944Y-12052348D02*
X2775420Y-12014253D01*
X2775420Y-12014253D02*
X2775420Y-11966634D01*
X2775420Y-11966634D02*
X2784944Y-11928539D01*
X2784944Y-11928539D02*
X2794467Y-11909491D01*
X2794467Y-11909491D02*
X2803991Y-11899968D01*
X2803991Y-11899968D02*
X2823039Y-11890444D01*
X2975420Y-12090444D02*
X2975420Y-11957110D01*
X2975420Y-11976158D02*
X2984943Y-11966634D01*
X2984943Y-11966634D02*
X3003991Y-11957110D01*
X3003991Y-11957110D02*
X3032563Y-11957110D01*
X3032563Y-11957110D02*
X3051610Y-11966634D01*
X3051610Y-11966634D02*
X3061134Y-11985682D01*
X3061134Y-11985682D02*
X3061134Y-12090444D01*
X3061134Y-11985682D02*
X3070658Y-11966634D01*
X3070658Y-11966634D02*
X3089705Y-11957110D01*
X3089705Y-11957110D02*
X3118277Y-11957110D01*
X3118277Y-11957110D02*
X3137324Y-11966634D01*
X3137324Y-11966634D02*
X3146848Y-11985682D01*
X3146848Y-11985682D02*
X3146848Y-12090444D01*
X3242086Y-12090444D02*
X3242086Y-11957110D01*
X3242086Y-11976158D02*
X3251610Y-11966634D01*
X3251610Y-11966634D02*
X3270658Y-11957110D01*
X3270658Y-11957110D02*
X3299229Y-11957110D01*
X3299229Y-11957110D02*
X3318277Y-11966634D01*
X3318277Y-11966634D02*
X3327801Y-11985682D01*
X3327801Y-11985682D02*
X3327801Y-12090444D01*
X3327801Y-11985682D02*
X3337324Y-11966634D01*
X3337324Y-11966634D02*
X3356372Y-11957110D01*
X3356372Y-11957110D02*
X3384943Y-11957110D01*
X3384943Y-11957110D02*
X3403991Y-11966634D01*
X3403991Y-11966634D02*
X3413515Y-11985682D01*
X3413515Y-11985682D02*
X3413515Y-12090444D01*
X3803991Y-11880920D02*
X3632563Y-12138063D01*
X4061134Y-11890444D02*
X4080182Y-11890444D01*
X4080182Y-11890444D02*
X4099229Y-11899968D01*
X4099229Y-11899968D02*
X4108753Y-11909491D01*
X4108753Y-11909491D02*
X4118277Y-11928539D01*
X4118277Y-11928539D02*
X4127801Y-11966634D01*
X4127801Y-11966634D02*
X4127801Y-12014253D01*
X4127801Y-12014253D02*
X4118277Y-12052348D01*
X4118277Y-12052348D02*
X4108753Y-12071396D01*
X4108753Y-12071396D02*
X4099229Y-12080920D01*
X4099229Y-12080920D02*
X4080182Y-12090444D01*
X4080182Y-12090444D02*
X4061134Y-12090444D01*
X4061134Y-12090444D02*
X4042086Y-12080920D01*
X4042086Y-12080920D02*
X4032563Y-12071396D01*
X4032563Y-12071396D02*
X4023039Y-12052348D01*
X4023039Y-12052348D02*
X4013515Y-12014253D01*
X4013515Y-12014253D02*
X4013515Y-11966634D01*
X4013515Y-11966634D02*
X4023039Y-11928539D01*
X4023039Y-11928539D02*
X4032563Y-11909491D01*
X4032563Y-11909491D02*
X4042086Y-11899968D01*
X4042086Y-11899968D02*
X4061134Y-11890444D01*
X4213515Y-12071396D02*
X4223039Y-12080920D01*
X4223039Y-12080920D02*
X4213515Y-12090444D01*
X4213515Y-12090444D02*
X4203991Y-12080920D01*
X4203991Y-12080920D02*
X4213515Y-12071396D01*
X4213515Y-12071396D02*
X4213515Y-12090444D01*
X4413515Y-12090444D02*
X4299229Y-12090444D01*
X4356372Y-12090444D02*
X4356372Y-11890444D01*
X4356372Y-11890444D02*
X4337325Y-11919015D01*
X4337325Y-11919015D02*
X4318277Y-11938063D01*
X4318277Y-11938063D02*
X4299229Y-11947587D01*
X4489706Y-11909491D02*
X4499229Y-11899968D01*
X4499229Y-11899968D02*
X4518277Y-11890444D01*
X4518277Y-11890444D02*
X4565896Y-11890444D01*
X4565896Y-11890444D02*
X4584944Y-11899968D01*
X4584944Y-11899968D02*
X4594468Y-11909491D01*
X4594468Y-11909491D02*
X4603991Y-11928539D01*
X4603991Y-11928539D02*
X4603991Y-11947587D01*
X4603991Y-11947587D02*
X4594468Y-11976158D01*
X4594468Y-11976158D02*
X4480182Y-12090444D01*
X4480182Y-12090444D02*
X4603991Y-12090444D01*
X4775420Y-11890444D02*
X4737325Y-11890444D01*
X4737325Y-11890444D02*
X4718277Y-11899968D01*
X4718277Y-11899968D02*
X4708753Y-11909491D01*
X4708753Y-11909491D02*
X4689706Y-11938063D01*
X4689706Y-11938063D02*
X4680182Y-11976158D01*
X4680182Y-11976158D02*
X4680182Y-12052348D01*
X4680182Y-12052348D02*
X4689706Y-12071396D01*
X4689706Y-12071396D02*
X4699229Y-12080920D01*
X4699229Y-12080920D02*
X4718277Y-12090444D01*
X4718277Y-12090444D02*
X4756372Y-12090444D01*
X4756372Y-12090444D02*
X4775420Y-12080920D01*
X4775420Y-12080920D02*
X4784944Y-12071396D01*
X4784944Y-12071396D02*
X4794468Y-12052348D01*
X4794468Y-12052348D02*
X4794468Y-12004729D01*
X4794468Y-12004729D02*
X4784944Y-11985682D01*
X4784944Y-11985682D02*
X4775420Y-11976158D01*
X4775420Y-11976158D02*
X4756372Y-11966634D01*
X4756372Y-11966634D02*
X4718277Y-11966634D01*
X4718277Y-11966634D02*
X4699229Y-11976158D01*
X4699229Y-11976158D02*
X4689706Y-11985682D01*
X4689706Y-11985682D02*
X4680182Y-12004729D01*
X4918277Y-11890444D02*
X4937325Y-11890444D01*
X4937325Y-11890444D02*
X4956372Y-11899968D01*
X4956372Y-11899968D02*
X4965896Y-11909491D01*
X4965896Y-11909491D02*
X4975420Y-11928539D01*
X4975420Y-11928539D02*
X4984944Y-11966634D01*
X4984944Y-11966634D02*
X4984944Y-12014253D01*
X4984944Y-12014253D02*
X4975420Y-12052348D01*
X4975420Y-12052348D02*
X4965896Y-12071396D01*
X4965896Y-12071396D02*
X4956372Y-12080920D01*
X4956372Y-12080920D02*
X4937325Y-12090444D01*
X4937325Y-12090444D02*
X4918277Y-12090444D01*
X4918277Y-12090444D02*
X4899229Y-12080920D01*
X4899229Y-12080920D02*
X4889706Y-12071396D01*
X4889706Y-12071396D02*
X4880182Y-12052348D01*
X4880182Y-12052348D02*
X4870658Y-12014253D01*
X4870658Y-12014253D02*
X4870658Y-11966634D01*
X4870658Y-11966634D02*
X4880182Y-11928539D01*
X4880182Y-11928539D02*
X4889706Y-11909491D01*
X4889706Y-11909491D02*
X4899229Y-11899968D01*
X4899229Y-11899968D02*
X4918277Y-11890444D01*
X5061134Y-11890444D02*
X5061134Y-11928539D01*
X5137325Y-11890444D02*
X5137325Y-11928539D01*
X5432563Y-12166634D02*
X5423039Y-12157110D01*
X5423039Y-12157110D02*
X5403991Y-12128539D01*
X5403991Y-12128539D02*
X5394468Y-12109491D01*
X5394468Y-12109491D02*
X5384944Y-12080920D01*
X5384944Y-12080920D02*
X5375420Y-12033301D01*
X5375420Y-12033301D02*
X5375420Y-11995206D01*
X5375420Y-11995206D02*
X5384944Y-11947587D01*
X5384944Y-11947587D02*
X5394468Y-11919015D01*
X5394468Y-11919015D02*
X5403991Y-11899968D01*
X5403991Y-11899968D02*
X5423039Y-11871396D01*
X5423039Y-11871396D02*
X5432563Y-11861872D01*
X5613515Y-12090444D02*
X5499230Y-12090444D01*
X5556372Y-12090444D02*
X5556372Y-11890444D01*
X5556372Y-11890444D02*
X5537325Y-11919015D01*
X5537325Y-11919015D02*
X5518277Y-11938063D01*
X5518277Y-11938063D02*
X5499230Y-11947587D01*
X5851610Y-12090444D02*
X5851610Y-11890444D01*
X5937325Y-12090444D02*
X5937325Y-11985682D01*
X5937325Y-11985682D02*
X5927801Y-11966634D01*
X5927801Y-11966634D02*
X5908753Y-11957110D01*
X5908753Y-11957110D02*
X5880182Y-11957110D01*
X5880182Y-11957110D02*
X5861134Y-11966634D01*
X5861134Y-11966634D02*
X5851610Y-11976158D01*
X6061134Y-12090444D02*
X6042087Y-12080920D01*
X6042087Y-12080920D02*
X6032563Y-12071396D01*
X6032563Y-12071396D02*
X6023039Y-12052348D01*
X6023039Y-12052348D02*
X6023039Y-11995206D01*
X6023039Y-11995206D02*
X6032563Y-11976158D01*
X6032563Y-11976158D02*
X6042087Y-11966634D01*
X6042087Y-11966634D02*
X6061134Y-11957110D01*
X6061134Y-11957110D02*
X6089706Y-11957110D01*
X6089706Y-11957110D02*
X6108753Y-11966634D01*
X6108753Y-11966634D02*
X6118277Y-11976158D01*
X6118277Y-11976158D02*
X6127801Y-11995206D01*
X6127801Y-11995206D02*
X6127801Y-12052348D01*
X6127801Y-12052348D02*
X6118277Y-12071396D01*
X6118277Y-12071396D02*
X6108753Y-12080920D01*
X6108753Y-12080920D02*
X6089706Y-12090444D01*
X6089706Y-12090444D02*
X6061134Y-12090444D01*
X6242087Y-12090444D02*
X6223039Y-12080920D01*
X6223039Y-12080920D02*
X6213515Y-12061872D01*
X6213515Y-12061872D02*
X6213515Y-11890444D01*
X6394468Y-12080920D02*
X6375420Y-12090444D01*
X6375420Y-12090444D02*
X6337325Y-12090444D01*
X6337325Y-12090444D02*
X6318277Y-12080920D01*
X6318277Y-12080920D02*
X6308753Y-12061872D01*
X6308753Y-12061872D02*
X6308753Y-11985682D01*
X6308753Y-11985682D02*
X6318277Y-11966634D01*
X6318277Y-11966634D02*
X6337325Y-11957110D01*
X6337325Y-11957110D02*
X6375420Y-11957110D01*
X6375420Y-11957110D02*
X6394468Y-11966634D01*
X6394468Y-11966634D02*
X6403991Y-11985682D01*
X6403991Y-11985682D02*
X6403991Y-12004729D01*
X6403991Y-12004729D02*
X6308753Y-12023777D01*
X6470658Y-12166634D02*
X6480182Y-12157110D01*
X6480182Y-12157110D02*
X6499230Y-12128539D01*
X6499230Y-12128539D02*
X6508753Y-12109491D01*
X6508753Y-12109491D02*
X6518277Y-12080920D01*
X6518277Y-12080920D02*
X6527801Y-12033301D01*
X6527801Y-12033301D02*
X6527801Y-11995206D01*
X6527801Y-11995206D02*
X6518277Y-11947587D01*
X6518277Y-11947587D02*
X6508753Y-11919015D01*
X6508753Y-11919015D02*
X6499230Y-11899968D01*
X6499230Y-11899968D02*
X6480182Y-11871396D01*
X6480182Y-11871396D02*
X6470658Y-11861872D01*
X6832563Y-12166634D02*
X6823039Y-12157110D01*
X6823039Y-12157110D02*
X6803991Y-12128539D01*
X6803991Y-12128539D02*
X6794468Y-12109491D01*
X6794468Y-12109491D02*
X6784944Y-12080920D01*
X6784944Y-12080920D02*
X6775420Y-12033301D01*
X6775420Y-12033301D02*
X6775420Y-11995206D01*
X6775420Y-11995206D02*
X6784944Y-11947587D01*
X6784944Y-11947587D02*
X6794468Y-11919015D01*
X6794468Y-11919015D02*
X6803991Y-11899968D01*
X6803991Y-11899968D02*
X6823039Y-11871396D01*
X6823039Y-11871396D02*
X6832563Y-11861872D01*
X6908753Y-11957110D02*
X6908753Y-12090444D01*
X6908753Y-11976158D02*
X6918277Y-11966634D01*
X6918277Y-11966634D02*
X6937325Y-11957110D01*
X6937325Y-11957110D02*
X6965896Y-11957110D01*
X6965896Y-11957110D02*
X6984944Y-11966634D01*
X6984944Y-11966634D02*
X6994468Y-11985682D01*
X6994468Y-11985682D02*
X6994468Y-12090444D01*
X7118277Y-12090444D02*
X7099230Y-12080920D01*
X7099230Y-12080920D02*
X7089706Y-12071396D01*
X7089706Y-12071396D02*
X7080182Y-12052348D01*
X7080182Y-12052348D02*
X7080182Y-11995206D01*
X7080182Y-11995206D02*
X7089706Y-11976158D01*
X7089706Y-11976158D02*
X7099230Y-11966634D01*
X7099230Y-11966634D02*
X7118277Y-11957110D01*
X7118277Y-11957110D02*
X7146849Y-11957110D01*
X7146849Y-11957110D02*
X7165896Y-11966634D01*
X7165896Y-11966634D02*
X7175420Y-11976158D01*
X7175420Y-11976158D02*
X7184944Y-11995206D01*
X7184944Y-11995206D02*
X7184944Y-12052348D01*
X7184944Y-12052348D02*
X7175420Y-12071396D01*
X7175420Y-12071396D02*
X7165896Y-12080920D01*
X7165896Y-12080920D02*
X7146849Y-12090444D01*
X7146849Y-12090444D02*
X7118277Y-12090444D01*
X7242087Y-11957110D02*
X7318277Y-11957110D01*
X7270658Y-11890444D02*
X7270658Y-12061872D01*
X7270658Y-12061872D02*
X7280182Y-12080920D01*
X7280182Y-12080920D02*
X7299230Y-12090444D01*
X7299230Y-12090444D02*
X7318277Y-12090444D01*
X7537325Y-11957110D02*
X7537325Y-12157110D01*
X7537325Y-11966634D02*
X7556372Y-11957110D01*
X7556372Y-11957110D02*
X7594468Y-11957110D01*
X7594468Y-11957110D02*
X7613515Y-11966634D01*
X7613515Y-11966634D02*
X7623039Y-11976158D01*
X7623039Y-11976158D02*
X7632563Y-11995206D01*
X7632563Y-11995206D02*
X7632563Y-12052348D01*
X7632563Y-12052348D02*
X7623039Y-12071396D01*
X7623039Y-12071396D02*
X7613515Y-12080920D01*
X7613515Y-12080920D02*
X7594468Y-12090444D01*
X7594468Y-12090444D02*
X7556372Y-12090444D01*
X7556372Y-12090444D02*
X7537325Y-12080920D01*
X7746849Y-12090444D02*
X7727801Y-12080920D01*
X7727801Y-12080920D02*
X7718277Y-12061872D01*
X7718277Y-12061872D02*
X7718277Y-11890444D01*
X7908753Y-12090444D02*
X7908753Y-11985682D01*
X7908753Y-11985682D02*
X7899230Y-11966634D01*
X7899230Y-11966634D02*
X7880182Y-11957110D01*
X7880182Y-11957110D02*
X7842087Y-11957110D01*
X7842087Y-11957110D02*
X7823039Y-11966634D01*
X7908753Y-12080920D02*
X7889706Y-12090444D01*
X7889706Y-12090444D02*
X7842087Y-12090444D01*
X7842087Y-12090444D02*
X7823039Y-12080920D01*
X7823039Y-12080920D02*
X7813515Y-12061872D01*
X7813515Y-12061872D02*
X7813515Y-12042825D01*
X7813515Y-12042825D02*
X7823039Y-12023777D01*
X7823039Y-12023777D02*
X7842087Y-12014253D01*
X7842087Y-12014253D02*
X7889706Y-12014253D01*
X7889706Y-12014253D02*
X7908753Y-12004729D01*
X7975420Y-11957110D02*
X8051611Y-11957110D01*
X8003992Y-11890444D02*
X8003992Y-12061872D01*
X8003992Y-12061872D02*
X8013515Y-12080920D01*
X8013515Y-12080920D02*
X8032563Y-12090444D01*
X8032563Y-12090444D02*
X8051611Y-12090444D01*
X8194468Y-12080920D02*
X8175420Y-12090444D01*
X8175420Y-12090444D02*
X8137325Y-12090444D01*
X8137325Y-12090444D02*
X8118277Y-12080920D01*
X8118277Y-12080920D02*
X8108753Y-12061872D01*
X8108753Y-12061872D02*
X8108753Y-11985682D01*
X8108753Y-11985682D02*
X8118277Y-11966634D01*
X8118277Y-11966634D02*
X8137325Y-11957110D01*
X8137325Y-11957110D02*
X8175420Y-11957110D01*
X8175420Y-11957110D02*
X8194468Y-11966634D01*
X8194468Y-11966634D02*
X8203992Y-11985682D01*
X8203992Y-11985682D02*
X8203992Y-12004729D01*
X8203992Y-12004729D02*
X8108753Y-12023777D01*
X8375420Y-12090444D02*
X8375420Y-11890444D01*
X8375420Y-12080920D02*
X8356373Y-12090444D01*
X8356373Y-12090444D02*
X8318277Y-12090444D01*
X8318277Y-12090444D02*
X8299230Y-12080920D01*
X8299230Y-12080920D02*
X8289706Y-12071396D01*
X8289706Y-12071396D02*
X8280182Y-12052348D01*
X8280182Y-12052348D02*
X8280182Y-11995206D01*
X8280182Y-11995206D02*
X8289706Y-11976158D01*
X8289706Y-11976158D02*
X8299230Y-11966634D01*
X8299230Y-11966634D02*
X8318277Y-11957110D01*
X8318277Y-11957110D02*
X8356373Y-11957110D01*
X8356373Y-11957110D02*
X8375420Y-11966634D01*
X8451611Y-12166634D02*
X8461135Y-12157110D01*
X8461135Y-12157110D02*
X8480182Y-12128539D01*
X8480182Y-12128539D02*
X8489706Y-12109491D01*
X8489706Y-12109491D02*
X8499230Y-12080920D01*
X8499230Y-12080920D02*
X8508754Y-12033301D01*
X8508754Y-12033301D02*
X8508754Y-11995206D01*
X8508754Y-11995206D02*
X8499230Y-11947587D01*
X8499230Y-11947587D02*
X8489706Y-11919015D01*
X8489706Y-11919015D02*
X8480182Y-11899968D01*
X8480182Y-11899968D02*
X8461135Y-11871396D01*
X8461135Y-11871396D02*
X8451611Y-11861872D01*
X1757500Y-12418960D02*
X1857500Y-12318960D01*
X1757500Y-12218960D01*
X1657500Y-12318960D01*
X1757500Y-12418960D01*
X2099229Y-12210444D02*
X2223039Y-12210444D01*
X2223039Y-12210444D02*
X2156372Y-12286634D01*
X2156372Y-12286634D02*
X2184944Y-12286634D01*
X2184944Y-12286634D02*
X2203991Y-12296158D01*
X2203991Y-12296158D02*
X2213515Y-12305682D01*
X2213515Y-12305682D02*
X2223039Y-12324729D01*
X2223039Y-12324729D02*
X2223039Y-12372348D01*
X2223039Y-12372348D02*
X2213515Y-12391396D01*
X2213515Y-12391396D02*
X2203991Y-12400920D01*
X2203991Y-12400920D02*
X2184944Y-12410444D01*
X2184944Y-12410444D02*
X2127801Y-12410444D01*
X2127801Y-12410444D02*
X2108753Y-12400920D01*
X2108753Y-12400920D02*
X2099229Y-12391396D01*
X2308753Y-12391396D02*
X2318277Y-12400920D01*
X2318277Y-12400920D02*
X2308753Y-12410444D01*
X2308753Y-12410444D02*
X2299229Y-12400920D01*
X2299229Y-12400920D02*
X2308753Y-12391396D01*
X2308753Y-12391396D02*
X2308753Y-12410444D01*
X2394467Y-12229491D02*
X2403991Y-12219968D01*
X2403991Y-12219968D02*
X2423039Y-12210444D01*
X2423039Y-12210444D02*
X2470658Y-12210444D01*
X2470658Y-12210444D02*
X2489705Y-12219968D01*
X2489705Y-12219968D02*
X2499229Y-12229491D01*
X2499229Y-12229491D02*
X2508753Y-12248539D01*
X2508753Y-12248539D02*
X2508753Y-12267587D01*
X2508753Y-12267587D02*
X2499229Y-12296158D01*
X2499229Y-12296158D02*
X2384944Y-12410444D01*
X2384944Y-12410444D02*
X2508753Y-12410444D01*
X2689705Y-12210444D02*
X2594467Y-12210444D01*
X2594467Y-12210444D02*
X2584944Y-12305682D01*
X2584944Y-12305682D02*
X2594467Y-12296158D01*
X2594467Y-12296158D02*
X2613515Y-12286634D01*
X2613515Y-12286634D02*
X2661134Y-12286634D01*
X2661134Y-12286634D02*
X2680182Y-12296158D01*
X2680182Y-12296158D02*
X2689705Y-12305682D01*
X2689705Y-12305682D02*
X2699229Y-12324729D01*
X2699229Y-12324729D02*
X2699229Y-12372348D01*
X2699229Y-12372348D02*
X2689705Y-12391396D01*
X2689705Y-12391396D02*
X2680182Y-12400920D01*
X2680182Y-12400920D02*
X2661134Y-12410444D01*
X2661134Y-12410444D02*
X2613515Y-12410444D01*
X2613515Y-12410444D02*
X2594467Y-12400920D01*
X2594467Y-12400920D02*
X2584944Y-12391396D01*
X2823039Y-12210444D02*
X2842086Y-12210444D01*
X2842086Y-12210444D02*
X2861134Y-12219968D01*
X2861134Y-12219968D02*
X2870658Y-12229491D01*
X2870658Y-12229491D02*
X2880182Y-12248539D01*
X2880182Y-12248539D02*
X2889705Y-12286634D01*
X2889705Y-12286634D02*
X2889705Y-12334253D01*
X2889705Y-12334253D02*
X2880182Y-12372348D01*
X2880182Y-12372348D02*
X2870658Y-12391396D01*
X2870658Y-12391396D02*
X2861134Y-12400920D01*
X2861134Y-12400920D02*
X2842086Y-12410444D01*
X2842086Y-12410444D02*
X2823039Y-12410444D01*
X2823039Y-12410444D02*
X2803991Y-12400920D01*
X2803991Y-12400920D02*
X2794467Y-12391396D01*
X2794467Y-12391396D02*
X2784944Y-12372348D01*
X2784944Y-12372348D02*
X2775420Y-12334253D01*
X2775420Y-12334253D02*
X2775420Y-12286634D01*
X2775420Y-12286634D02*
X2784944Y-12248539D01*
X2784944Y-12248539D02*
X2794467Y-12229491D01*
X2794467Y-12229491D02*
X2803991Y-12219968D01*
X2803991Y-12219968D02*
X2823039Y-12210444D01*
X2975420Y-12410444D02*
X2975420Y-12277110D01*
X2975420Y-12296158D02*
X2984943Y-12286634D01*
X2984943Y-12286634D02*
X3003991Y-12277110D01*
X3003991Y-12277110D02*
X3032563Y-12277110D01*
X3032563Y-12277110D02*
X3051610Y-12286634D01*
X3051610Y-12286634D02*
X3061134Y-12305682D01*
X3061134Y-12305682D02*
X3061134Y-12410444D01*
X3061134Y-12305682D02*
X3070658Y-12286634D01*
X3070658Y-12286634D02*
X3089705Y-12277110D01*
X3089705Y-12277110D02*
X3118277Y-12277110D01*
X3118277Y-12277110D02*
X3137324Y-12286634D01*
X3137324Y-12286634D02*
X3146848Y-12305682D01*
X3146848Y-12305682D02*
X3146848Y-12410444D01*
X3242086Y-12410444D02*
X3242086Y-12277110D01*
X3242086Y-12296158D02*
X3251610Y-12286634D01*
X3251610Y-12286634D02*
X3270658Y-12277110D01*
X3270658Y-12277110D02*
X3299229Y-12277110D01*
X3299229Y-12277110D02*
X3318277Y-12286634D01*
X3318277Y-12286634D02*
X3327801Y-12305682D01*
X3327801Y-12305682D02*
X3327801Y-12410444D01*
X3327801Y-12305682D02*
X3337324Y-12286634D01*
X3337324Y-12286634D02*
X3356372Y-12277110D01*
X3356372Y-12277110D02*
X3384943Y-12277110D01*
X3384943Y-12277110D02*
X3403991Y-12286634D01*
X3403991Y-12286634D02*
X3413515Y-12305682D01*
X3413515Y-12305682D02*
X3413515Y-12410444D01*
X3803991Y-12200920D02*
X3632563Y-12458063D01*
X4061134Y-12210444D02*
X4080182Y-12210444D01*
X4080182Y-12210444D02*
X4099229Y-12219968D01*
X4099229Y-12219968D02*
X4108753Y-12229491D01*
X4108753Y-12229491D02*
X4118277Y-12248539D01*
X4118277Y-12248539D02*
X4127801Y-12286634D01*
X4127801Y-12286634D02*
X4127801Y-12334253D01*
X4127801Y-12334253D02*
X4118277Y-12372348D01*
X4118277Y-12372348D02*
X4108753Y-12391396D01*
X4108753Y-12391396D02*
X4099229Y-12400920D01*
X4099229Y-12400920D02*
X4080182Y-12410444D01*
X4080182Y-12410444D02*
X4061134Y-12410444D01*
X4061134Y-12410444D02*
X4042086Y-12400920D01*
X4042086Y-12400920D02*
X4032563Y-12391396D01*
X4032563Y-12391396D02*
X4023039Y-12372348D01*
X4023039Y-12372348D02*
X4013515Y-12334253D01*
X4013515Y-12334253D02*
X4013515Y-12286634D01*
X4013515Y-12286634D02*
X4023039Y-12248539D01*
X4023039Y-12248539D02*
X4032563Y-12229491D01*
X4032563Y-12229491D02*
X4042086Y-12219968D01*
X4042086Y-12219968D02*
X4061134Y-12210444D01*
X4213515Y-12391396D02*
X4223039Y-12400920D01*
X4223039Y-12400920D02*
X4213515Y-12410444D01*
X4213515Y-12410444D02*
X4203991Y-12400920D01*
X4203991Y-12400920D02*
X4213515Y-12391396D01*
X4213515Y-12391396D02*
X4213515Y-12410444D01*
X4413515Y-12410444D02*
X4299229Y-12410444D01*
X4356372Y-12410444D02*
X4356372Y-12210444D01*
X4356372Y-12210444D02*
X4337325Y-12239015D01*
X4337325Y-12239015D02*
X4318277Y-12258063D01*
X4318277Y-12258063D02*
X4299229Y-12267587D01*
X4489706Y-12229491D02*
X4499229Y-12219968D01*
X4499229Y-12219968D02*
X4518277Y-12210444D01*
X4518277Y-12210444D02*
X4565896Y-12210444D01*
X4565896Y-12210444D02*
X4584944Y-12219968D01*
X4584944Y-12219968D02*
X4594468Y-12229491D01*
X4594468Y-12229491D02*
X4603991Y-12248539D01*
X4603991Y-12248539D02*
X4603991Y-12267587D01*
X4603991Y-12267587D02*
X4594468Y-12296158D01*
X4594468Y-12296158D02*
X4480182Y-12410444D01*
X4480182Y-12410444D02*
X4603991Y-12410444D01*
X4718277Y-12296158D02*
X4699229Y-12286634D01*
X4699229Y-12286634D02*
X4689706Y-12277110D01*
X4689706Y-12277110D02*
X4680182Y-12258063D01*
X4680182Y-12258063D02*
X4680182Y-12248539D01*
X4680182Y-12248539D02*
X4689706Y-12229491D01*
X4689706Y-12229491D02*
X4699229Y-12219968D01*
X4699229Y-12219968D02*
X4718277Y-12210444D01*
X4718277Y-12210444D02*
X4756372Y-12210444D01*
X4756372Y-12210444D02*
X4775420Y-12219968D01*
X4775420Y-12219968D02*
X4784944Y-12229491D01*
X4784944Y-12229491D02*
X4794468Y-12248539D01*
X4794468Y-12248539D02*
X4794468Y-12258063D01*
X4794468Y-12258063D02*
X4784944Y-12277110D01*
X4784944Y-12277110D02*
X4775420Y-12286634D01*
X4775420Y-12286634D02*
X4756372Y-12296158D01*
X4756372Y-12296158D02*
X4718277Y-12296158D01*
X4718277Y-12296158D02*
X4699229Y-12305682D01*
X4699229Y-12305682D02*
X4689706Y-12315206D01*
X4689706Y-12315206D02*
X4680182Y-12334253D01*
X4680182Y-12334253D02*
X4680182Y-12372348D01*
X4680182Y-12372348D02*
X4689706Y-12391396D01*
X4689706Y-12391396D02*
X4699229Y-12400920D01*
X4699229Y-12400920D02*
X4718277Y-12410444D01*
X4718277Y-12410444D02*
X4756372Y-12410444D01*
X4756372Y-12410444D02*
X4775420Y-12400920D01*
X4775420Y-12400920D02*
X4784944Y-12391396D01*
X4784944Y-12391396D02*
X4794468Y-12372348D01*
X4794468Y-12372348D02*
X4794468Y-12334253D01*
X4794468Y-12334253D02*
X4784944Y-12315206D01*
X4784944Y-12315206D02*
X4775420Y-12305682D01*
X4775420Y-12305682D02*
X4756372Y-12296158D01*
X4918277Y-12210444D02*
X4937325Y-12210444D01*
X4937325Y-12210444D02*
X4956372Y-12219968D01*
X4956372Y-12219968D02*
X4965896Y-12229491D01*
X4965896Y-12229491D02*
X4975420Y-12248539D01*
X4975420Y-12248539D02*
X4984944Y-12286634D01*
X4984944Y-12286634D02*
X4984944Y-12334253D01*
X4984944Y-12334253D02*
X4975420Y-12372348D01*
X4975420Y-12372348D02*
X4965896Y-12391396D01*
X4965896Y-12391396D02*
X4956372Y-12400920D01*
X4956372Y-12400920D02*
X4937325Y-12410444D01*
X4937325Y-12410444D02*
X4918277Y-12410444D01*
X4918277Y-12410444D02*
X4899229Y-12400920D01*
X4899229Y-12400920D02*
X4889706Y-12391396D01*
X4889706Y-12391396D02*
X4880182Y-12372348D01*
X4880182Y-12372348D02*
X4870658Y-12334253D01*
X4870658Y-12334253D02*
X4870658Y-12286634D01*
X4870658Y-12286634D02*
X4880182Y-12248539D01*
X4880182Y-12248539D02*
X4889706Y-12229491D01*
X4889706Y-12229491D02*
X4899229Y-12219968D01*
X4899229Y-12219968D02*
X4918277Y-12210444D01*
X5061134Y-12210444D02*
X5061134Y-12248539D01*
X5137325Y-12210444D02*
X5137325Y-12248539D01*
X5432563Y-12486634D02*
X5423039Y-12477110D01*
X5423039Y-12477110D02*
X5403991Y-12448539D01*
X5403991Y-12448539D02*
X5394468Y-12429491D01*
X5394468Y-12429491D02*
X5384944Y-12400920D01*
X5384944Y-12400920D02*
X5375420Y-12353301D01*
X5375420Y-12353301D02*
X5375420Y-12315206D01*
X5375420Y-12315206D02*
X5384944Y-12267587D01*
X5384944Y-12267587D02*
X5394468Y-12239015D01*
X5394468Y-12239015D02*
X5403991Y-12219968D01*
X5403991Y-12219968D02*
X5423039Y-12191396D01*
X5423039Y-12191396D02*
X5432563Y-12181872D01*
X5499230Y-12229491D02*
X5508753Y-12219968D01*
X5508753Y-12219968D02*
X5527801Y-12210444D01*
X5527801Y-12210444D02*
X5575420Y-12210444D01*
X5575420Y-12210444D02*
X5594468Y-12219968D01*
X5594468Y-12219968D02*
X5603991Y-12229491D01*
X5603991Y-12229491D02*
X5613515Y-12248539D01*
X5613515Y-12248539D02*
X5613515Y-12267587D01*
X5613515Y-12267587D02*
X5603991Y-12296158D01*
X5603991Y-12296158D02*
X5489706Y-12410444D01*
X5489706Y-12410444D02*
X5613515Y-12410444D01*
X5851610Y-12410444D02*
X5851610Y-12210444D01*
X5937325Y-12410444D02*
X5937325Y-12305682D01*
X5937325Y-12305682D02*
X5927801Y-12286634D01*
X5927801Y-12286634D02*
X5908753Y-12277110D01*
X5908753Y-12277110D02*
X5880182Y-12277110D01*
X5880182Y-12277110D02*
X5861134Y-12286634D01*
X5861134Y-12286634D02*
X5851610Y-12296158D01*
X6061134Y-12410444D02*
X6042087Y-12400920D01*
X6042087Y-12400920D02*
X6032563Y-12391396D01*
X6032563Y-12391396D02*
X6023039Y-12372348D01*
X6023039Y-12372348D02*
X6023039Y-12315206D01*
X6023039Y-12315206D02*
X6032563Y-12296158D01*
X6032563Y-12296158D02*
X6042087Y-12286634D01*
X6042087Y-12286634D02*
X6061134Y-12277110D01*
X6061134Y-12277110D02*
X6089706Y-12277110D01*
X6089706Y-12277110D02*
X6108753Y-12286634D01*
X6108753Y-12286634D02*
X6118277Y-12296158D01*
X6118277Y-12296158D02*
X6127801Y-12315206D01*
X6127801Y-12315206D02*
X6127801Y-12372348D01*
X6127801Y-12372348D02*
X6118277Y-12391396D01*
X6118277Y-12391396D02*
X6108753Y-12400920D01*
X6108753Y-12400920D02*
X6089706Y-12410444D01*
X6089706Y-12410444D02*
X6061134Y-12410444D01*
X6242087Y-12410444D02*
X6223039Y-12400920D01*
X6223039Y-12400920D02*
X6213515Y-12381872D01*
X6213515Y-12381872D02*
X6213515Y-12210444D01*
X6394468Y-12400920D02*
X6375420Y-12410444D01*
X6375420Y-12410444D02*
X6337325Y-12410444D01*
X6337325Y-12410444D02*
X6318277Y-12400920D01*
X6318277Y-12400920D02*
X6308753Y-12381872D01*
X6308753Y-12381872D02*
X6308753Y-12305682D01*
X6308753Y-12305682D02*
X6318277Y-12286634D01*
X6318277Y-12286634D02*
X6337325Y-12277110D01*
X6337325Y-12277110D02*
X6375420Y-12277110D01*
X6375420Y-12277110D02*
X6394468Y-12286634D01*
X6394468Y-12286634D02*
X6403991Y-12305682D01*
X6403991Y-12305682D02*
X6403991Y-12324729D01*
X6403991Y-12324729D02*
X6308753Y-12343777D01*
X6480182Y-12400920D02*
X6499230Y-12410444D01*
X6499230Y-12410444D02*
X6537325Y-12410444D01*
X6537325Y-12410444D02*
X6556372Y-12400920D01*
X6556372Y-12400920D02*
X6565896Y-12381872D01*
X6565896Y-12381872D02*
X6565896Y-12372348D01*
X6565896Y-12372348D02*
X6556372Y-12353301D01*
X6556372Y-12353301D02*
X6537325Y-12343777D01*
X6537325Y-12343777D02*
X6508753Y-12343777D01*
X6508753Y-12343777D02*
X6489706Y-12334253D01*
X6489706Y-12334253D02*
X6480182Y-12315206D01*
X6480182Y-12315206D02*
X6480182Y-12305682D01*
X6480182Y-12305682D02*
X6489706Y-12286634D01*
X6489706Y-12286634D02*
X6508753Y-12277110D01*
X6508753Y-12277110D02*
X6537325Y-12277110D01*
X6537325Y-12277110D02*
X6556372Y-12286634D01*
X6632563Y-12486634D02*
X6642087Y-12477110D01*
X6642087Y-12477110D02*
X6661134Y-12448539D01*
X6661134Y-12448539D02*
X6670658Y-12429491D01*
X6670658Y-12429491D02*
X6680182Y-12400920D01*
X6680182Y-12400920D02*
X6689706Y-12353301D01*
X6689706Y-12353301D02*
X6689706Y-12315206D01*
X6689706Y-12315206D02*
X6680182Y-12267587D01*
X6680182Y-12267587D02*
X6670658Y-12239015D01*
X6670658Y-12239015D02*
X6661134Y-12219968D01*
X6661134Y-12219968D02*
X6642087Y-12191396D01*
X6642087Y-12191396D02*
X6632563Y-12181872D01*
X6994468Y-12486634D02*
X6984944Y-12477110D01*
X6984944Y-12477110D02*
X6965896Y-12448539D01*
X6965896Y-12448539D02*
X6956372Y-12429491D01*
X6956372Y-12429491D02*
X6946849Y-12400920D01*
X6946849Y-12400920D02*
X6937325Y-12353301D01*
X6937325Y-12353301D02*
X6937325Y-12315206D01*
X6937325Y-12315206D02*
X6946849Y-12267587D01*
X6946849Y-12267587D02*
X6956372Y-12239015D01*
X6956372Y-12239015D02*
X6965896Y-12219968D01*
X6965896Y-12219968D02*
X6984944Y-12191396D01*
X6984944Y-12191396D02*
X6994468Y-12181872D01*
X7070658Y-12277110D02*
X7070658Y-12410444D01*
X7070658Y-12296158D02*
X7080182Y-12286634D01*
X7080182Y-12286634D02*
X7099230Y-12277110D01*
X7099230Y-12277110D02*
X7127801Y-12277110D01*
X7127801Y-12277110D02*
X7146849Y-12286634D01*
X7146849Y-12286634D02*
X7156372Y-12305682D01*
X7156372Y-12305682D02*
X7156372Y-12410444D01*
X7280182Y-12410444D02*
X7261134Y-12400920D01*
X7261134Y-12400920D02*
X7251611Y-12391396D01*
X7251611Y-12391396D02*
X7242087Y-12372348D01*
X7242087Y-12372348D02*
X7242087Y-12315206D01*
X7242087Y-12315206D02*
X7251611Y-12296158D01*
X7251611Y-12296158D02*
X7261134Y-12286634D01*
X7261134Y-12286634D02*
X7280182Y-12277110D01*
X7280182Y-12277110D02*
X7308753Y-12277110D01*
X7308753Y-12277110D02*
X7327801Y-12286634D01*
X7327801Y-12286634D02*
X7337325Y-12296158D01*
X7337325Y-12296158D02*
X7346849Y-12315206D01*
X7346849Y-12315206D02*
X7346849Y-12372348D01*
X7346849Y-12372348D02*
X7337325Y-12391396D01*
X7337325Y-12391396D02*
X7327801Y-12400920D01*
X7327801Y-12400920D02*
X7308753Y-12410444D01*
X7308753Y-12410444D02*
X7280182Y-12410444D01*
X7403992Y-12277110D02*
X7480182Y-12277110D01*
X7432563Y-12210444D02*
X7432563Y-12381872D01*
X7432563Y-12381872D02*
X7442087Y-12400920D01*
X7442087Y-12400920D02*
X7461134Y-12410444D01*
X7461134Y-12410444D02*
X7480182Y-12410444D01*
X7699230Y-12277110D02*
X7699230Y-12477110D01*
X7699230Y-12286634D02*
X7718277Y-12277110D01*
X7718277Y-12277110D02*
X7756373Y-12277110D01*
X7756373Y-12277110D02*
X7775420Y-12286634D01*
X7775420Y-12286634D02*
X7784944Y-12296158D01*
X7784944Y-12296158D02*
X7794468Y-12315206D01*
X7794468Y-12315206D02*
X7794468Y-12372348D01*
X7794468Y-12372348D02*
X7784944Y-12391396D01*
X7784944Y-12391396D02*
X7775420Y-12400920D01*
X7775420Y-12400920D02*
X7756373Y-12410444D01*
X7756373Y-12410444D02*
X7718277Y-12410444D01*
X7718277Y-12410444D02*
X7699230Y-12400920D01*
X7908753Y-12410444D02*
X7889706Y-12400920D01*
X7889706Y-12400920D02*
X7880182Y-12381872D01*
X7880182Y-12381872D02*
X7880182Y-12210444D01*
X8070658Y-12410444D02*
X8070658Y-12305682D01*
X8070658Y-12305682D02*
X8061134Y-12286634D01*
X8061134Y-12286634D02*
X8042087Y-12277110D01*
X8042087Y-12277110D02*
X8003992Y-12277110D01*
X8003992Y-12277110D02*
X7984944Y-12286634D01*
X8070658Y-12400920D02*
X8051611Y-12410444D01*
X8051611Y-12410444D02*
X8003992Y-12410444D01*
X8003992Y-12410444D02*
X7984944Y-12400920D01*
X7984944Y-12400920D02*
X7975420Y-12381872D01*
X7975420Y-12381872D02*
X7975420Y-12362825D01*
X7975420Y-12362825D02*
X7984944Y-12343777D01*
X7984944Y-12343777D02*
X8003992Y-12334253D01*
X8003992Y-12334253D02*
X8051611Y-12334253D01*
X8051611Y-12334253D02*
X8070658Y-12324729D01*
X8137325Y-12277110D02*
X8213515Y-12277110D01*
X8165896Y-12210444D02*
X8165896Y-12381872D01*
X8165896Y-12381872D02*
X8175420Y-12400920D01*
X8175420Y-12400920D02*
X8194468Y-12410444D01*
X8194468Y-12410444D02*
X8213515Y-12410444D01*
X8356373Y-12400920D02*
X8337325Y-12410444D01*
X8337325Y-12410444D02*
X8299230Y-12410444D01*
X8299230Y-12410444D02*
X8280182Y-12400920D01*
X8280182Y-12400920D02*
X8270658Y-12381872D01*
X8270658Y-12381872D02*
X8270658Y-12305682D01*
X8270658Y-12305682D02*
X8280182Y-12286634D01*
X8280182Y-12286634D02*
X8299230Y-12277110D01*
X8299230Y-12277110D02*
X8337325Y-12277110D01*
X8337325Y-12277110D02*
X8356373Y-12286634D01*
X8356373Y-12286634D02*
X8365896Y-12305682D01*
X8365896Y-12305682D02*
X8365896Y-12324729D01*
X8365896Y-12324729D02*
X8270658Y-12343777D01*
X8537325Y-12410444D02*
X8537325Y-12210444D01*
X8537325Y-12400920D02*
X8518277Y-12410444D01*
X8518277Y-12410444D02*
X8480182Y-12410444D01*
X8480182Y-12410444D02*
X8461135Y-12400920D01*
X8461135Y-12400920D02*
X8451611Y-12391396D01*
X8451611Y-12391396D02*
X8442087Y-12372348D01*
X8442087Y-12372348D02*
X8442087Y-12315206D01*
X8442087Y-12315206D02*
X8451611Y-12296158D01*
X8451611Y-12296158D02*
X8461135Y-12286634D01*
X8461135Y-12286634D02*
X8480182Y-12277110D01*
X8480182Y-12277110D02*
X8518277Y-12277110D01*
X8518277Y-12277110D02*
X8537325Y-12286634D01*
X8613516Y-12486634D02*
X8623039Y-12477110D01*
X8623039Y-12477110D02*
X8642087Y-12448539D01*
X8642087Y-12448539D02*
X8651611Y-12429491D01*
X8651611Y-12429491D02*
X8661135Y-12400920D01*
X8661135Y-12400920D02*
X8670658Y-12353301D01*
X8670658Y-12353301D02*
X8670658Y-12315206D01*
X8670658Y-12315206D02*
X8661135Y-12267587D01*
X8661135Y-12267587D02*
X8651611Y-12239015D01*
X8651611Y-12239015D02*
X8642087Y-12219968D01*
X8642087Y-12219968D02*
X8623039Y-12191396D01*
X8623039Y-12191396D02*
X8613516Y-12181872D01*
M02*
