EESchema Schematic File Version 4
EELAYER 30 0
EELAYER END
$Descr A4 11693 8268
encoding utf-8
Sheet 4 6
Title "OpticalEVA BOA FMCP "
Date "2022-04-26"
Rev "1.0"
Comp "Karlsruhe Institute of Technology (KIT)"
Comment1 "IPE"
Comment2 "Luis Ardila"
Comment3 ""
Comment4 ""
$EndDescr
$Comp
L power:+2V5 #PWR?
U 1 1 63B148B3
P 9950 2550
F 0 "#PWR?" H 9950 2400 50  0001 C CNN
F 1 "+2V5" H 9965 2723 50  0000 C CNN
F 2 "" H 9950 2550 50  0001 C CNN
F 3 "" H 9950 2550 50  0001 C CNN
	1    9950 2550
	1    0    0    -1  
$EndComp
$Comp
L KIT_Regulator_Switching:LTM4624EY-PBF U401
U 1 1 62EFB09A
P 5400 3300
F 0 "U401" H 6250 4290 60  0000 C CNN
F 1 "LTM4624EY-PBF" H 6250 4184 60  0000 C CNN
F 2 "Package_BGA:BGA-25_6.35x6.35mm_Layout5x5_P1.27mm" H 5400 3300 50  0001 C CNN
F 3 "https://www.analog.com/media/en/technical-documentation/data-sheets/4624fd.pdf" H 5400 3300 50  0001 C CNN
F 4 "LTM4624EY#PBF" H 5400 3300 50  0001 C CNN "manf#"
F 5 "Analog Devices Inc." H 5400 3300 50  0001 C CNN "manf"
F 6 "LTM4624EY#PBF-ND" H 5400 3300 50  0001 C CNN "digikey#"
F 7 " 906-3353" H 5400 3300 50  0001 C CNN "rs#"
	1    5400 3300
	1    0    0    -1  
$EndComp
$Comp
L Device:C C?
U 1 1 62EFB09B
P 4300 4550
AR Path="/5EF3A6E9/62EFB09B" Ref="C?"  Part="1" 
AR Path="/619269F2/62EFB09B" Ref="C?"  Part="1" 
AR Path="/619BA206/62EFB09B" Ref="C?"  Part="1" 
AR Path="/63AB152A/62EFB09B" Ref="C405"  Part="1" 
F 0 "C405" H 4185 4641 50  0000 R CNN
F 1 "0.1uF" H 4185 4550 50  0000 R CNN
F 2 "Capacitor_SMD:C_0402_1005Metric" H 4338 4400 50  0001 C CNN
F 3 "~" H 4300 4550 50  0001 C CNN
F 4 "0402, 16V" H 4185 4459 50  0000 R CNN "info"
F 5 "AVT-IPE" H 4300 4550 50  0001 C CNN "stock"
	1    4300 4550
	-1   0    0    -1  
$EndComp
$Comp
L Device:C C?
U 1 1 62EFB09C
P 7350 2800
AR Path="/5EF3A6E9/62EFB09C" Ref="C?"  Part="1" 
AR Path="/619269F2/62EFB09C" Ref="C?"  Part="1" 
AR Path="/619BA206/62EFB09C" Ref="C?"  Part="1" 
AR Path="/63AB152A/62EFB09C" Ref="C406"  Part="1" 
F 0 "C406" H 7235 2891 50  0000 R CNN
F 1 "47uF" H 7235 2800 50  0000 R CNN
F 2 "Capacitor_SMD:C_0805_2012Metric" H 7388 2650 50  0001 C CNN
F 3 "~" H 7350 2800 50  0001 C CNN
F 4 "0805, 10V" H 7235 2709 50  0000 R CNN "info"
F 5 "AVT-IPE" H 7350 2800 50  0001 C CNN "stock"
	1    7350 2800
	-1   0    0    -1  
$EndComp
$Comp
L power:GND #PWR?
U 1 1 62EFB09D
P 6400 5000
F 0 "#PWR?" H 6400 4750 50  0001 C CNN
F 1 "GND" H 6405 4827 50  0000 C CNN
F 2 "" H 6400 5000 50  0001 C CNN
F 3 "" H 6400 5000 50  0001 C CNN
	1    6400 5000
	1    0    0    -1  
$EndComp
Wire Wire Line
	6400 4700 6400 4800
Wire Wire Line
	6100 4800 6100 4700
Connection ~ 6400 4800
Wire Wire Line
	6400 4800 6400 5000
$Comp
L Device:R R405
U 1 1 62F4E6BA
P 5250 4550
F 0 "R405" H 5320 4596 50  0000 L CNN
F 1 "19.1k" H 5320 4505 50  0000 L CNN
F 2 "Resistor_SMD:R_0402_1005Metric" V 5180 4550 50  0001 C CNN
F 3 "~" H 5250 4550 50  0001 C CNN
	1    5250 4550
	1    0    0    -1  
$EndComp
$Comp
L Device:R R404
U 1 1 62F4E6BB
P 3900 4550
F 0 "R404" H 3970 4596 50  0000 L CNN
F 1 "0" H 3970 4505 50  0000 L CNN
F 2 "Resistor_SMD:R_0402_1005Metric" V 3830 4550 50  0001 C CNN
F 3 "~" H 3900 4550 50  0001 C CNN
	1    3900 4550
	1    0    0    -1  
$EndComp
$Comp
L Device:R R403
U 1 1 63AEDBF5
P 3900 3500
F 0 "R403" H 3970 3591 50  0000 L CNN
F 1 "0" H 3970 3500 50  0000 L CNN
F 2 "KIT_Resistor_SMD:R_0402_1005Metric_DNP" V 3830 3500 50  0001 C CNN
F 3 "~" H 3900 3500 50  0001 C CNN
F 4 "DNP" H 3970 3409 50  0000 L CNN "DNP"
	1    3900 3500
	1    0    0    -1  
$EndComp
NoConn ~ 5400 3900
Wire Wire Line
	3550 4000 3550 4400
Connection ~ 3550 4000
Wire Wire Line
	3900 4100 3900 4400
Connection ~ 3900 4100
Wire Wire Line
	4300 4200 4300 4400
Wire Wire Line
	5400 4300 5250 4300
Wire Wire Line
	5250 4300 5250 4400
Wire Wire Line
	3550 3300 3550 3350
Wire Wire Line
	3900 3350 3900 3300
Connection ~ 3900 3300
Wire Wire Line
	3900 3300 3550 3300
Wire Wire Line
	3900 3650 3900 4100
Wire Wire Line
	3550 3650 3550 4000
$Comp
L Device:C C?
U 1 1 62F4E6BD
P 4300 3500
AR Path="/5EF3A6E9/62F4E6BD" Ref="C?"  Part="1" 
AR Path="/619269F2/62F4E6BD" Ref="C?"  Part="1" 
AR Path="/619BA206/62F4E6BD" Ref="C?"  Part="1" 
AR Path="/63AB152A/62F4E6BD" Ref="C404"  Part="1" 
F 0 "C404" H 4185 3591 50  0000 R CNN
F 1 "1uF" H 4185 3500 50  0000 R CNN
F 2 "Capacitor_SMD:C_0402_1005Metric" H 4338 3350 50  0001 C CNN
F 3 "~" H 4300 3500 50  0001 C CNN
F 4 "0402, 16V" H 4185 3409 50  0000 R CNN "info"
F 5 "AVT-IPE" H 4300 3500 50  0001 C CNN "stock"
	1    4300 3500
	-1   0    0    -1  
$EndComp
$Comp
L power:GND #PWR?
U 1 1 62EFB0A3
P 4300 3650
F 0 "#PWR?" H 4300 3400 50  0001 C CNN
F 1 "GND" H 4305 3477 50  0000 C CNN
F 2 "" H 4300 3650 50  0001 C CNN
F 3 "" H 4300 3650 50  0001 C CNN
	1    4300 3650
	1    0    0    -1  
$EndComp
Wire Wire Line
	4300 3350 4300 3300
Connection ~ 4300 3300
Wire Wire Line
	4300 3300 3900 3300
Wire Wire Line
	3550 4700 3550 4800
Wire Wire Line
	3550 4800 3900 4800
Connection ~ 6100 4800
Wire Wire Line
	5250 4700 5250 4800
Connection ~ 5250 4800
Wire Wire Line
	5250 4800 6100 4800
Wire Wire Line
	4300 4700 4300 4800
Connection ~ 4300 4800
Wire Wire Line
	4300 4800 4900 4800
Wire Wire Line
	3900 4700 3900 4800
Connection ~ 3900 4800
Wire Wire Line
	3900 4800 4300 4800
Wire Wire Line
	5400 2800 5250 2800
Wire Wire Line
	5250 2800 5250 2700
Wire Wire Line
	5250 2600 5400 2600
Wire Wire Line
	5400 2700 5250 2700
Connection ~ 5250 2700
Wire Wire Line
	5250 2700 5250 2600
$Comp
L Device:R R401
U 1 1 62F4E6BE
P 3550 3500
F 0 "R401" H 3620 3591 50  0000 L CNN
F 1 "DNP" H 3620 3500 50  0000 L CNN
F 2 "KIT_Resistor_SMD:R_0402_1005Metric_DNP" V 3480 3500 50  0001 C CNN
F 3 "~" H 3550 3500 50  0001 C CNN
F 4 "DNP" H 3620 3409 50  0000 L CNN "DNP"
	1    3550 3500
	1    0    0    -1  
$EndComp
$Comp
L Device:R R402
U 1 1 63B0D3FD
P 3550 4550
F 0 "R402" H 3620 4641 50  0000 L CNN
F 1 "DNP" H 3620 4550 50  0000 L CNN
F 2 "KIT_Resistor_SMD:R_0402_1005Metric_DNP" V 3480 4550 50  0001 C CNN
F 3 "~" H 3550 4550 50  0001 C CNN
F 4 "DNP" H 3620 4459 50  0000 L CNN "DNP"
	1    3550 4550
	1    0    0    -1  
$EndComp
$Comp
L power:GND #PWR?
U 1 1 62F4E6C0
P 7350 2950
F 0 "#PWR?" H 7350 2700 50  0001 C CNN
F 1 "GND" H 7355 2777 50  0000 C CNN
F 2 "" H 7350 2950 50  0001 C CNN
F 3 "" H 7350 2950 50  0001 C CNN
	1    7350 2950
	1    0    0    -1  
$EndComp
Wire Wire Line
	9950 2550 9950 2600
$Comp
L Device:C C?
U 1 1 62F4E6C1
P 8000 2800
AR Path="/5EF3A6E9/62F4E6C1" Ref="C?"  Part="1" 
AR Path="/619269F2/62F4E6C1" Ref="C?"  Part="1" 
AR Path="/619BA206/62F4E6C1" Ref="C?"  Part="1" 
AR Path="/63AB152A/62F4E6C1" Ref="C407"  Part="1" 
F 0 "C407" H 7885 2891 50  0000 R CNN
F 1 "47uF" H 7885 2800 50  0000 R CNN
F 2 "Capacitor_SMD:C_0805_2012Metric" H 8038 2650 50  0001 C CNN
F 3 "~" H 8000 2800 50  0001 C CNN
F 4 "0805, 10V" H 7885 2709 50  0000 R CNN "info"
F 5 "AVT-IPE" H 8000 2800 50  0001 C CNN "stock"
	1    8000 2800
	-1   0    0    -1  
$EndComp
$Comp
L power:GND #PWR?
U 1 1 62F4E6C2
P 8000 2950
F 0 "#PWR?" H 8000 2700 50  0001 C CNN
F 1 "GND" H 8005 2777 50  0000 C CNN
F 2 "" H 8000 2950 50  0001 C CNN
F 3 "" H 8000 2950 50  0001 C CNN
	1    8000 2950
	1    0    0    -1  
$EndComp
Wire Wire Line
	8000 2650 8000 2600
Connection ~ 8000 2600
Wire Wire Line
	8000 2600 7350 2600
Wire Wire Line
	7350 2650 7350 2600
Connection ~ 7350 2600
Wire Wire Line
	7350 2600 7100 2600
Wire Wire Line
	3600 2600 4300 2600
$Comp
L Device:C C?
U 1 1 63B209AF
P 4300 2800
AR Path="/5EF3A6E9/63B209AF" Ref="C?"  Part="1" 
AR Path="/619269F2/63B209AF" Ref="C?"  Part="1" 
AR Path="/619BA206/63B209AF" Ref="C?"  Part="1" 
AR Path="/63AB152A/63B209AF" Ref="C403"  Part="1" 
F 0 "C403" H 4185 2891 50  0000 R CNN
F 1 "10uF" H 4185 2800 50  0000 R CNN
F 2 "Capacitor_SMD:C_0805_2012Metric" H 4338 2650 50  0001 C CNN
F 3 "~" H 4300 2800 50  0001 C CNN
F 4 "0805, 16V" H 4185 2709 50  0000 R CNN "info"
F 5 "AVT-IPE" H 4300 2800 50  0001 C CNN "stock"
	1    4300 2800
	-1   0    0    -1  
$EndComp
$Comp
L power:GND #PWR?
U 1 1 62EFB0AA
P 4300 2950
AR Path="/619BA206/62EFB0AA" Ref="#PWR?"  Part="1" 
AR Path="/63AB152A/62EFB0AA" Ref="#PWR?"  Part="1" 
F 0 "#PWR?" H 4300 2700 50  0001 C CNN
F 1 "GND" H 4305 2777 50  0000 C CNN
F 2 "" H 4300 2950 50  0001 C CNN
F 3 "" H 4300 2950 50  0001 C CNN
	1    4300 2950
	1    0    0    -1  
$EndComp
$Comp
L Device:C C?
U 1 1 62EFB0AB
P 3600 2800
AR Path="/5EF3A6E9/62EFB0AB" Ref="C?"  Part="1" 
AR Path="/619269F2/62EFB0AB" Ref="C?"  Part="1" 
AR Path="/619BA206/62EFB0AB" Ref="C?"  Part="1" 
AR Path="/63AB152A/62EFB0AB" Ref="C402"  Part="1" 
F 0 "C402" H 3485 2891 50  0000 R CNN
F 1 "10uF" H 3485 2800 50  0000 R CNN
F 2 "Capacitor_SMD:C_0805_2012Metric" H 3638 2650 50  0001 C CNN
F 3 "~" H 3600 2800 50  0001 C CNN
F 4 "0805, 16V" H 3485 2709 50  0000 R CNN "info"
F 5 "AVT-IPE" H 3600 2800 50  0001 C CNN "stock"
	1    3600 2800
	-1   0    0    -1  
$EndComp
$Comp
L power:GND #PWR?
U 1 1 62EFB0AC
P 3600 2950
AR Path="/619BA206/62EFB0AC" Ref="#PWR?"  Part="1" 
AR Path="/63AB152A/62EFB0AC" Ref="#PWR?"  Part="1" 
F 0 "#PWR?" H 3600 2700 50  0001 C CNN
F 1 "GND" H 3605 2777 50  0000 C CNN
F 2 "" H 3600 2950 50  0001 C CNN
F 3 "" H 3600 2950 50  0001 C CNN
	1    3600 2950
	1    0    0    -1  
$EndComp
Wire Wire Line
	4300 2650 4300 2600
Connection ~ 4300 2600
Wire Wire Line
	3600 2650 3600 2600
Wire Wire Line
	1800 2600 1800 2550
$Comp
L power:+12V #PWR?
U 1 1 62EFB0AD
P 1800 2550
F 0 "#PWR?" H 1800 2400 50  0001 C CNN
F 1 "+12V" H 1815 2723 50  0000 C CNN
F 2 "" H 1800 2550 50  0001 C CNN
F 3 "" H 1800 2550 50  0001 C CNN
	1    1800 2550
	1    0    0    -1  
$EndComp
Text HLabel 7700 4300 2    50   Output ~ 0
PG_2V5
Text Notes 500  7700 0    100  ~ 0
NOTES: \n1) PG_M2C signal is pulled up in VCU118 to 3V3, PG_3V8 is connected to it\n2) FREQ can be adjusted if other switching frequency other than 1MHz is wanted\n3) MODE tie  to  SGND to  enable  discontinuous  mode  operation at light loads.\n4) TRACK/SS: soft start capacitor\n5) FB: 19.1k for 2.5V\n6) SGND conencted to GND in a single point
$Comp
L Device:L_Core_Ferrite L?
U 1 1 6562447F
P 3200 2600
AR Path="/619BA206/6562447F" Ref="L?"  Part="1" 
AR Path="/63AB152A/6562447F" Ref="L401"  Part="1" 
F 0 "L401" V 3515 2600 50  0000 C CNN
F 1 "BLM18SG121TZ1D" V 3424 2600 50  0000 C CNN
F 2 "Inductor_SMD:L_0603_1608Metric" H 3200 2600 50  0001 C CNN
F 3 "https://www.murata.com/en-us/products/productdata/8796750610462/QNFA9122.pdf" V 3340 2600 50  0001 C CNN
F 4 "Murata Electronics" V 3200 2600 50  0001 C CNN "manf"
F 5 "BLM18SG121TZ1D" V 3200 2600 50  0001 C CNN "manf#"
F 6 "Ferrite Bead, 0603, 3A, 25mOhm, 120Ohm @ 100MHz" V 3333 2600 50  0000 C CNN "info"
F 7 "490-16660-1-ND" V 3200 2600 50  0001 C CNN "digikey#"
F 8 " 223-4927" V 3200 2600 50  0001 C CNN "rs#"
	1    3200 2600
	0    -1   -1   0   
$EndComp
Wire Wire Line
	1800 2600 2600 2600
Wire Wire Line
	3350 2600 3600 2600
Connection ~ 3600 2600
$Comp
L Device:C C?
U 1 1 62F4E6E6
P 2600 2800
AR Path="/5EF3A6E9/62F4E6E6" Ref="C?"  Part="1" 
AR Path="/619269F2/62F4E6E6" Ref="C?"  Part="1" 
AR Path="/63AB152A/62F4E6E6" Ref="C401"  Part="1" 
F 0 "C401" H 2485 2891 50  0000 R CNN
F 1 "10uF" H 2485 2800 50  0000 R CNN
F 2 "Capacitor_SMD:C_0603_1608Metric" H 2638 2650 50  0001 C CNN
F 3 "~" H 2600 2800 50  0001 C CNN
F 4 "AVT-IPE" H 2600 2800 50  0001 C CNN "stock"
F 5 "25V" H 2485 2709 50  0000 R CNN "info"
	1    2600 2800
	-1   0    0    -1  
$EndComp
$Comp
L power:GND #PWR?
U 1 1 65631C0E
P 2600 2950
AR Path="/619BA206/65631C0E" Ref="#PWR?"  Part="1" 
AR Path="/63AB152A/65631C0E" Ref="#PWR?"  Part="1" 
F 0 "#PWR?" H 2600 2700 50  0001 C CNN
F 1 "GND" H 2605 2777 50  0000 C CNN
F 2 "" H 2600 2950 50  0001 C CNN
F 3 "" H 2600 2950 50  0001 C CNN
	1    2600 2950
	1    0    0    -1  
$EndComp
Wire Wire Line
	2600 2650 2600 2600
Connection ~ 2600 2600
Wire Wire Line
	2600 2600 3050 2600
Wire Wire Line
	7100 4300 7400 4300
Text Label 4500 4100 0    50   ~ 0
MODE
Text Label 4500 4000 0    50   ~ 0
FREQ
Text Label 4500 4200 0    50   ~ 0
SS
Text Label 5250 4300 0    50   ~ 0
FB
Text Label 4600 2600 0    50   ~ 0
VIN
Wire Wire Line
	6150 4800 6100 4800
Wire Wire Line
	6400 4800 6350 4800
Text Label 5550 4800 0    50   ~ 0
SGND
$Comp
L Device:Net-Tie_2 NT401
U 1 1 63AE66CF
P 6250 4800
F 0 "NT401" H 6250 4889 50  0000 C CNN
F 1 "Net-Tie_2" H 6250 4890 50  0001 C CNN
F 2 "KIT_NetTie:NetTie-2_SMD_Pad0.3mm" H 6250 4800 50  0001 C CNN
F 3 "~" H 6250 4800 50  0001 C CNN
	1    6250 4800
	1    0    0    -1  
$EndComp
Text Label 4600 3300 0    50   ~ 0
INTVCC
$Comp
L Connector:TestPoint_Probe TP?
U 1 1 62EFB099
P 4300 2600
AR Path="/62EFB099" Ref="TP?"  Part="1" 
AR Path="/63AB152A/62EFB099" Ref="TP401"  Part="1" 
F 0 "TP401" H 4453 2701 50  0001 L CNN
F 1 "TestPoint_Probe" H 4453 2610 50  0001 L CNN
F 2 "TestPoint:TestPoint_Pad_D1.0mm" H 4500 2600 50  0001 C CNN
F 3 "~" H 4500 2600 50  0001 C CNN
	1    4300 2600
	1    0    0    -1  
$EndComp
Wire Wire Line
	4300 2600 5250 2600
Connection ~ 5250 2600
Wire Wire Line
	4300 3300 5400 3300
Wire Wire Line
	3550 4000 5400 4000
Wire Wire Line
	3900 4100 5400 4100
Wire Wire Line
	4300 4200 5400 4200
$Comp
L Device:R R406
U 1 1 62F4E694
P 4900 4550
F 0 "R406" H 4970 4641 50  0000 L CNN
F 1 "DNP" H 4970 4550 50  0000 L CNN
F 2 "KIT_Resistor_SMD:R_0402_1005Metric_DNP" V 4830 4550 50  0001 C CNN
F 3 "~" H 4900 4550 50  0001 C CNN
F 4 "DNP" H 4970 4459 50  0000 L CNN "DNP"
	1    4900 4550
	1    0    0    -1  
$EndComp
Wire Wire Line
	4900 4300 4900 4400
Wire Wire Line
	4900 4700 4900 4800
Wire Wire Line
	5250 4300 4900 4300
Connection ~ 5250 4300
Connection ~ 4900 4800
Wire Wire Line
	4900 4800 5250 4800
$Comp
L Device:R R407
U 1 1 62425530
P 7400 4050
F 0 "R407" H 7470 4141 50  0000 L CNN
F 1 "10k" H 7470 4050 50  0000 L CNN
F 2 "KIT_Resistor_SMD:R_0402_1005Metric_DNP" V 7330 4050 50  0001 C CNN
F 3 "~" H 7400 4050 50  0001 C CNN
F 4 "DNP" H 7470 3959 50  0000 L CNN "DNP"
	1    7400 4050
	1    0    0    -1  
$EndComp
Wire Wire Line
	7400 4200 7400 4300
$Comp
L power:+3V3 #PWR?
U 1 1 62429D30
P 7400 3900
AR Path="/619BA206/62429D30" Ref="#PWR?"  Part="1" 
AR Path="/63AB152A/62429D30" Ref="#PWR?"  Part="1" 
F 0 "#PWR?" H 7400 3750 50  0001 C CNN
F 1 "+3V3" H 7415 4073 50  0000 C CNN
F 2 "" H 7400 3900 50  0001 C CNN
F 3 "" H 7400 3900 50  0001 C CNN
	1    7400 3900
	1    0    0    -1  
$EndComp
Connection ~ 7400 4300
Wire Wire Line
	7400 4300 7700 4300
$Comp
L Connector:TestPoint_Probe TP?
U 1 1 63266B19
P 9500 2600
AR Path="/63266B19" Ref="TP?"  Part="1" 
AR Path="/63AB152A/63266B19" Ref="TP402"  Part="1" 
F 0 "TP402" H 9653 2701 50  0001 L CNN
F 1 "TestPoint_Probe" H 9653 2610 50  0001 L CNN
F 2 "TestPoint:TestPoint_Pad_D1.0mm" H 9700 2600 50  0001 C CNN
F 3 "~" H 9700 2600 50  0001 C CNN
	1    9500 2600
	1    0    0    -1  
$EndComp
$Comp
L Device:R R?
U 1 1 6271ABC1
P 9000 2600
AR Path="/619269F2/6271ABC1" Ref="R?"  Part="1" 
AR Path="/63AB152A/6271ABC1" Ref="R408"  Part="1" 
F 0 "R408" V 8793 2600 50  0000 C CNN
F 1 "0.1" V 8884 2600 50  0000 C CNN
F 2 "Resistor_SMD:R_1210_3225Metric" V 8930 2600 50  0001 C CNN
F 3 "~" H 9000 2600 50  0001 C CNN
	1    9000 2600
	0    1    1    0   
$EndComp
$Comp
L Device:R R?
U 1 1 6271ABC7
P 8750 2800
AR Path="/619269F2/6271ABC7" Ref="R?"  Part="1" 
AR Path="/63AB152A/6271ABC7" Ref="R409"  Part="1" 
F 0 "R409" H 8681 2846 50  0000 R CNN
F 1 "10" H 8681 2755 50  0000 R CNN
F 2 "Resistor_SMD:R_0402_1005Metric" V 8680 2800 50  0001 C CNN
F 3 "~" H 8750 2800 50  0001 C CNN
	1    8750 2800
	1    0    0    -1  
$EndComp
$Comp
L Device:R R?
U 1 1 6271ABCD
P 9250 2800
AR Path="/619269F2/6271ABCD" Ref="R?"  Part="1" 
AR Path="/63AB152A/6271ABCD" Ref="R410"  Part="1" 
F 0 "R410" H 9320 2846 50  0000 L CNN
F 1 "10" H 9320 2755 50  0000 L CNN
F 2 "Resistor_SMD:R_0402_1005Metric" V 9180 2800 50  0001 C CNN
F 3 "~" H 9250 2800 50  0001 C CNN
	1    9250 2800
	1    0    0    -1  
$EndComp
$Comp
L Device:C C?
U 1 1 6271ABD3
P 9000 3000
AR Path="/619269F2/6271ABD3" Ref="C?"  Part="1" 
AR Path="/63AB152A/6271ABD3" Ref="C408"  Part="1" 
F 0 "C408" V 9252 3000 50  0000 C CNN
F 1 "C" V 9161 3000 50  0000 C CNN
F 2 "Capacitor_SMD:C_0402_1005Metric" H 9038 2850 50  0001 C CNN
F 3 "~" H 9000 3000 50  0001 C CNN
	1    9000 3000
	0    -1   -1   0   
$EndComp
Wire Wire Line
	8850 2600 8750 2600
Wire Wire Line
	8850 3000 8750 3000
Wire Wire Line
	8750 3000 8750 2950
Wire Wire Line
	8750 2650 8750 2600
Connection ~ 8750 3000
Wire Wire Line
	9150 2600 9250 2600
Wire Wire Line
	9250 2600 9250 2650
Wire Wire Line
	9250 2950 9250 3000
Connection ~ 9250 2600
Wire Wire Line
	9150 3000 9250 3000
Connection ~ 9250 3000
Wire Wire Line
	9250 3000 9250 3200
Wire Wire Line
	9250 3200 9350 3200
Wire Wire Line
	8750 3000 8750 3300
Wire Wire Line
	8750 3300 9350 3300
Text HLabel 9350 3200 2    50   BiDi ~ 0
2V5_SNS_P
Text HLabel 9350 3300 2    50   BiDi ~ 0
2V5_SNS_N
Wire Wire Line
	9250 2600 9500 2600
Connection ~ 8750 2600
Connection ~ 9500 2600
Wire Wire Line
	9500 2600 9950 2600
Wire Wire Line
	8000 2600 8750 2600
$EndSCHEMATC
