M48
; DRILL file {KiCad 5.1.12-84ad8e8a86~92~ubuntu18.04.1} date Tue 26 Apr 2022 04:20:37 PM CEST
; FORMAT={-:-/ absolute / inch / decimal}
; #@! TF.CreationDate,2022-04-26T16:20:37+02:00
; #@! TF.GenerationSoftware,Kicad,Pcbnew,5.1.12-84ad8e8a86~92~ubuntu18.04.1
; #@! TF.FileFunction,Plated,10,12,Blind
FMAT,2
INCH
T1C0.0079
%
G90
G05
T1
X4.4104Y-3.4238
X4.4104Y-3.4738
X4.4104Y-3.8238
X4.4104Y-3.8738
X4.5104Y-3.0238
X4.5104Y-3.0738
X4.5104Y-3.2238
X4.5104Y-3.2738
X4.5604Y-3.3238
X4.5604Y-3.3738
X4.5604Y-3.7238
X4.5604Y-3.7738
X4.6104Y-3.6238
X4.6104Y-3.6738
X4.6604Y-3.7738
X4.6604Y-3.8238
X5.0604Y-3.8238
X5.0604Y-3.8738
X5.4232Y-3.7502
X5.4232Y-3.7892
T0
M30
