%FSLAX45Y45*%
G04 Gerber Fmt 4.5, Leading zero omitted, Abs format (unit mm)*
G04 Created by KiCad (PCBNEW 5.1.12-84ad8e8a86~92~ubuntu18.04.1) date 2022-04-26 16:20:36*
%MOMM*%
%LPD*%
G01*
G04 APERTURE LIST*
%TA.AperFunction,Profile*%
%ADD10C,0.200000*%
%TD*%
%ADD11C,0.200000*%
%ADD12C,0.300000*%
G04 APERTURE END LIST*
D10*
X18850000Y-5025000D02*
X18850000Y-4570000D01*
X18850000Y-9875000D02*
X18850000Y-9475000D01*
X18850000Y-9125000D02*
X18850000Y-8725000D01*
X18850000Y-8375000D02*
X18850000Y-7975000D01*
X18850000Y-10225000D02*
X18850000Y-10670000D01*
X18850000Y-5775000D02*
X18850000Y-5375000D01*
X18850000Y-7625000D02*
X18850000Y-6125000D01*
X17700000Y-4360000D02*
X17700000Y-4470000D01*
X11000000Y-4100000D02*
X16620000Y-4100000D01*
X11000000Y-5200000D02*
X11000000Y-4100000D01*
X11000000Y-10150000D02*
X11000000Y-5200000D01*
X16720000Y-4360000D02*
G75*
G02*
X16620000Y-4260000I0J100000D01*
G01*
X16620000Y-4100000D02*
X16620000Y-4260000D01*
X17800000Y-4570000D02*
G75*
G02*
X17700000Y-4470000I0J100000D01*
G01*
X17800000Y-4570000D02*
X18850000Y-4570000D01*
X16720000Y-4360000D02*
X17700000Y-4360000D01*
X13840000Y-11000000D02*
X16140000Y-11000000D01*
X11000000Y-10150000D02*
X11000000Y-11000000D01*
X16140000Y-10770000D02*
G75*
G02*
X16240000Y-10670000I100000J0D01*
G01*
X13840000Y-11000000D02*
X11000000Y-11000000D01*
X16140000Y-10770000D02*
X16140000Y-11000000D01*
X18850000Y-10670000D02*
X16240000Y-10670000D01*
D11*
X15945000Y-6145000D02*
X16055000Y-6255000D01*
X16055000Y-6145000D02*
X15945000Y-6255000D01*
X15945000Y-7845000D02*
X16055000Y-7955000D01*
X16055000Y-7845000D02*
X15945000Y-7955000D01*
X16345000Y-7845000D02*
X16455000Y-7955000D01*
X16455000Y-7845000D02*
X16345000Y-7955000D01*
X12155000Y-10272550D02*
G75*
G03*
X12155000Y-10272550I-63500J0D01*
G01*
X12460000Y-4834450D02*
G75*
G03*
X12460000Y-4834450I-63500J0D01*
G01*
X17750000Y-4660000D02*
X17750000Y-4930000D01*
X17615000Y-4795000D02*
X17885000Y-4795000D01*
X17750000Y-10315000D02*
X17750000Y-10585000D01*
X17615000Y-10450000D02*
X17885000Y-10450000D01*
D12*
X11276428Y-11475714D02*
X11276428Y-11175714D01*
X11347857Y-11175714D01*
X11390714Y-11190000D01*
X11419286Y-11218571D01*
X11433571Y-11247143D01*
X11447857Y-11304286D01*
X11447857Y-11347143D01*
X11433571Y-11404286D01*
X11419286Y-11432857D01*
X11390714Y-11461429D01*
X11347857Y-11475714D01*
X11276428Y-11475714D01*
X11576428Y-11475714D02*
X11576428Y-11275714D01*
X11576428Y-11332857D02*
X11590714Y-11304286D01*
X11605000Y-11290000D01*
X11633571Y-11275714D01*
X11662143Y-11275714D01*
X11762143Y-11475714D02*
X11762143Y-11275714D01*
X11762143Y-11175714D02*
X11747857Y-11190000D01*
X11762143Y-11204286D01*
X11776428Y-11190000D01*
X11762143Y-11175714D01*
X11762143Y-11204286D01*
X11947857Y-11475714D02*
X11919286Y-11461429D01*
X11905000Y-11432857D01*
X11905000Y-11175714D01*
X12105000Y-11475714D02*
X12076428Y-11461429D01*
X12062143Y-11432857D01*
X12062143Y-11175714D01*
X12447857Y-11475714D02*
X12447857Y-11175714D01*
X12547857Y-11390000D01*
X12647857Y-11175714D01*
X12647857Y-11475714D01*
X12919286Y-11475714D02*
X12919286Y-11318571D01*
X12905000Y-11290000D01*
X12876428Y-11275714D01*
X12819286Y-11275714D01*
X12790714Y-11290000D01*
X12919286Y-11461429D02*
X12890714Y-11475714D01*
X12819286Y-11475714D01*
X12790714Y-11461429D01*
X12776428Y-11432857D01*
X12776428Y-11404286D01*
X12790714Y-11375714D01*
X12819286Y-11361429D01*
X12890714Y-11361429D01*
X12919286Y-11347143D01*
X13062143Y-11275714D02*
X13062143Y-11575714D01*
X13062143Y-11290000D02*
X13090714Y-11275714D01*
X13147857Y-11275714D01*
X13176428Y-11290000D01*
X13190714Y-11304286D01*
X13205000Y-11332857D01*
X13205000Y-11418571D01*
X13190714Y-11447143D01*
X13176428Y-11461429D01*
X13147857Y-11475714D01*
X13090714Y-11475714D01*
X13062143Y-11461429D01*
X13333571Y-11447143D02*
X13347857Y-11461429D01*
X13333571Y-11475714D01*
X13319286Y-11461429D01*
X13333571Y-11447143D01*
X13333571Y-11475714D01*
X13333571Y-11290000D02*
X13347857Y-11304286D01*
X13333571Y-11318571D01*
X13319286Y-11304286D01*
X13333571Y-11290000D01*
X13333571Y-11318571D01*
X10880000Y-11915000D02*
X10990000Y-12025000D01*
X10990000Y-11915000D02*
X10880000Y-12025000D01*
X11433571Y-12105714D02*
X11262143Y-12105714D01*
X11347857Y-12105714D02*
X11347857Y-11805714D01*
X11319286Y-11848571D01*
X11290714Y-11877143D01*
X11262143Y-11891429D01*
X11562143Y-12077143D02*
X11576428Y-12091429D01*
X11562143Y-12105714D01*
X11547857Y-12091429D01*
X11562143Y-12077143D01*
X11562143Y-12105714D01*
X11862143Y-12105714D02*
X11690714Y-12105714D01*
X11776428Y-12105714D02*
X11776428Y-11805714D01*
X11747857Y-11848571D01*
X11719286Y-11877143D01*
X11690714Y-11891429D01*
X12047857Y-11805714D02*
X12076428Y-11805714D01*
X12105000Y-11820000D01*
X12119286Y-11834286D01*
X12133571Y-11862857D01*
X12147857Y-11920000D01*
X12147857Y-11991429D01*
X12133571Y-12048571D01*
X12119286Y-12077143D01*
X12105000Y-12091429D01*
X12076428Y-12105714D01*
X12047857Y-12105714D01*
X12019286Y-12091429D01*
X12005000Y-12077143D01*
X11990714Y-12048571D01*
X11976428Y-11991429D01*
X11976428Y-11920000D01*
X11990714Y-11862857D01*
X12005000Y-11834286D01*
X12019286Y-11820000D01*
X12047857Y-11805714D01*
X12333571Y-11805714D02*
X12362143Y-11805714D01*
X12390714Y-11820000D01*
X12405000Y-11834286D01*
X12419286Y-11862857D01*
X12433571Y-11920000D01*
X12433571Y-11991429D01*
X12419286Y-12048571D01*
X12405000Y-12077143D01*
X12390714Y-12091429D01*
X12362143Y-12105714D01*
X12333571Y-12105714D01*
X12305000Y-12091429D01*
X12290714Y-12077143D01*
X12276428Y-12048571D01*
X12262143Y-11991429D01*
X12262143Y-11920000D01*
X12276428Y-11862857D01*
X12290714Y-11834286D01*
X12305000Y-11820000D01*
X12333571Y-11805714D01*
X12562143Y-12105714D02*
X12562143Y-11905714D01*
X12562143Y-11934286D02*
X12576428Y-11920000D01*
X12605000Y-11905714D01*
X12647857Y-11905714D01*
X12676428Y-11920000D01*
X12690714Y-11948571D01*
X12690714Y-12105714D01*
X12690714Y-11948571D02*
X12705000Y-11920000D01*
X12733571Y-11905714D01*
X12776428Y-11905714D01*
X12805000Y-11920000D01*
X12819286Y-11948571D01*
X12819286Y-12105714D01*
X12962143Y-12105714D02*
X12962143Y-11905714D01*
X12962143Y-11934286D02*
X12976428Y-11920000D01*
X13005000Y-11905714D01*
X13047857Y-11905714D01*
X13076428Y-11920000D01*
X13090714Y-11948571D01*
X13090714Y-12105714D01*
X13090714Y-11948571D02*
X13105000Y-11920000D01*
X13133571Y-11905714D01*
X13176428Y-11905714D01*
X13205000Y-11920000D01*
X13219286Y-11948571D01*
X13219286Y-12105714D01*
X13805000Y-11791429D02*
X13547857Y-12177143D01*
X14190714Y-11805714D02*
X14219286Y-11805714D01*
X14247857Y-11820000D01*
X14262143Y-11834286D01*
X14276428Y-11862857D01*
X14290714Y-11920000D01*
X14290714Y-11991429D01*
X14276428Y-12048571D01*
X14262143Y-12077143D01*
X14247857Y-12091429D01*
X14219286Y-12105714D01*
X14190714Y-12105714D01*
X14162143Y-12091429D01*
X14147857Y-12077143D01*
X14133571Y-12048571D01*
X14119286Y-11991429D01*
X14119286Y-11920000D01*
X14133571Y-11862857D01*
X14147857Y-11834286D01*
X14162143Y-11820000D01*
X14190714Y-11805714D01*
X14419286Y-12077143D02*
X14433571Y-12091429D01*
X14419286Y-12105714D01*
X14405000Y-12091429D01*
X14419286Y-12077143D01*
X14419286Y-12105714D01*
X14619286Y-11805714D02*
X14647857Y-11805714D01*
X14676428Y-11820000D01*
X14690714Y-11834286D01*
X14705000Y-11862857D01*
X14719286Y-11920000D01*
X14719286Y-11991429D01*
X14705000Y-12048571D01*
X14690714Y-12077143D01*
X14676428Y-12091429D01*
X14647857Y-12105714D01*
X14619286Y-12105714D01*
X14590714Y-12091429D01*
X14576428Y-12077143D01*
X14562143Y-12048571D01*
X14547857Y-11991429D01*
X14547857Y-11920000D01*
X14562143Y-11862857D01*
X14576428Y-11834286D01*
X14590714Y-11820000D01*
X14619286Y-11805714D01*
X14976428Y-11905714D02*
X14976428Y-12105714D01*
X14905000Y-11791429D02*
X14833571Y-12005714D01*
X15019286Y-12005714D01*
X15105000Y-11805714D02*
X15290714Y-11805714D01*
X15190714Y-11920000D01*
X15233571Y-11920000D01*
X15262143Y-11934286D01*
X15276428Y-11948571D01*
X15290714Y-11977143D01*
X15290714Y-12048571D01*
X15276428Y-12077143D01*
X15262143Y-12091429D01*
X15233571Y-12105714D01*
X15147857Y-12105714D01*
X15119286Y-12091429D01*
X15105000Y-12077143D01*
X15390714Y-11805714D02*
X15576428Y-11805714D01*
X15476428Y-11920000D01*
X15519286Y-11920000D01*
X15547857Y-11934286D01*
X15562143Y-11948571D01*
X15576428Y-11977143D01*
X15576428Y-12048571D01*
X15562143Y-12077143D01*
X15547857Y-12091429D01*
X15519286Y-12105714D01*
X15433571Y-12105714D01*
X15405000Y-12091429D01*
X15390714Y-12077143D01*
X15690714Y-11805714D02*
X15690714Y-11862857D01*
X15805000Y-11805714D02*
X15805000Y-11862857D01*
X16247857Y-12220000D02*
X16233571Y-12205714D01*
X16205000Y-12162857D01*
X16190714Y-12134286D01*
X16176428Y-12091429D01*
X16162143Y-12020000D01*
X16162143Y-11962857D01*
X16176428Y-11891429D01*
X16190714Y-11848571D01*
X16205000Y-11820000D01*
X16233571Y-11777143D01*
X16247857Y-11762857D01*
X16333571Y-11805714D02*
X16519286Y-11805714D01*
X16419286Y-11920000D01*
X16462143Y-11920000D01*
X16490714Y-11934286D01*
X16505000Y-11948571D01*
X16519286Y-11977143D01*
X16519286Y-12048571D01*
X16505000Y-12077143D01*
X16490714Y-12091429D01*
X16462143Y-12105714D01*
X16376428Y-12105714D01*
X16347857Y-12091429D01*
X16333571Y-12077143D01*
X16876428Y-12105714D02*
X16876428Y-11805714D01*
X17005000Y-12105714D02*
X17005000Y-11948571D01*
X16990714Y-11920000D01*
X16962143Y-11905714D01*
X16919286Y-11905714D01*
X16890714Y-11920000D01*
X16876428Y-11934286D01*
X17190714Y-12105714D02*
X17162143Y-12091429D01*
X17147857Y-12077143D01*
X17133571Y-12048571D01*
X17133571Y-11962857D01*
X17147857Y-11934286D01*
X17162143Y-11920000D01*
X17190714Y-11905714D01*
X17233571Y-11905714D01*
X17262143Y-11920000D01*
X17276428Y-11934286D01*
X17290714Y-11962857D01*
X17290714Y-12048571D01*
X17276428Y-12077143D01*
X17262143Y-12091429D01*
X17233571Y-12105714D01*
X17190714Y-12105714D01*
X17462143Y-12105714D02*
X17433571Y-12091429D01*
X17419286Y-12062857D01*
X17419286Y-11805714D01*
X17690714Y-12091429D02*
X17662143Y-12105714D01*
X17605000Y-12105714D01*
X17576428Y-12091429D01*
X17562143Y-12062857D01*
X17562143Y-11948571D01*
X17576428Y-11920000D01*
X17605000Y-11905714D01*
X17662143Y-11905714D01*
X17690714Y-11920000D01*
X17705000Y-11948571D01*
X17705000Y-11977143D01*
X17562143Y-12005714D01*
X17819286Y-12091429D02*
X17847857Y-12105714D01*
X17905000Y-12105714D01*
X17933571Y-12091429D01*
X17947857Y-12062857D01*
X17947857Y-12048571D01*
X17933571Y-12020000D01*
X17905000Y-12005714D01*
X17862143Y-12005714D01*
X17833571Y-11991429D01*
X17819286Y-11962857D01*
X17819286Y-11948571D01*
X17833571Y-11920000D01*
X17862143Y-11905714D01*
X17905000Y-11905714D01*
X17933571Y-11920000D01*
X18047857Y-12220000D02*
X18062143Y-12205714D01*
X18090714Y-12162857D01*
X18105000Y-12134286D01*
X18119286Y-12091429D01*
X18133571Y-12020000D01*
X18133571Y-11962857D01*
X18119286Y-11891429D01*
X18105000Y-11848571D01*
X18090714Y-11820000D01*
X18062143Y-11777143D01*
X18047857Y-11762857D01*
X18590714Y-12220000D02*
X18576428Y-12205714D01*
X18547857Y-12162857D01*
X18533571Y-12134286D01*
X18519286Y-12091429D01*
X18505000Y-12020000D01*
X18505000Y-11962857D01*
X18519286Y-11891429D01*
X18533571Y-11848571D01*
X18547857Y-11820000D01*
X18576428Y-11777143D01*
X18590714Y-11762857D01*
X18705000Y-11905714D02*
X18705000Y-12105714D01*
X18705000Y-11934286D02*
X18719286Y-11920000D01*
X18747857Y-11905714D01*
X18790714Y-11905714D01*
X18819286Y-11920000D01*
X18833571Y-11948571D01*
X18833571Y-12105714D01*
X19019286Y-12105714D02*
X18990714Y-12091429D01*
X18976428Y-12077143D01*
X18962143Y-12048571D01*
X18962143Y-11962857D01*
X18976428Y-11934286D01*
X18990714Y-11920000D01*
X19019286Y-11905714D01*
X19062143Y-11905714D01*
X19090714Y-11920000D01*
X19105000Y-11934286D01*
X19119286Y-11962857D01*
X19119286Y-12048571D01*
X19105000Y-12077143D01*
X19090714Y-12091429D01*
X19062143Y-12105714D01*
X19019286Y-12105714D01*
X19205000Y-11905714D02*
X19319286Y-11905714D01*
X19247857Y-11805714D02*
X19247857Y-12062857D01*
X19262143Y-12091429D01*
X19290714Y-12105714D01*
X19319286Y-12105714D01*
X19647857Y-11905714D02*
X19647857Y-12205714D01*
X19647857Y-11920000D02*
X19676428Y-11905714D01*
X19733571Y-11905714D01*
X19762143Y-11920000D01*
X19776428Y-11934286D01*
X19790714Y-11962857D01*
X19790714Y-12048571D01*
X19776428Y-12077143D01*
X19762143Y-12091429D01*
X19733571Y-12105714D01*
X19676428Y-12105714D01*
X19647857Y-12091429D01*
X19962143Y-12105714D02*
X19933571Y-12091429D01*
X19919286Y-12062857D01*
X19919286Y-11805714D01*
X20205000Y-12105714D02*
X20205000Y-11948571D01*
X20190714Y-11920000D01*
X20162143Y-11905714D01*
X20105000Y-11905714D01*
X20076428Y-11920000D01*
X20205000Y-12091429D02*
X20176428Y-12105714D01*
X20105000Y-12105714D01*
X20076428Y-12091429D01*
X20062143Y-12062857D01*
X20062143Y-12034286D01*
X20076428Y-12005714D01*
X20105000Y-11991429D01*
X20176428Y-11991429D01*
X20205000Y-11977143D01*
X20305000Y-11905714D02*
X20419286Y-11905714D01*
X20347857Y-11805714D02*
X20347857Y-12062857D01*
X20362143Y-12091429D01*
X20390714Y-12105714D01*
X20419286Y-12105714D01*
X20633571Y-12091429D02*
X20605000Y-12105714D01*
X20547857Y-12105714D01*
X20519286Y-12091429D01*
X20505000Y-12062857D01*
X20505000Y-11948571D01*
X20519286Y-11920000D01*
X20547857Y-11905714D01*
X20605000Y-11905714D01*
X20633571Y-11920000D01*
X20647857Y-11948571D01*
X20647857Y-11977143D01*
X20505000Y-12005714D01*
X20905000Y-12105714D02*
X20905000Y-11805714D01*
X20905000Y-12091429D02*
X20876428Y-12105714D01*
X20819286Y-12105714D01*
X20790714Y-12091429D01*
X20776428Y-12077143D01*
X20762143Y-12048571D01*
X20762143Y-11962857D01*
X20776428Y-11934286D01*
X20790714Y-11920000D01*
X20819286Y-11905714D01*
X20876428Y-11905714D01*
X20905000Y-11920000D01*
X21019286Y-12220000D02*
X21033571Y-12205714D01*
X21062143Y-12162857D01*
X21076428Y-12134286D01*
X21090714Y-12091429D01*
X21105000Y-12020000D01*
X21105000Y-11962857D01*
X21090714Y-11891429D01*
X21076428Y-11848571D01*
X21062143Y-11820000D01*
X21033571Y-11777143D01*
X21019286Y-11762857D01*
X10990000Y-12366000D02*
G75*
G03*
X10990000Y-12366000I-63500J0D01*
G01*
X11433571Y-12501714D02*
X11262143Y-12501714D01*
X11347857Y-12501714D02*
X11347857Y-12201714D01*
X11319286Y-12244571D01*
X11290714Y-12273143D01*
X11262143Y-12287429D01*
X11562143Y-12473143D02*
X11576428Y-12487429D01*
X11562143Y-12501714D01*
X11547857Y-12487429D01*
X11562143Y-12473143D01*
X11562143Y-12501714D01*
X11690714Y-12230286D02*
X11705000Y-12216000D01*
X11733571Y-12201714D01*
X11805000Y-12201714D01*
X11833571Y-12216000D01*
X11847857Y-12230286D01*
X11862143Y-12258857D01*
X11862143Y-12287429D01*
X11847857Y-12330286D01*
X11676428Y-12501714D01*
X11862143Y-12501714D01*
X11962143Y-12201714D02*
X12162143Y-12201714D01*
X12033571Y-12501714D01*
X12333571Y-12201714D02*
X12362143Y-12201714D01*
X12390714Y-12216000D01*
X12405000Y-12230286D01*
X12419286Y-12258857D01*
X12433571Y-12316000D01*
X12433571Y-12387429D01*
X12419286Y-12444571D01*
X12405000Y-12473143D01*
X12390714Y-12487429D01*
X12362143Y-12501714D01*
X12333571Y-12501714D01*
X12305000Y-12487429D01*
X12290714Y-12473143D01*
X12276428Y-12444571D01*
X12262143Y-12387429D01*
X12262143Y-12316000D01*
X12276428Y-12258857D01*
X12290714Y-12230286D01*
X12305000Y-12216000D01*
X12333571Y-12201714D01*
X12562143Y-12501714D02*
X12562143Y-12301714D01*
X12562143Y-12330286D02*
X12576428Y-12316000D01*
X12605000Y-12301714D01*
X12647857Y-12301714D01*
X12676428Y-12316000D01*
X12690714Y-12344571D01*
X12690714Y-12501714D01*
X12690714Y-12344571D02*
X12705000Y-12316000D01*
X12733571Y-12301714D01*
X12776428Y-12301714D01*
X12805000Y-12316000D01*
X12819286Y-12344571D01*
X12819286Y-12501714D01*
X12962143Y-12501714D02*
X12962143Y-12301714D01*
X12962143Y-12330286D02*
X12976428Y-12316000D01*
X13005000Y-12301714D01*
X13047857Y-12301714D01*
X13076428Y-12316000D01*
X13090714Y-12344571D01*
X13090714Y-12501714D01*
X13090714Y-12344571D02*
X13105000Y-12316000D01*
X13133571Y-12301714D01*
X13176428Y-12301714D01*
X13205000Y-12316000D01*
X13219286Y-12344571D01*
X13219286Y-12501714D01*
X13805000Y-12187429D02*
X13547857Y-12573143D01*
X14190714Y-12201714D02*
X14219286Y-12201714D01*
X14247857Y-12216000D01*
X14262143Y-12230286D01*
X14276428Y-12258857D01*
X14290714Y-12316000D01*
X14290714Y-12387429D01*
X14276428Y-12444571D01*
X14262143Y-12473143D01*
X14247857Y-12487429D01*
X14219286Y-12501714D01*
X14190714Y-12501714D01*
X14162143Y-12487429D01*
X14147857Y-12473143D01*
X14133571Y-12444571D01*
X14119286Y-12387429D01*
X14119286Y-12316000D01*
X14133571Y-12258857D01*
X14147857Y-12230286D01*
X14162143Y-12216000D01*
X14190714Y-12201714D01*
X14419286Y-12473143D02*
X14433571Y-12487429D01*
X14419286Y-12501714D01*
X14405000Y-12487429D01*
X14419286Y-12473143D01*
X14419286Y-12501714D01*
X14619286Y-12201714D02*
X14647857Y-12201714D01*
X14676428Y-12216000D01*
X14690714Y-12230286D01*
X14705000Y-12258857D01*
X14719286Y-12316000D01*
X14719286Y-12387429D01*
X14705000Y-12444571D01*
X14690714Y-12473143D01*
X14676428Y-12487429D01*
X14647857Y-12501714D01*
X14619286Y-12501714D01*
X14590714Y-12487429D01*
X14576428Y-12473143D01*
X14562143Y-12444571D01*
X14547857Y-12387429D01*
X14547857Y-12316000D01*
X14562143Y-12258857D01*
X14576428Y-12230286D01*
X14590714Y-12216000D01*
X14619286Y-12201714D01*
X14990714Y-12201714D02*
X14847857Y-12201714D01*
X14833571Y-12344571D01*
X14847857Y-12330286D01*
X14876428Y-12316000D01*
X14947857Y-12316000D01*
X14976428Y-12330286D01*
X14990714Y-12344571D01*
X15005000Y-12373143D01*
X15005000Y-12444571D01*
X14990714Y-12473143D01*
X14976428Y-12487429D01*
X14947857Y-12501714D01*
X14876428Y-12501714D01*
X14847857Y-12487429D01*
X14833571Y-12473143D01*
X15190714Y-12201714D02*
X15219286Y-12201714D01*
X15247857Y-12216000D01*
X15262143Y-12230286D01*
X15276428Y-12258857D01*
X15290714Y-12316000D01*
X15290714Y-12387429D01*
X15276428Y-12444571D01*
X15262143Y-12473143D01*
X15247857Y-12487429D01*
X15219286Y-12501714D01*
X15190714Y-12501714D01*
X15162143Y-12487429D01*
X15147857Y-12473143D01*
X15133571Y-12444571D01*
X15119286Y-12387429D01*
X15119286Y-12316000D01*
X15133571Y-12258857D01*
X15147857Y-12230286D01*
X15162143Y-12216000D01*
X15190714Y-12201714D01*
X15476428Y-12201714D02*
X15505000Y-12201714D01*
X15533571Y-12216000D01*
X15547857Y-12230286D01*
X15562143Y-12258857D01*
X15576428Y-12316000D01*
X15576428Y-12387429D01*
X15562143Y-12444571D01*
X15547857Y-12473143D01*
X15533571Y-12487429D01*
X15505000Y-12501714D01*
X15476428Y-12501714D01*
X15447857Y-12487429D01*
X15433571Y-12473143D01*
X15419286Y-12444571D01*
X15405000Y-12387429D01*
X15405000Y-12316000D01*
X15419286Y-12258857D01*
X15433571Y-12230286D01*
X15447857Y-12216000D01*
X15476428Y-12201714D01*
X15690714Y-12201714D02*
X15690714Y-12258857D01*
X15805000Y-12201714D02*
X15805000Y-12258857D01*
X16247857Y-12616000D02*
X16233571Y-12601714D01*
X16205000Y-12558857D01*
X16190714Y-12530286D01*
X16176428Y-12487429D01*
X16162143Y-12416000D01*
X16162143Y-12358857D01*
X16176428Y-12287429D01*
X16190714Y-12244571D01*
X16205000Y-12216000D01*
X16233571Y-12173143D01*
X16247857Y-12158857D01*
X16347857Y-12230286D02*
X16362143Y-12216000D01*
X16390714Y-12201714D01*
X16462143Y-12201714D01*
X16490714Y-12216000D01*
X16505000Y-12230286D01*
X16519286Y-12258857D01*
X16519286Y-12287429D01*
X16505000Y-12330286D01*
X16333571Y-12501714D01*
X16519286Y-12501714D01*
X16876428Y-12501714D02*
X16876428Y-12201714D01*
X17005000Y-12501714D02*
X17005000Y-12344571D01*
X16990714Y-12316000D01*
X16962143Y-12301714D01*
X16919286Y-12301714D01*
X16890714Y-12316000D01*
X16876428Y-12330286D01*
X17190714Y-12501714D02*
X17162143Y-12487429D01*
X17147857Y-12473143D01*
X17133571Y-12444571D01*
X17133571Y-12358857D01*
X17147857Y-12330286D01*
X17162143Y-12316000D01*
X17190714Y-12301714D01*
X17233571Y-12301714D01*
X17262143Y-12316000D01*
X17276428Y-12330286D01*
X17290714Y-12358857D01*
X17290714Y-12444571D01*
X17276428Y-12473143D01*
X17262143Y-12487429D01*
X17233571Y-12501714D01*
X17190714Y-12501714D01*
X17462143Y-12501714D02*
X17433571Y-12487429D01*
X17419286Y-12458857D01*
X17419286Y-12201714D01*
X17690714Y-12487429D02*
X17662143Y-12501714D01*
X17605000Y-12501714D01*
X17576428Y-12487429D01*
X17562143Y-12458857D01*
X17562143Y-12344571D01*
X17576428Y-12316000D01*
X17605000Y-12301714D01*
X17662143Y-12301714D01*
X17690714Y-12316000D01*
X17705000Y-12344571D01*
X17705000Y-12373143D01*
X17562143Y-12401714D01*
X17819286Y-12487429D02*
X17847857Y-12501714D01*
X17905000Y-12501714D01*
X17933571Y-12487429D01*
X17947857Y-12458857D01*
X17947857Y-12444571D01*
X17933571Y-12416000D01*
X17905000Y-12401714D01*
X17862143Y-12401714D01*
X17833571Y-12387429D01*
X17819286Y-12358857D01*
X17819286Y-12344571D01*
X17833571Y-12316000D01*
X17862143Y-12301714D01*
X17905000Y-12301714D01*
X17933571Y-12316000D01*
X18047857Y-12616000D02*
X18062143Y-12601714D01*
X18090714Y-12558857D01*
X18105000Y-12530286D01*
X18119286Y-12487429D01*
X18133571Y-12416000D01*
X18133571Y-12358857D01*
X18119286Y-12287429D01*
X18105000Y-12244571D01*
X18090714Y-12216000D01*
X18062143Y-12173143D01*
X18047857Y-12158857D01*
X18590714Y-12616000D02*
X18576428Y-12601714D01*
X18547857Y-12558857D01*
X18533571Y-12530286D01*
X18519286Y-12487429D01*
X18505000Y-12416000D01*
X18505000Y-12358857D01*
X18519286Y-12287429D01*
X18533571Y-12244571D01*
X18547857Y-12216000D01*
X18576428Y-12173143D01*
X18590714Y-12158857D01*
X18705000Y-12301714D02*
X18705000Y-12501714D01*
X18705000Y-12330286D02*
X18719286Y-12316000D01*
X18747857Y-12301714D01*
X18790714Y-12301714D01*
X18819286Y-12316000D01*
X18833571Y-12344571D01*
X18833571Y-12501714D01*
X19019286Y-12501714D02*
X18990714Y-12487429D01*
X18976428Y-12473143D01*
X18962143Y-12444571D01*
X18962143Y-12358857D01*
X18976428Y-12330286D01*
X18990714Y-12316000D01*
X19019286Y-12301714D01*
X19062143Y-12301714D01*
X19090714Y-12316000D01*
X19105000Y-12330286D01*
X19119286Y-12358857D01*
X19119286Y-12444571D01*
X19105000Y-12473143D01*
X19090714Y-12487429D01*
X19062143Y-12501714D01*
X19019286Y-12501714D01*
X19205000Y-12301714D02*
X19319286Y-12301714D01*
X19247857Y-12201714D02*
X19247857Y-12458857D01*
X19262143Y-12487429D01*
X19290714Y-12501714D01*
X19319286Y-12501714D01*
X19647857Y-12301714D02*
X19647857Y-12601714D01*
X19647857Y-12316000D02*
X19676428Y-12301714D01*
X19733571Y-12301714D01*
X19762143Y-12316000D01*
X19776428Y-12330286D01*
X19790714Y-12358857D01*
X19790714Y-12444571D01*
X19776428Y-12473143D01*
X19762143Y-12487429D01*
X19733571Y-12501714D01*
X19676428Y-12501714D01*
X19647857Y-12487429D01*
X19962143Y-12501714D02*
X19933571Y-12487429D01*
X19919286Y-12458857D01*
X19919286Y-12201714D01*
X20205000Y-12501714D02*
X20205000Y-12344571D01*
X20190714Y-12316000D01*
X20162143Y-12301714D01*
X20105000Y-12301714D01*
X20076428Y-12316000D01*
X20205000Y-12487429D02*
X20176428Y-12501714D01*
X20105000Y-12501714D01*
X20076428Y-12487429D01*
X20062143Y-12458857D01*
X20062143Y-12430286D01*
X20076428Y-12401714D01*
X20105000Y-12387429D01*
X20176428Y-12387429D01*
X20205000Y-12373143D01*
X20305000Y-12301714D02*
X20419286Y-12301714D01*
X20347857Y-12201714D02*
X20347857Y-12458857D01*
X20362143Y-12487429D01*
X20390714Y-12501714D01*
X20419286Y-12501714D01*
X20633571Y-12487429D02*
X20605000Y-12501714D01*
X20547857Y-12501714D01*
X20519286Y-12487429D01*
X20505000Y-12458857D01*
X20505000Y-12344571D01*
X20519286Y-12316000D01*
X20547857Y-12301714D01*
X20605000Y-12301714D01*
X20633571Y-12316000D01*
X20647857Y-12344571D01*
X20647857Y-12373143D01*
X20505000Y-12401714D01*
X20905000Y-12501714D02*
X20905000Y-12201714D01*
X20905000Y-12487429D02*
X20876428Y-12501714D01*
X20819286Y-12501714D01*
X20790714Y-12487429D01*
X20776428Y-12473143D01*
X20762143Y-12444571D01*
X20762143Y-12358857D01*
X20776428Y-12330286D01*
X20790714Y-12316000D01*
X20819286Y-12301714D01*
X20876428Y-12301714D01*
X20905000Y-12316000D01*
X21019286Y-12616000D02*
X21033571Y-12601714D01*
X21062143Y-12558857D01*
X21076428Y-12530286D01*
X21090714Y-12487429D01*
X21105000Y-12416000D01*
X21105000Y-12358857D01*
X21090714Y-12287429D01*
X21076428Y-12244571D01*
X21062143Y-12216000D01*
X21033571Y-12173143D01*
X21019286Y-12158857D01*
X10855000Y-12627000D02*
X10855000Y-12897000D01*
X10720000Y-12762000D02*
X10990000Y-12762000D01*
X11262143Y-12626286D02*
X11276428Y-12612000D01*
X11305000Y-12597714D01*
X11376428Y-12597714D01*
X11405000Y-12612000D01*
X11419286Y-12626286D01*
X11433571Y-12654857D01*
X11433571Y-12683429D01*
X11419286Y-12726286D01*
X11247857Y-12897714D01*
X11433571Y-12897714D01*
X11562143Y-12869143D02*
X11576428Y-12883429D01*
X11562143Y-12897714D01*
X11547857Y-12883429D01*
X11562143Y-12869143D01*
X11562143Y-12897714D01*
X11676428Y-12597714D02*
X11876428Y-12597714D01*
X11747857Y-12897714D01*
X12047857Y-12597714D02*
X12076428Y-12597714D01*
X12105000Y-12612000D01*
X12119286Y-12626286D01*
X12133571Y-12654857D01*
X12147857Y-12712000D01*
X12147857Y-12783429D01*
X12133571Y-12840571D01*
X12119286Y-12869143D01*
X12105000Y-12883429D01*
X12076428Y-12897714D01*
X12047857Y-12897714D01*
X12019286Y-12883429D01*
X12005000Y-12869143D01*
X11990714Y-12840571D01*
X11976428Y-12783429D01*
X11976428Y-12712000D01*
X11990714Y-12654857D01*
X12005000Y-12626286D01*
X12019286Y-12612000D01*
X12047857Y-12597714D01*
X12333571Y-12597714D02*
X12362143Y-12597714D01*
X12390714Y-12612000D01*
X12405000Y-12626286D01*
X12419286Y-12654857D01*
X12433571Y-12712000D01*
X12433571Y-12783429D01*
X12419286Y-12840571D01*
X12405000Y-12869143D01*
X12390714Y-12883429D01*
X12362143Y-12897714D01*
X12333571Y-12897714D01*
X12305000Y-12883429D01*
X12290714Y-12869143D01*
X12276428Y-12840571D01*
X12262143Y-12783429D01*
X12262143Y-12712000D01*
X12276428Y-12654857D01*
X12290714Y-12626286D01*
X12305000Y-12612000D01*
X12333571Y-12597714D01*
X12562143Y-12897714D02*
X12562143Y-12697714D01*
X12562143Y-12726286D02*
X12576428Y-12712000D01*
X12605000Y-12697714D01*
X12647857Y-12697714D01*
X12676428Y-12712000D01*
X12690714Y-12740571D01*
X12690714Y-12897714D01*
X12690714Y-12740571D02*
X12705000Y-12712000D01*
X12733571Y-12697714D01*
X12776428Y-12697714D01*
X12805000Y-12712000D01*
X12819286Y-12740571D01*
X12819286Y-12897714D01*
X12962143Y-12897714D02*
X12962143Y-12697714D01*
X12962143Y-12726286D02*
X12976428Y-12712000D01*
X13005000Y-12697714D01*
X13047857Y-12697714D01*
X13076428Y-12712000D01*
X13090714Y-12740571D01*
X13090714Y-12897714D01*
X13090714Y-12740571D02*
X13105000Y-12712000D01*
X13133571Y-12697714D01*
X13176428Y-12697714D01*
X13205000Y-12712000D01*
X13219286Y-12740571D01*
X13219286Y-12897714D01*
X13805000Y-12583429D02*
X13547857Y-12969143D01*
X14190714Y-12597714D02*
X14219286Y-12597714D01*
X14247857Y-12612000D01*
X14262143Y-12626286D01*
X14276428Y-12654857D01*
X14290714Y-12712000D01*
X14290714Y-12783429D01*
X14276428Y-12840571D01*
X14262143Y-12869143D01*
X14247857Y-12883429D01*
X14219286Y-12897714D01*
X14190714Y-12897714D01*
X14162143Y-12883429D01*
X14147857Y-12869143D01*
X14133571Y-12840571D01*
X14119286Y-12783429D01*
X14119286Y-12712000D01*
X14133571Y-12654857D01*
X14147857Y-12626286D01*
X14162143Y-12612000D01*
X14190714Y-12597714D01*
X14419286Y-12869143D02*
X14433571Y-12883429D01*
X14419286Y-12897714D01*
X14405000Y-12883429D01*
X14419286Y-12869143D01*
X14419286Y-12897714D01*
X14719286Y-12897714D02*
X14547857Y-12897714D01*
X14633571Y-12897714D02*
X14633571Y-12597714D01*
X14605000Y-12640571D01*
X14576428Y-12669143D01*
X14547857Y-12683429D01*
X14905000Y-12597714D02*
X14933571Y-12597714D01*
X14962143Y-12612000D01*
X14976428Y-12626286D01*
X14990714Y-12654857D01*
X15005000Y-12712000D01*
X15005000Y-12783429D01*
X14990714Y-12840571D01*
X14976428Y-12869143D01*
X14962143Y-12883429D01*
X14933571Y-12897714D01*
X14905000Y-12897714D01*
X14876428Y-12883429D01*
X14862143Y-12869143D01*
X14847857Y-12840571D01*
X14833571Y-12783429D01*
X14833571Y-12712000D01*
X14847857Y-12654857D01*
X14862143Y-12626286D01*
X14876428Y-12612000D01*
X14905000Y-12597714D01*
X15262143Y-12597714D02*
X15205000Y-12597714D01*
X15176428Y-12612000D01*
X15162143Y-12626286D01*
X15133571Y-12669143D01*
X15119286Y-12726286D01*
X15119286Y-12840571D01*
X15133571Y-12869143D01*
X15147857Y-12883429D01*
X15176428Y-12897714D01*
X15233571Y-12897714D01*
X15262143Y-12883429D01*
X15276428Y-12869143D01*
X15290714Y-12840571D01*
X15290714Y-12769143D01*
X15276428Y-12740571D01*
X15262143Y-12726286D01*
X15233571Y-12712000D01*
X15176428Y-12712000D01*
X15147857Y-12726286D01*
X15133571Y-12740571D01*
X15119286Y-12769143D01*
X15390714Y-12597714D02*
X15576428Y-12597714D01*
X15476428Y-12712000D01*
X15519286Y-12712000D01*
X15547857Y-12726286D01*
X15562143Y-12740571D01*
X15576428Y-12769143D01*
X15576428Y-12840571D01*
X15562143Y-12869143D01*
X15547857Y-12883429D01*
X15519286Y-12897714D01*
X15433571Y-12897714D01*
X15405000Y-12883429D01*
X15390714Y-12869143D01*
X15690714Y-12597714D02*
X15690714Y-12654857D01*
X15805000Y-12597714D02*
X15805000Y-12654857D01*
X16247857Y-13012000D02*
X16233571Y-12997714D01*
X16205000Y-12954857D01*
X16190714Y-12926286D01*
X16176428Y-12883429D01*
X16162143Y-12812000D01*
X16162143Y-12754857D01*
X16176428Y-12683429D01*
X16190714Y-12640571D01*
X16205000Y-12612000D01*
X16233571Y-12569143D01*
X16247857Y-12554857D01*
X16347857Y-12626286D02*
X16362143Y-12612000D01*
X16390714Y-12597714D01*
X16462143Y-12597714D01*
X16490714Y-12612000D01*
X16505000Y-12626286D01*
X16519286Y-12654857D01*
X16519286Y-12683429D01*
X16505000Y-12726286D01*
X16333571Y-12897714D01*
X16519286Y-12897714D01*
X16876428Y-12897714D02*
X16876428Y-12597714D01*
X17005000Y-12897714D02*
X17005000Y-12740571D01*
X16990714Y-12712000D01*
X16962143Y-12697714D01*
X16919286Y-12697714D01*
X16890714Y-12712000D01*
X16876428Y-12726286D01*
X17190714Y-12897714D02*
X17162143Y-12883429D01*
X17147857Y-12869143D01*
X17133571Y-12840571D01*
X17133571Y-12754857D01*
X17147857Y-12726286D01*
X17162143Y-12712000D01*
X17190714Y-12697714D01*
X17233571Y-12697714D01*
X17262143Y-12712000D01*
X17276428Y-12726286D01*
X17290714Y-12754857D01*
X17290714Y-12840571D01*
X17276428Y-12869143D01*
X17262143Y-12883429D01*
X17233571Y-12897714D01*
X17190714Y-12897714D01*
X17462143Y-12897714D02*
X17433571Y-12883429D01*
X17419286Y-12854857D01*
X17419286Y-12597714D01*
X17690714Y-12883429D02*
X17662143Y-12897714D01*
X17605000Y-12897714D01*
X17576428Y-12883429D01*
X17562143Y-12854857D01*
X17562143Y-12740571D01*
X17576428Y-12712000D01*
X17605000Y-12697714D01*
X17662143Y-12697714D01*
X17690714Y-12712000D01*
X17705000Y-12740571D01*
X17705000Y-12769143D01*
X17562143Y-12797714D01*
X17819286Y-12883429D02*
X17847857Y-12897714D01*
X17905000Y-12897714D01*
X17933571Y-12883429D01*
X17947857Y-12854857D01*
X17947857Y-12840571D01*
X17933571Y-12812000D01*
X17905000Y-12797714D01*
X17862143Y-12797714D01*
X17833571Y-12783429D01*
X17819286Y-12754857D01*
X17819286Y-12740571D01*
X17833571Y-12712000D01*
X17862143Y-12697714D01*
X17905000Y-12697714D01*
X17933571Y-12712000D01*
X18047857Y-13012000D02*
X18062143Y-12997714D01*
X18090714Y-12954857D01*
X18105000Y-12926286D01*
X18119286Y-12883429D01*
X18133571Y-12812000D01*
X18133571Y-12754857D01*
X18119286Y-12683429D01*
X18105000Y-12640571D01*
X18090714Y-12612000D01*
X18062143Y-12569143D01*
X18047857Y-12554857D01*
X18590714Y-13012000D02*
X18576428Y-12997714D01*
X18547857Y-12954857D01*
X18533571Y-12926286D01*
X18519286Y-12883429D01*
X18505000Y-12812000D01*
X18505000Y-12754857D01*
X18519286Y-12683429D01*
X18533571Y-12640571D01*
X18547857Y-12612000D01*
X18576428Y-12569143D01*
X18590714Y-12554857D01*
X18705000Y-12697714D02*
X18705000Y-12897714D01*
X18705000Y-12726286D02*
X18719286Y-12712000D01*
X18747857Y-12697714D01*
X18790714Y-12697714D01*
X18819286Y-12712000D01*
X18833571Y-12740571D01*
X18833571Y-12897714D01*
X19019286Y-12897714D02*
X18990714Y-12883429D01*
X18976428Y-12869143D01*
X18962143Y-12840571D01*
X18962143Y-12754857D01*
X18976428Y-12726286D01*
X18990714Y-12712000D01*
X19019286Y-12697714D01*
X19062143Y-12697714D01*
X19090714Y-12712000D01*
X19105000Y-12726286D01*
X19119286Y-12754857D01*
X19119286Y-12840571D01*
X19105000Y-12869143D01*
X19090714Y-12883429D01*
X19062143Y-12897714D01*
X19019286Y-12897714D01*
X19205000Y-12697714D02*
X19319286Y-12697714D01*
X19247857Y-12597714D02*
X19247857Y-12854857D01*
X19262143Y-12883429D01*
X19290714Y-12897714D01*
X19319286Y-12897714D01*
X19647857Y-12697714D02*
X19647857Y-12997714D01*
X19647857Y-12712000D02*
X19676428Y-12697714D01*
X19733571Y-12697714D01*
X19762143Y-12712000D01*
X19776428Y-12726286D01*
X19790714Y-12754857D01*
X19790714Y-12840571D01*
X19776428Y-12869143D01*
X19762143Y-12883429D01*
X19733571Y-12897714D01*
X19676428Y-12897714D01*
X19647857Y-12883429D01*
X19962143Y-12897714D02*
X19933571Y-12883429D01*
X19919286Y-12854857D01*
X19919286Y-12597714D01*
X20205000Y-12897714D02*
X20205000Y-12740571D01*
X20190714Y-12712000D01*
X20162143Y-12697714D01*
X20105000Y-12697714D01*
X20076428Y-12712000D01*
X20205000Y-12883429D02*
X20176428Y-12897714D01*
X20105000Y-12897714D01*
X20076428Y-12883429D01*
X20062143Y-12854857D01*
X20062143Y-12826286D01*
X20076428Y-12797714D01*
X20105000Y-12783429D01*
X20176428Y-12783429D01*
X20205000Y-12769143D01*
X20305000Y-12697714D02*
X20419286Y-12697714D01*
X20347857Y-12597714D02*
X20347857Y-12854857D01*
X20362143Y-12883429D01*
X20390714Y-12897714D01*
X20419286Y-12897714D01*
X20633571Y-12883429D02*
X20605000Y-12897714D01*
X20547857Y-12897714D01*
X20519286Y-12883429D01*
X20505000Y-12854857D01*
X20505000Y-12740571D01*
X20519286Y-12712000D01*
X20547857Y-12697714D01*
X20605000Y-12697714D01*
X20633571Y-12712000D01*
X20647857Y-12740571D01*
X20647857Y-12769143D01*
X20505000Y-12797714D01*
X20905000Y-12897714D02*
X20905000Y-12597714D01*
X20905000Y-12883429D02*
X20876428Y-12897714D01*
X20819286Y-12897714D01*
X20790714Y-12883429D01*
X20776428Y-12869143D01*
X20762143Y-12840571D01*
X20762143Y-12754857D01*
X20776428Y-12726286D01*
X20790714Y-12712000D01*
X20819286Y-12697714D01*
X20876428Y-12697714D01*
X20905000Y-12712000D01*
X21019286Y-13012000D02*
X21033571Y-12997714D01*
X21062143Y-12954857D01*
X21076428Y-12926286D01*
X21090714Y-12883429D01*
X21105000Y-12812000D01*
X21105000Y-12754857D01*
X21090714Y-12683429D01*
X21076428Y-12640571D01*
X21062143Y-12612000D01*
X21033571Y-12569143D01*
X21019286Y-12554857D01*
M02*
