EESchema Schematic File Version 4
EELAYER 30 0
EELAYER END
$Descr A3 16535 11693
encoding utf-8
Sheet 5 6
Title "OpticalEVA BOA FMCP "
Date "2022-04-26"
Rev "1.0"
Comp "Karlsruhe Institute of Technology (KIT)"
Comment1 "IPE"
Comment2 "Luis Ardila"
Comment3 ""
Comment4 ""
$EndDescr
Wire Bus Line
	1300 1150 1450 1150
Wire Bus Line
	1300 1050 1450 1050
Wire Bus Line
	1300 850  1450 850 
Wire Bus Line
	1300 750  1450 750 
Text HLabel 1300 1150 0    50   Input ~ 0
TX_P[0..23]
Text HLabel 1300 1050 0    50   Input ~ 0
TX_N[0..23]
Text HLabel 1300 850  0    50   Output ~ 0
RX_P[0..23]
Text HLabel 1300 750  0    50   Output ~ 0
RX_N[0..23]
$Comp
L power:GND #PWR?
U 1 1 6192CF53
P 14550 5250
AR Path="/619BA206/6192CF53" Ref="#PWR?"  Part="1" 
AR Path="/61957F95/6192CF53" Ref="#PWR?"  Part="1" 
F 0 "#PWR?" H 14550 5000 50  0001 C CNN
F 1 "GND" H 14555 5077 50  0000 C CNN
F 2 "" H 14550 5250 50  0001 C CNN
F 3 "" H 14550 5250 50  0001 C CNN
	1    14550 5250
	1    0    0    -1  
$EndComp
Wire Wire Line
	14550 5050 14550 5250
Connection ~ 14550 5050
Wire Wire Line
	14400 5050 14550 5050
Wire Wire Line
	14550 4950 14550 5050
Connection ~ 14550 4950
Wire Wire Line
	14400 4950 14550 4950
Wire Wire Line
	14550 4850 14550 4950
Connection ~ 14550 4850
Wire Wire Line
	14400 4850 14550 4850
Wire Wire Line
	14550 4750 14550 4850
Connection ~ 14550 4750
Wire Wire Line
	14400 4750 14550 4750
Wire Wire Line
	14550 4650 14550 4750
Connection ~ 14550 4650
Wire Wire Line
	14400 4650 14550 4650
Wire Wire Line
	14550 4550 14550 4650
Connection ~ 14550 4550
Wire Wire Line
	14400 4550 14550 4550
Wire Wire Line
	14550 4450 14550 4550
Connection ~ 14550 4450
Wire Wire Line
	14400 4450 14550 4450
Wire Wire Line
	14550 4350 14550 4450
Connection ~ 14550 4350
Wire Wire Line
	14400 4350 14550 4350
Wire Wire Line
	14550 4250 14550 4350
Connection ~ 14550 4250
Wire Wire Line
	14400 4250 14550 4250
Wire Wire Line
	14550 4150 14550 4250
Connection ~ 14550 4150
Wire Wire Line
	14400 4150 14550 4150
Wire Wire Line
	14550 4050 14550 4150
Connection ~ 14550 4050
Wire Wire Line
	14400 4050 14550 4050
Wire Wire Line
	14550 3950 14550 4050
Connection ~ 14550 3950
Wire Wire Line
	14400 3950 14550 3950
Wire Wire Line
	14550 3850 14550 3950
Connection ~ 14550 3850
Wire Wire Line
	14400 3850 14550 3850
Wire Wire Line
	14550 3750 14550 3850
Connection ~ 14550 3750
Wire Wire Line
	14400 3750 14550 3750
Wire Wire Line
	14550 3650 14550 3750
Connection ~ 14550 3650
Wire Wire Line
	14400 3650 14550 3650
Wire Wire Line
	14550 3550 14550 3650
Connection ~ 14550 3550
Wire Wire Line
	14400 3550 14550 3550
Wire Wire Line
	14550 3450 14550 3550
Connection ~ 14550 3450
Wire Wire Line
	14400 3450 14550 3450
Wire Wire Line
	14550 3350 14550 3450
Connection ~ 14550 3350
Wire Wire Line
	14400 3350 14550 3350
Wire Wire Line
	14550 3250 14550 3350
Connection ~ 14550 3250
Wire Wire Line
	14400 3250 14550 3250
Wire Wire Line
	14550 3150 14550 3250
Connection ~ 14550 3150
Wire Wire Line
	14400 3150 14550 3150
Wire Wire Line
	14550 3050 14550 3150
Connection ~ 14550 3050
Wire Wire Line
	14400 3050 14550 3050
Wire Wire Line
	14550 2950 14550 3050
Connection ~ 14550 2950
Wire Wire Line
	14400 2950 14550 2950
Wire Wire Line
	14550 2850 14550 2950
Connection ~ 14550 2850
Wire Wire Line
	14400 2850 14550 2850
Wire Wire Line
	14550 2750 14550 2850
Connection ~ 14550 2750
Wire Wire Line
	14400 2750 14550 2750
Wire Wire Line
	14550 2650 14550 2750
Connection ~ 14550 2650
Wire Wire Line
	14400 2650 14550 2650
Wire Wire Line
	14550 2550 14550 2650
Connection ~ 14550 2550
Wire Wire Line
	14400 2550 14550 2550
Wire Wire Line
	14550 2450 14550 2550
Connection ~ 14550 2450
Wire Wire Line
	14400 2450 14550 2450
Wire Wire Line
	14550 2350 14550 2450
Connection ~ 14550 2350
Wire Wire Line
	14400 2350 14550 2350
Wire Wire Line
	14550 2250 14550 2350
Connection ~ 14550 2250
Wire Wire Line
	14400 2250 14550 2250
Wire Wire Line
	14550 2150 14550 2250
Connection ~ 14550 2150
Wire Wire Line
	14400 2150 14550 2150
Wire Wire Line
	14550 2050 14550 2150
Connection ~ 14550 2050
Wire Wire Line
	14400 2050 14550 2050
Wire Wire Line
	14550 1950 14550 2050
Connection ~ 14550 1950
Wire Wire Line
	14400 1950 14550 1950
Wire Wire Line
	14550 1850 14550 1950
Connection ~ 14550 1850
Wire Wire Line
	14400 1850 14550 1850
Wire Wire Line
	14550 1750 14550 1850
Connection ~ 14550 1750
Wire Wire Line
	14400 1750 14550 1750
Wire Wire Line
	14550 1650 14550 1750
Connection ~ 14550 1650
Wire Wire Line
	14400 1650 14550 1650
Wire Wire Line
	14550 1550 14550 1650
Connection ~ 14550 1550
Wire Wire Line
	14400 1550 14550 1550
Wire Wire Line
	14550 1450 14550 1550
Wire Wire Line
	14550 1350 14550 1450
Connection ~ 14550 1450
Wire Wire Line
	14400 1450 14550 1450
Wire Wire Line
	14400 1350 14550 1350
Text Label 14500 7950 2    50   ~ 0
TX_N11
Text Label 14500 8350 2    50   ~ 0
TX_N9
Text Label 14500 6750 2    50   ~ 0
TX_N6
Text Label 14500 6550 2    50   ~ 0
TX_N5
Text Label 14500 8550 2    50   ~ 0
TX_N0
Text Label 14500 7850 2    50   ~ 0
TX_P11
Text Label 14500 8250 2    50   ~ 0
TX_P9
Text Label 14500 6650 2    50   ~ 0
TX_P6
Text Label 14500 6450 2    50   ~ 0
TX_P5
Text Label 14500 8450 2    50   ~ 0
TX_P0
Text Label 9500 6850 0    50   ~ 0
RX_P11
Text Label 9500 7850 0    50   ~ 0
RX_P10
Text Label 9500 8650 0    50   ~ 0
RX_P9
Text Label 9500 7650 0    50   ~ 0
RX_P8
Text Label 9500 7450 0    50   ~ 0
RX_P7
Text Label 9500 6450 0    50   ~ 0
RX_P6
Text Label 9500 6650 0    50   ~ 0
RX_P5
Text Label 9500 7050 0    50   ~ 0
RX_P4
Text Label 9500 8050 0    50   ~ 0
RX_P2
Text Label 9500 8450 0    50   ~ 0
RX_P1
Text Label 9500 8250 0    50   ~ 0
RX_P0
Text Label 9500 6950 0    50   ~ 0
RX_N11
Text Label 9500 7950 0    50   ~ 0
RX_N10
Text Label 9500 8750 0    50   ~ 0
RX_N9
Text Label 9500 7750 0    50   ~ 0
RX_N8
Text Label 9500 7550 0    50   ~ 0
RX_N7
Text Label 9500 6550 0    50   ~ 0
RX_N6
Text Label 9500 6750 0    50   ~ 0
RX_N5
Text Label 9500 7150 0    50   ~ 0
RX_N4
Text Label 9500 8150 0    50   ~ 0
RX_N2
Text Label 9500 8550 0    50   ~ 0
RX_N1
Text Label 9500 8350 0    50   ~ 0
RX_N0
$Comp
L KIT_Connector:Finisar_BOA25 U501
U 2 1 6192CAA3
P 13200 1350
AR Path="/619BA206/6192CAA3" Ref="U501"  Part="2" 
AR Path="/61957F95/6192CAA3" Ref="U3"  Part="2" 
F 0 "U501" H 13800 1640 60  0000 C CNN
F 1 "Finisar_BOA25" H 13800 1534 60  0000 C CNN
F 2 "KIT_Connector:Finisar_BOA25" H 13300 1500 50  0001 C CNN
F 3 "" H 13200 1350 50  0001 C CNN
	2    13200 1350
	1    0    0    -1  
$EndComp
Text Notes 550  11100 0    100  ~ 0
NOTES:\n1) Phase match the different tial pairs to within 100um skew\n2) Maintain more than 0.3mm clearance between trace and \nadjunct pads as wel ll as greater than 1.0mm clearance between adjacent high speed lines.\n3) Target 100 Ohm differeential impedance\n4) Add 100nF AC coupling capacitors on each of the differential pairs\n5) Use inductors with DC resistance of less than 0.1 Ohms.\n6) Power Consumption is 3V3 @ 1 A and 2V5 @ 3A\n9) SN74AVC4T774RSV A high on DIR allows data transmission from An to Bn \nand a low on DIR allows data transmission from Bto A when OE is set to low.
$Comp
L KIT_Connector:Finisar_BOA25 U501
U 1 1 6192B28C
P 11400 6450
AR Path="/619BA206/6192B28C" Ref="U501"  Part="1" 
AR Path="/61957F95/6192B28C" Ref="U3"  Part="1" 
F 0 "U501" H 12000 6740 60  0000 C CNN
F 1 "Finisar_BOA25" H 12000 6634 60  0000 C CNN
F 2 "KIT_Connector:Finisar_BOA25" H 11500 6600 50  0001 C CNN
F 3 "" H 11400 6450 50  0001 C CNN
	1    11400 6450
	1    0    0    -1  
$EndComp
Wire Wire Line
	12600 7850 13600 7850
Wire Wire Line
	12600 7950 13000 7950
Wire Wire Line
	12600 8250 13600 8250
Wire Wire Line
	12600 8350 13000 8350
Wire Wire Line
	12600 6650 13600 6650
Wire Wire Line
	12600 6750 13000 6750
Wire Wire Line
	12600 6450 13600 6450
Wire Wire Line
	12600 6550 13000 6550
Wire Wire Line
	12600 8450 13600 8450
Wire Wire Line
	12600 8550 13000 8550
$Comp
L Device:C C570
U 1 1 61C3F8D5
P 13750 8450
F 0 "C570" V 13700 8550 50  0000 L CNN
F 1 "0.1uF" V 13700 8350 50  0000 R CNN
F 2 "Capacitor_SMD:C_0201_0603Metric" H 13788 8300 50  0001 C CNN
F 3 "~" H 13750 8450 50  0001 C CNN
F 4 "185-1596" H 13750 8450 50  0001 C CNN "rs#"
F 5 "0201, 25V, X5R, 10%" V 13590 8450 50  0001 C CNN "info"
F 6 "Luis" H 13750 8450 50  0001 C CNN "stock"
	1    13750 8450
	0    1    -1   0   
$EndComp
$Comp
L Device:C C572
U 1 1 61C3F8DE
P 13150 8550
F 0 "C572" V 13100 8650 50  0000 L CNN
F 1 "0.1uF" V 13100 8450 50  0000 R CNN
F 2 "Capacitor_SMD:C_0201_0603Metric" H 13188 8400 50  0001 C CNN
F 3 "~" H 13150 8550 50  0001 C CNN
F 4 "185-1596" H 13150 8550 50  0001 C CNN "rs#"
F 5 "0201, 25V, X5R, 10%" V 12990 8550 50  0001 C CNN "info"
F 6 "Luis" H 13150 8550 50  0001 C CNN "stock"
	1    13150 8550
	0    1    -1   0   
$EndComp
$Comp
L Device:C C532
U 1 1 61C3F90B
P 13150 6550
F 0 "C532" V 13100 6650 50  0000 L CNN
F 1 "0.1uF" V 13100 6450 50  0000 R CNN
F 2 "Capacitor_SMD:C_0201_0603Metric" H 13188 6400 50  0001 C CNN
F 3 "~" H 13150 6550 50  0001 C CNN
F 4 "185-1596" H 13150 6550 50  0001 C CNN "rs#"
F 5 "0201, 25V, X5R, 10%" V 12990 6550 50  0001 C CNN "info"
F 6 "Luis" H 13150 6550 50  0001 C CNN "stock"
	1    13150 6550
	0    1    -1   0   
$EndComp
$Comp
L Device:C C536
U 1 1 61C3F914
P 13150 6750
F 0 "C536" V 13100 6850 50  0000 L CNN
F 1 "0.1uF" V 13100 6650 50  0000 R CNN
F 2 "Capacitor_SMD:C_0201_0603Metric" H 13188 6600 50  0001 C CNN
F 3 "~" H 13150 6750 50  0001 C CNN
F 4 "185-1596" H 13150 6750 50  0001 C CNN "rs#"
F 5 "0201, 25V, X5R, 10%" V 12990 6750 50  0001 C CNN "info"
F 6 "Luis" H 13150 6750 50  0001 C CNN "stock"
	1    13150 6750
	0    1    -1   0   
$EndComp
$Comp
L Device:C C568
U 1 1 61C3F92F
P 13150 8350
F 0 "C568" V 13100 8450 50  0000 L CNN
F 1 "0.1uF" V 13100 8250 50  0000 R CNN
F 2 "Capacitor_SMD:C_0201_0603Metric" H 13188 8200 50  0001 C CNN
F 3 "~" H 13150 8350 50  0001 C CNN
F 4 "185-1596" H 13150 8350 50  0001 C CNN "rs#"
F 5 "0201, 25V, X5R, 10%" V 12990 8350 50  0001 C CNN "info"
F 6 "Luis" H 13150 8350 50  0001 C CNN "stock"
	1    13150 8350
	0    1    -1   0   
$EndComp
$Comp
L Device:C C560
U 1 1 61C3F941
P 13150 7950
F 0 "C560" V 13100 8050 50  0000 L CNN
F 1 "0.1uF" V 13100 7850 50  0000 R CNN
F 2 "Capacitor_SMD:C_0201_0603Metric" H 13188 7800 50  0001 C CNN
F 3 "~" H 13150 7950 50  0001 C CNN
F 4 "185-1596" H 13150 7950 50  0001 C CNN "rs#"
F 5 "0201, 25V, X5R, 10%" V 12990 7950 50  0001 C CNN "info"
F 6 "Luis" H 13150 7950 50  0001 C CNN "stock"
	1    13150 7950
	0    1    -1   0   
$EndComp
$Comp
L Device:C C530
U 1 1 61C3F96E
P 13750 6450
F 0 "C530" V 13700 6550 50  0000 L CNN
F 1 "0.1uF" V 13700 6350 50  0000 R CNN
F 2 "Capacitor_SMD:C_0201_0603Metric" H 13788 6300 50  0001 C CNN
F 3 "~" H 13750 6450 50  0001 C CNN
F 4 "185-1596" H 13750 6450 50  0001 C CNN "rs#"
F 5 "0201, 25V, X5R, 10%" V 13900 6450 50  0000 C CNN "info"
F 6 "Luis" H 13750 6450 50  0001 C CNN "stock"
	1    13750 6450
	0    1    -1   0   
$EndComp
$Comp
L Device:C C534
U 1 1 61C3F977
P 13750 6650
F 0 "C534" V 13700 6750 50  0000 L CNN
F 1 "0.1uF" V 13700 6550 50  0000 R CNN
F 2 "Capacitor_SMD:C_0201_0603Metric" H 13788 6500 50  0001 C CNN
F 3 "~" H 13750 6650 50  0001 C CNN
F 4 "185-1596" H 13750 6650 50  0001 C CNN "rs#"
F 5 "0201, 25V, X5R, 10%" V 13590 6650 50  0001 C CNN "info"
F 6 "Luis" H 13750 6650 50  0001 C CNN "stock"
	1    13750 6650
	0    1    -1   0   
$EndComp
$Comp
L Device:C C566
U 1 1 61C3F993
P 13750 8250
F 0 "C566" V 13700 8350 50  0000 L CNN
F 1 "0.1uF" V 13700 8150 50  0000 R CNN
F 2 "Capacitor_SMD:C_0201_0603Metric" H 13788 8100 50  0001 C CNN
F 3 "~" H 13750 8250 50  0001 C CNN
F 4 "185-1596" H 13750 8250 50  0001 C CNN "rs#"
F 5 "0201, 25V, X5R, 10%" V 13590 8250 50  0001 C CNN "info"
F 6 "Luis" H 13750 8250 50  0001 C CNN "stock"
	1    13750 8250
	0    1    -1   0   
$EndComp
$Comp
L Device:C C558
U 1 1 61C3F9A5
P 13750 7850
F 0 "C558" V 13700 7950 50  0000 L CNN
F 1 "0.1uF" V 13700 7750 50  0000 R CNN
F 2 "Capacitor_SMD:C_0201_0603Metric" H 13788 7700 50  0001 C CNN
F 3 "~" H 13750 7850 50  0001 C CNN
F 4 "185-1596" H 13750 7850 50  0001 C CNN "rs#"
F 5 "0201, 25V, X5R, 10%" V 13590 7850 50  0001 C CNN "info"
F 6 "Luis" H 13750 7850 50  0001 C CNN "stock"
	1    13750 7850
	0    1    -1   0   
$EndComp
Wire Wire Line
	13900 8450 14500 8450
Wire Wire Line
	13300 8550 14500 8550
Wire Wire Line
	13300 6550 14500 6550
Wire Wire Line
	13300 6750 14500 6750
Wire Wire Line
	13300 8350 14500 8350
Wire Wire Line
	13300 7950 14500 7950
Wire Wire Line
	13900 6450 14500 6450
Wire Wire Line
	13900 6650 14500 6650
Wire Wire Line
	13900 8250 14500 8250
Wire Wire Line
	13900 7850 14500 7850
Wire Wire Line
	9500 6850 10750 6850
Wire Wire Line
	9500 6950 10150 6950
Wire Wire Line
	9500 7850 10750 7850
Wire Wire Line
	9500 7950 10150 7950
Wire Wire Line
	9500 8650 10750 8650
Wire Wire Line
	9500 8750 10150 8750
Wire Wire Line
	9500 7650 10750 7650
Wire Wire Line
	9500 7750 10150 7750
Wire Wire Line
	9500 7550 10150 7550
Wire Wire Line
	9500 6450 10750 6450
Wire Wire Line
	9500 6550 10150 6550
Wire Wire Line
	9500 6650 10750 6650
Wire Wire Line
	9500 6750 10150 6750
Wire Wire Line
	9500 7050 10750 7050
Wire Wire Line
	9500 7150 10150 7150
Wire Wire Line
	9500 8050 10750 8050
Wire Wire Line
	9500 8150 10150 8150
Wire Wire Line
	9500 8450 10750 8450
Wire Wire Line
	9500 8550 10150 8550
Wire Wire Line
	9500 8250 10750 8250
Wire Wire Line
	9500 8350 10150 8350
$Comp
L Device:C C565
U 1 1 61C61909
P 10900 8250
F 0 "C565" V 10850 8350 50  0000 L CNN
F 1 "0.1uF" V 10850 8150 50  0000 R CNN
F 2 "Capacitor_SMD:C_0201_0603Metric" H 10938 8100 50  0001 C CNN
F 3 "~" H 10900 8250 50  0001 C CNN
F 4 "185-1596" H 10900 8250 50  0001 C CNN "rs#"
F 5 "0201, 25V, X5R, 10%" V 10740 8250 50  0001 C CNN "info"
F 6 "Luis" H 10900 8250 50  0001 C CNN "stock"
	1    10900 8250
	0    1    -1   0   
$EndComp
Wire Wire Line
	11050 8250 11400 8250
Wire Wire Line
	10450 8350 11400 8350
$Comp
L Device:C C567
U 1 1 61C61914
P 10300 8350
F 0 "C567" V 10250 8450 50  0000 L CNN
F 1 "0.1uF" V 10250 8250 50  0000 R CNN
F 2 "Capacitor_SMD:C_0201_0603Metric" H 10338 8200 50  0001 C CNN
F 3 "~" H 10300 8350 50  0001 C CNN
F 4 "185-1596" H 10300 8350 50  0001 C CNN "rs#"
F 5 "0201, 25V, X5R, 10%" V 10140 8350 50  0001 C CNN "info"
F 6 "Luis" H 10300 8350 50  0001 C CNN "stock"
	1    10300 8350
	0    1    -1   0   
$EndComp
$Comp
L Device:C C571
U 1 1 61C6191D
P 10300 8550
F 0 "C571" V 10250 8650 50  0000 L CNN
F 1 "0.1uF" V 10250 8450 50  0000 R CNN
F 2 "Capacitor_SMD:C_0201_0603Metric" H 10338 8400 50  0001 C CNN
F 3 "~" H 10300 8550 50  0001 C CNN
F 4 "185-1596" H 10300 8550 50  0001 C CNN "rs#"
F 5 "0201, 25V, X5R, 10%" V 10140 8550 50  0001 C CNN "info"
F 6 "Luis" H 10300 8550 50  0001 C CNN "stock"
	1    10300 8550
	0    1    -1   0   
$EndComp
Wire Wire Line
	10450 8550 11400 8550
$Comp
L Device:C C563
U 1 1 61C61927
P 10300 8150
F 0 "C563" V 10250 8250 50  0000 L CNN
F 1 "0.1uF" V 10250 8050 50  0000 R CNN
F 2 "Capacitor_SMD:C_0201_0603Metric" H 10338 8000 50  0001 C CNN
F 3 "~" H 10300 8150 50  0001 C CNN
F 4 "185-1596" H 10300 8150 50  0001 C CNN "rs#"
F 5 "0201, 25V, X5R, 10%" V 10140 8150 50  0001 C CNN "info"
F 6 "Luis" H 10300 8150 50  0001 C CNN "stock"
	1    10300 8150
	0    1    -1   0   
$EndComp
Wire Wire Line
	10450 8150 11400 8150
$Comp
L Device:C C543
U 1 1 61C6193B
P 10300 7150
F 0 "C543" V 10250 7250 50  0000 L CNN
F 1 "0.1uF" V 10250 7050 50  0000 R CNN
F 2 "Capacitor_SMD:C_0201_0603Metric" H 10338 7000 50  0001 C CNN
F 3 "~" H 10300 7150 50  0001 C CNN
F 4 "185-1596" H 10300 7150 50  0001 C CNN "rs#"
F 5 "0201, 25V, X5R, 10%" V 10140 7150 50  0001 C CNN "info"
F 6 "Luis" H 10300 7150 50  0001 C CNN "stock"
	1    10300 7150
	0    1    -1   0   
$EndComp
Wire Wire Line
	10450 7150 11400 7150
$Comp
L Device:C C535
U 1 1 61C61945
P 10300 6750
F 0 "C535" V 10250 6850 50  0000 L CNN
F 1 "0.1uF" V 10250 6650 50  0000 R CNN
F 2 "Capacitor_SMD:C_0201_0603Metric" H 10338 6600 50  0001 C CNN
F 3 "~" H 10300 6750 50  0001 C CNN
F 4 "185-1596" H 10300 6750 50  0001 C CNN "rs#"
F 5 "0201, 25V, X5R, 10%" V 10140 6750 50  0001 C CNN "info"
F 6 "Luis" H 10300 6750 50  0001 C CNN "stock"
	1    10300 6750
	0    1    -1   0   
$EndComp
Wire Wire Line
	10450 6750 11400 6750
$Comp
L Device:C C531
U 1 1 61C6194F
P 10300 6550
F 0 "C531" V 10250 6650 50  0000 L CNN
F 1 "0.1uF" V 10250 6450 50  0000 R CNN
F 2 "Capacitor_SMD:C_0201_0603Metric" H 10338 6400 50  0001 C CNN
F 3 "~" H 10300 6550 50  0001 C CNN
F 4 "185-1596" H 10300 6550 50  0001 C CNN "rs#"
F 5 "0201, 25V, X5R, 10%" V 10140 6550 50  0001 C CNN "info"
F 6 "Luis" H 10300 6550 50  0001 C CNN "stock"
	1    10300 6550
	0    1    -1   0   
$EndComp
Wire Wire Line
	10450 6550 11400 6550
$Comp
L Device:C C551
U 1 1 61C61959
P 10300 7550
F 0 "C551" V 10250 7650 50  0000 L CNN
F 1 "0.1uF" V 10250 7450 50  0000 R CNN
F 2 "Capacitor_SMD:C_0201_0603Metric" H 10338 7400 50  0001 C CNN
F 3 "~" H 10300 7550 50  0001 C CNN
F 4 "185-1596" H 10300 7550 50  0001 C CNN "rs#"
F 5 "0201, 25V, X5R, 10%" V 10140 7550 50  0001 C CNN "info"
F 6 "Luis" H 10300 7550 50  0001 C CNN "stock"
	1    10300 7550
	0    1    -1   0   
$EndComp
Wire Wire Line
	10450 7550 11400 7550
$Comp
L Device:C C555
U 1 1 61C61963
P 10300 7750
F 0 "C555" V 10250 7850 50  0000 L CNN
F 1 "0.1uF" V 10250 7650 50  0000 R CNN
F 2 "Capacitor_SMD:C_0201_0603Metric" H 10338 7600 50  0001 C CNN
F 3 "~" H 10300 7750 50  0001 C CNN
F 4 "185-1596" H 10300 7750 50  0001 C CNN "rs#"
F 5 "0201, 25V, X5R, 10%" V 10140 7750 50  0001 C CNN "info"
F 6 "Luis" H 10300 7750 50  0001 C CNN "stock"
	1    10300 7750
	0    1    -1   0   
$EndComp
Wire Wire Line
	10450 7750 11400 7750
$Comp
L Device:C C575
U 1 1 61C6196D
P 10300 8750
F 0 "C575" V 10250 8850 50  0000 L CNN
F 1 "0.1uF" V 10250 8650 50  0000 R CNN
F 2 "Capacitor_SMD:C_0201_0603Metric" H 10338 8600 50  0001 C CNN
F 3 "~" H 10300 8750 50  0001 C CNN
F 4 "185-1596" H 10300 8750 50  0001 C CNN "rs#"
F 5 "0201, 25V, X5R, 10%" V 10140 8750 50  0001 C CNN "info"
F 6 "Luis" H 10300 8750 50  0001 C CNN "stock"
	1    10300 8750
	0    1    -1   0   
$EndComp
Wire Wire Line
	10450 8750 11400 8750
$Comp
L Device:C C559
U 1 1 61C61977
P 10300 7950
F 0 "C559" V 10250 8050 50  0000 L CNN
F 1 "0.1uF" V 10250 7850 50  0000 R CNN
F 2 "Capacitor_SMD:C_0201_0603Metric" H 10338 7800 50  0001 C CNN
F 3 "~" H 10300 7950 50  0001 C CNN
F 4 "185-1596" H 10300 7950 50  0001 C CNN "rs#"
F 5 "0201, 25V, X5R, 10%" V 10140 7950 50  0001 C CNN "info"
F 6 "Luis" H 10300 7950 50  0001 C CNN "stock"
	1    10300 7950
	0    1    -1   0   
$EndComp
Wire Wire Line
	10450 7950 11400 7950
$Comp
L Device:C C539
U 1 1 61C61981
P 10300 6950
F 0 "C539" V 10250 7050 50  0000 L CNN
F 1 "0.1uF" V 10250 6850 50  0000 R CNN
F 2 "Capacitor_SMD:C_0201_0603Metric" H 10338 6800 50  0001 C CNN
F 3 "~" H 10300 6950 50  0001 C CNN
F 4 "185-1596" H 10300 6950 50  0001 C CNN "rs#"
F 5 "0201, 25V, X5R, 10%" V 10140 6950 50  0001 C CNN "info"
F 6 "Luis" H 10300 6950 50  0001 C CNN "stock"
	1    10300 6950
	0    1    -1   0   
$EndComp
Wire Wire Line
	10450 6950 11400 6950
$Comp
L Device:C C569
U 1 1 61C6198B
P 10900 8450
F 0 "C569" V 10850 8550 50  0000 L CNN
F 1 "0.1uF" V 10850 8350 50  0000 R CNN
F 2 "Capacitor_SMD:C_0201_0603Metric" H 10938 8300 50  0001 C CNN
F 3 "~" H 10900 8450 50  0001 C CNN
F 4 "185-1596" H 10900 8450 50  0001 C CNN "rs#"
F 5 "0201, 25V, X5R, 10%" V 10740 8450 50  0001 C CNN "info"
F 6 "Luis" H 10900 8450 50  0001 C CNN "stock"
	1    10900 8450
	0    1    -1   0   
$EndComp
Wire Wire Line
	11050 8450 11400 8450
$Comp
L Device:C C561
U 1 1 61C61995
P 10900 8050
F 0 "C561" V 10850 8150 50  0000 L CNN
F 1 "0.1uF" V 10850 7950 50  0000 R CNN
F 2 "Capacitor_SMD:C_0201_0603Metric" H 10938 7900 50  0001 C CNN
F 3 "~" H 10900 8050 50  0001 C CNN
F 4 "185-1596" H 10900 8050 50  0001 C CNN "rs#"
F 5 "0201, 25V, X5R, 10%" V 10740 8050 50  0001 C CNN "info"
F 6 "Luis" H 10900 8050 50  0001 C CNN "stock"
	1    10900 8050
	0    1    -1   0   
$EndComp
Wire Wire Line
	11050 8050 11400 8050
$Comp
L Device:C C541
U 1 1 61C619A9
P 10900 7050
F 0 "C541" V 10850 7150 50  0000 L CNN
F 1 "0.1uF" V 10850 6950 50  0000 R CNN
F 2 "Capacitor_SMD:C_0201_0603Metric" H 10938 6900 50  0001 C CNN
F 3 "~" H 10900 7050 50  0001 C CNN
F 4 "185-1596" H 10900 7050 50  0001 C CNN "rs#"
F 5 "0201, 25V, X5R, 10%" V 10740 7050 50  0001 C CNN "info"
F 6 "Luis" H 10900 7050 50  0001 C CNN "stock"
	1    10900 7050
	0    1    -1   0   
$EndComp
Wire Wire Line
	11050 7050 11400 7050
$Comp
L Device:C C533
U 1 1 61C619B3
P 10900 6650
F 0 "C533" V 10850 6750 50  0000 L CNN
F 1 "0.1uF" V 10850 6550 50  0000 R CNN
F 2 "Capacitor_SMD:C_0201_0603Metric" H 10938 6500 50  0001 C CNN
F 3 "~" H 10900 6650 50  0001 C CNN
F 4 "185-1596" H 10900 6650 50  0001 C CNN "rs#"
F 5 "0201, 25V, X5R, 10%" V 10740 6650 50  0001 C CNN "info"
F 6 "Luis" H 10900 6650 50  0001 C CNN "stock"
	1    10900 6650
	0    1    -1   0   
$EndComp
Wire Wire Line
	11050 6650 11400 6650
$Comp
L Device:C C529
U 1 1 61C619BD
P 10900 6450
F 0 "C529" V 10850 6550 50  0000 L CNN
F 1 "0.1uF" V 10850 6350 50  0000 R CNN
F 2 "Capacitor_SMD:C_0201_0603Metric" H 10938 6300 50  0001 C CNN
F 3 "~" H 10900 6450 50  0001 C CNN
F 4 "185-1596" H 10900 6450 50  0001 C CNN "rs#"
F 5 "0201, 25V, X5R, 10%" V 11050 6450 50  0000 C CNN "info"
F 6 "Luis" H 10900 6450 50  0001 C CNN "stock"
	1    10900 6450
	0    1    -1   0   
$EndComp
Wire Wire Line
	11050 6450 11400 6450
Wire Wire Line
	9500 7450 10750 7450
$Comp
L Device:C C549
U 1 1 61C619C8
P 10900 7450
F 0 "C549" V 10850 7550 50  0000 L CNN
F 1 "0.1uF" V 10850 7350 50  0000 R CNN
F 2 "Capacitor_SMD:C_0201_0603Metric" H 10938 7300 50  0001 C CNN
F 3 "~" H 10900 7450 50  0001 C CNN
F 4 "185-1596" H 10900 7450 50  0001 C CNN "rs#"
F 5 "0201, 25V, X5R, 10%" V 10740 7450 50  0001 C CNN "info"
F 6 "Luis" H 10900 7450 50  0001 C CNN "stock"
	1    10900 7450
	0    1    -1   0   
$EndComp
Wire Wire Line
	11050 7450 11400 7450
$Comp
L Device:C C553
U 1 1 61C619D2
P 10900 7650
F 0 "C553" V 10850 7750 50  0000 L CNN
F 1 "0.1uF" V 10850 7550 50  0000 R CNN
F 2 "Capacitor_SMD:C_0201_0603Metric" H 10938 7500 50  0001 C CNN
F 3 "~" H 10900 7650 50  0001 C CNN
F 4 "185-1596" H 10900 7650 50  0001 C CNN "rs#"
F 5 "0201, 25V, X5R, 10%" V 10740 7650 50  0001 C CNN "info"
F 6 "Luis" H 10900 7650 50  0001 C CNN "stock"
	1    10900 7650
	0    1    -1   0   
$EndComp
Wire Wire Line
	11050 7650 11400 7650
$Comp
L Device:C C573
U 1 1 61C619DC
P 10900 8650
F 0 "C573" V 10850 8750 50  0000 L CNN
F 1 "0.1uF" V 10850 8550 50  0000 R CNN
F 2 "Capacitor_SMD:C_0201_0603Metric" H 10938 8500 50  0001 C CNN
F 3 "~" H 10900 8650 50  0001 C CNN
F 4 "185-1596" H 10900 8650 50  0001 C CNN "rs#"
F 5 "0201, 25V, X5R, 10%" V 10740 8650 50  0001 C CNN "info"
F 6 "Luis" H 10900 8650 50  0001 C CNN "stock"
	1    10900 8650
	0    1    -1   0   
$EndComp
Wire Wire Line
	11050 8650 11400 8650
$Comp
L Device:C C557
U 1 1 61C619E6
P 10900 7850
F 0 "C557" V 10850 7950 50  0000 L CNN
F 1 "0.1uF" V 10850 7750 50  0000 R CNN
F 2 "Capacitor_SMD:C_0201_0603Metric" H 10938 7700 50  0001 C CNN
F 3 "~" H 10900 7850 50  0001 C CNN
F 4 "185-1596" H 10900 7850 50  0001 C CNN "rs#"
F 5 "0201, 25V, X5R, 10%" V 10740 7850 50  0001 C CNN "info"
F 6 "Luis" H 10900 7850 50  0001 C CNN "stock"
	1    10900 7850
	0    1    -1   0   
$EndComp
Wire Wire Line
	11050 7850 11400 7850
$Comp
L Device:C C537
U 1 1 61C619F0
P 10900 6850
F 0 "C537" V 10850 6950 50  0000 L CNN
F 1 "0.1uF" V 10850 6750 50  0000 R CNN
F 2 "Capacitor_SMD:C_0201_0603Metric" H 10938 6700 50  0001 C CNN
F 3 "~" H 10900 6850 50  0001 C CNN
F 4 "185-1596" H 10900 6850 50  0001 C CNN "rs#"
F 5 "0201, 25V, X5R, 10%" V 10740 6850 50  0001 C CNN "info"
F 6 "Luis" H 10900 6850 50  0001 C CNN "stock"
	1    10900 6850
	0    1    -1   0   
$EndComp
Wire Wire Line
	11050 6850 11400 6850
Text Label 11250 8350 0    20   ~ 0
sRX_N0
Text Label 11250 8550 0    20   ~ 0
sRX_N1
Text Label 11250 8150 0    20   ~ 0
sRX_N2
Text Label 11250 7150 0    20   ~ 0
sRX_N4
Text Label 11250 6750 0    20   ~ 0
sRX_N5
Text Label 11250 6550 0    20   ~ 0
sRX_N6
Text Label 11250 7550 0    20   ~ 0
sRX_N7
Text Label 11250 7750 0    20   ~ 0
sRX_N8
Text Label 11250 8750 0    20   ~ 0
sRX_N9
Text Label 11250 7950 0    20   ~ 0
sRX_N10
Text Label 11250 6950 0    20   ~ 0
sRX_N11
Text Label 11250 8250 0    20   ~ 0
sRX_P0
Text Label 11250 8450 0    20   ~ 0
sRX_P1
Text Label 11250 8050 0    20   ~ 0
sRX_P2
Text Label 11250 7050 0    20   ~ 0
sRX_P4
Text Label 11250 6650 0    20   ~ 0
sRX_P5
Text Label 11250 6450 0    20   ~ 0
sRX_P6
Text Label 11250 7450 0    20   ~ 0
sRX_P7
Text Label 11250 7650 0    20   ~ 0
sRX_P8
Text Label 11250 8650 0    20   ~ 0
sRX_P9
Text Label 11250 7850 0    20   ~ 0
sRX_P10
Text Label 11250 6850 0    20   ~ 0
sRX_P11
Text Label 12650 8550 0    20   ~ 0
sTX_N0
Text Label 12650 6550 0    20   ~ 0
sTX_N5
Text Label 12650 6750 0    20   ~ 0
sTX_N6
Text Label 12650 8350 0    20   ~ 0
sTX_N9
Text Label 12650 7950 0    20   ~ 0
sTX_N11
Text Label 12650 8450 0    20   ~ 0
sTX_P0
Text Label 12650 6450 0    20   ~ 0
sTX_P5
Text Label 12650 6650 0    20   ~ 0
sTX_P6
Text Label 12650 8250 0    20   ~ 0
sTX_P9
Text Label 12650 7850 0    20   ~ 0
sTX_P11
$Comp
L Device:C C?
U 1 1 635336BA
P 12700 1650
AR Path="/5EF3A6E9/635336BA" Ref="C?"  Part="1" 
AR Path="/619269F2/635336BA" Ref="C?"  Part="1" 
AR Path="/619BA206/635336BA" Ref="C512"  Part="1" 
F 0 "C512" H 12585 1741 50  0000 R CNN
F 1 "0.1uF" H 12585 1650 50  0000 R CNN
F 2 "Capacitor_SMD:C_0402_1005Metric" H 12738 1500 50  0001 C CNN
F 3 "~" H 12700 1650 50  0001 C CNN
F 4 "0402, 16V" H 12585 1559 50  0000 R CNN "info"
F 5 "AVT-IPE" H 12700 1650 50  0001 C CNN "stock"
	1    12700 1650
	-1   0    0    -1  
$EndComp
$Comp
L power:GND #PWR?
U 1 1 63537CB6
P 12700 1800
F 0 "#PWR?" H 12700 1550 50  0001 C CNN
F 1 "GND" H 12705 1627 50  0000 C CNN
F 2 "" H 12700 1800 50  0001 C CNN
F 3 "" H 12700 1800 50  0001 C CNN
	1    12700 1800
	1    0    0    -1  
$EndComp
$Comp
L Device:C C?
U 1 1 63539E1C
P 12700 2450
AR Path="/5EF3A6E9/63539E1C" Ref="C?"  Part="1" 
AR Path="/619269F2/63539E1C" Ref="C?"  Part="1" 
AR Path="/619BA206/63539E1C" Ref="C519"  Part="1" 
F 0 "C519" H 12585 2541 50  0000 R CNN
F 1 "0.1uF" H 12585 2450 50  0000 R CNN
F 2 "Capacitor_SMD:C_0402_1005Metric" H 12738 2300 50  0001 C CNN
F 3 "~" H 12700 2450 50  0001 C CNN
F 4 "0402, 16V" H 12585 2359 50  0000 R CNN "info"
F 5 "AVT-IPE" H 12700 2450 50  0001 C CNN "stock"
	1    12700 2450
	-1   0    0    -1  
$EndComp
$Comp
L power:GND #PWR?
U 1 1 63539E22
P 12700 2600
F 0 "#PWR?" H 12700 2350 50  0001 C CNN
F 1 "GND" H 12705 2427 50  0000 C CNN
F 2 "" H 12700 2600 50  0001 C CNN
F 3 "" H 12700 2600 50  0001 C CNN
	1    12700 2600
	1    0    0    -1  
$EndComp
$Comp
L Device:C C?
U 1 1 62F4E6AD
P 12700 4050
AR Path="/5EF3A6E9/62F4E6AD" Ref="C?"  Part="1" 
AR Path="/619269F2/62F4E6AD" Ref="C?"  Part="1" 
AR Path="/619BA206/62F4E6AD" Ref="C528"  Part="1" 
F 0 "C528" H 12585 4141 50  0000 R CNN
F 1 "0.1uF" H 12585 4050 50  0000 R CNN
F 2 "Capacitor_SMD:C_0402_1005Metric" H 12738 3900 50  0001 C CNN
F 3 "~" H 12700 4050 50  0001 C CNN
F 4 "0402, 16V" H 12585 3959 50  0000 R CNN "info"
F 5 "AVT-IPE" H 12700 4050 50  0001 C CNN "stock"
	1    12700 4050
	-1   0    0    -1  
$EndComp
$Comp
L power:GND #PWR?
U 1 1 62F4E6AE
P 12700 4200
F 0 "#PWR?" H 12700 3950 50  0001 C CNN
F 1 "GND" H 12705 4027 50  0000 C CNN
F 2 "" H 12700 4200 50  0001 C CNN
F 3 "" H 12700 4200 50  0001 C CNN
	1    12700 4200
	1    0    0    -1  
$EndComp
$Comp
L Device:C C?
U 1 1 62F4E6B0
P 12700 3250
AR Path="/5EF3A6E9/62F4E6B0" Ref="C?"  Part="1" 
AR Path="/619269F2/62F4E6B0" Ref="C?"  Part="1" 
AR Path="/619BA206/62F4E6B0" Ref="C523"  Part="1" 
F 0 "C523" H 12585 3341 50  0000 R CNN
F 1 "0.1uF" H 12585 3250 50  0000 R CNN
F 2 "Capacitor_SMD:C_0402_1005Metric" H 12738 3100 50  0001 C CNN
F 3 "~" H 12700 3250 50  0001 C CNN
F 4 "0402, 16V" H 12585 3159 50  0000 R CNN "info"
F 5 "AVT-IPE" H 12700 3250 50  0001 C CNN "stock"
	1    12700 3250
	-1   0    0    -1  
$EndComp
$Comp
L power:GND #PWR?
U 1 1 63585EC6
P 12700 3400
F 0 "#PWR?" H 12700 3150 50  0001 C CNN
F 1 "GND" H 12705 3227 50  0000 C CNN
F 2 "" H 12700 3400 50  0001 C CNN
F 3 "" H 12700 3400 50  0001 C CNN
	1    12700 3400
	1    0    0    -1  
$EndComp
$Comp
L Device:C C?
U 1 1 63754E6F
P 12050 4050
AR Path="/5EF3A6E9/63754E6F" Ref="C?"  Part="1" 
AR Path="/619269F2/63754E6F" Ref="C?"  Part="1" 
AR Path="/619BA206/63754E6F" Ref="C527"  Part="1" 
F 0 "C527" H 11935 4141 50  0000 R CNN
F 1 "0.1uF" H 11935 4050 50  0000 R CNN
F 2 "Capacitor_SMD:C_0402_1005Metric" H 12088 3900 50  0001 C CNN
F 3 "~" H 12050 4050 50  0001 C CNN
F 4 "0402, 16V" H 11935 3959 50  0000 R CNN "info"
F 5 "AVT-IPE" H 12050 4050 50  0001 C CNN "stock"
	1    12050 4050
	-1   0    0    -1  
$EndComp
$Comp
L power:GND #PWR?
U 1 1 63754E75
P 12050 4200
F 0 "#PWR?" H 12050 3950 50  0001 C CNN
F 1 "GND" H 12055 4027 50  0000 C CNN
F 2 "" H 12050 4200 50  0001 C CNN
F 3 "" H 12050 4200 50  0001 C CNN
	1    12050 4200
	1    0    0    -1  
$EndComp
Wire Wire Line
	13200 3950 13050 3950
Wire Wire Line
	13050 3950 13050 3850
Wire Wire Line
	13050 3850 13200 3850
Wire Wire Line
	13050 3850 12700 3850
Connection ~ 13050 3850
Wire Wire Line
	12050 3900 12050 3850
Connection ~ 12050 3850
Wire Wire Line
	12050 3850 11400 3850
Wire Wire Line
	12700 3900 12700 3850
Connection ~ 12700 3850
Wire Wire Line
	12700 3850 12050 3850
Wire Wire Line
	13200 3050 12700 3050
Wire Wire Line
	12700 3100 12700 3050
Connection ~ 12700 3050
Wire Wire Line
	12700 3050 11400 3050
Wire Wire Line
	13050 2350 13050 2250
Wire Wire Line
	13050 2250 13200 2250
Wire Wire Line
	13050 2250 12700 2250
Connection ~ 13050 2250
Wire Wire Line
	12050 2300 12050 2250
Connection ~ 12050 2250
Wire Wire Line
	12050 2250 11400 2250
Wire Wire Line
	12700 2300 12700 2250
Connection ~ 12700 2250
Wire Wire Line
	12700 2250 12050 2250
Wire Wire Line
	13200 2350 13050 2350
Wire Wire Line
	13200 1450 12700 1450
Wire Wire Line
	12700 1500 12700 1450
Connection ~ 12700 1450
$Comp
L Device:C C?
U 1 1 639171A2
P 12050 2450
AR Path="/5EF3A6E9/639171A2" Ref="C?"  Part="1" 
AR Path="/619269F2/639171A2" Ref="C?"  Part="1" 
AR Path="/619BA206/639171A2" Ref="C518"  Part="1" 
F 0 "C518" H 11935 2541 50  0000 R CNN
F 1 "0.1uF" H 11935 2450 50  0000 R CNN
F 2 "Capacitor_SMD:C_0402_1005Metric" H 12088 2300 50  0001 C CNN
F 3 "~" H 12050 2450 50  0001 C CNN
F 4 "0402, 16V" H 11935 2359 50  0000 R CNN "info"
F 5 "AVT-IPE" H 12050 2450 50  0001 C CNN "stock"
	1    12050 2450
	-1   0    0    -1  
$EndComp
$Comp
L power:GND #PWR?
U 1 1 639171A8
P 12050 2600
F 0 "#PWR?" H 12050 2350 50  0001 C CNN
F 1 "GND" H 12055 2427 50  0000 C CNN
F 2 "" H 12050 2600 50  0001 C CNN
F 3 "" H 12050 2600 50  0001 C CNN
	1    12050 2600
	1    0    0    -1  
$EndComp
$Comp
L Device:L_Core_Ferrite L501
U 1 1 639757F0
P 10950 1450
F 0 "L501" V 11265 1450 50  0000 C CNN
F 1 "BLM18SG260TZ1D" V 11174 1450 50  0000 C CNN
F 2 "Inductor_SMD:L_0603_1608Metric" H 10950 1450 50  0001 C CNN
F 3 "https://www.murata.com/en-us/products/productdata/8796750610462/QNFA9122.pdf" V 11090 1450 50  0001 C CNN
F 4 "Murata Electronics" V 10950 1450 50  0001 C CNN "manf"
F 5 "BLM18SG260TZ1D" V 10950 1450 50  0001 C CNN "manf#"
F 6 "Ferrite Bead, 0603, 6A, 7mOhm, 26Ohm @ 100MHz" V 11083 1450 50  0000 C CNN "info"
F 7 "BLM18SG260TZ1D-ND" V 10950 1450 50  0001 C CNN "digikey#"
F 8 "223-4932" V 10950 1450 50  0001 C CNN "rs#"
	1    10950 1450
	0    -1   -1   0   
$EndComp
$Comp
L Device:C C?
U 1 1 62F4E6B4
P 11400 2450
AR Path="/5EF3A6E9/62F4E6B4" Ref="C?"  Part="1" 
AR Path="/619269F2/62F4E6B4" Ref="C?"  Part="1" 
AR Path="/619BA206/62F4E6B4" Ref="C517"  Part="1" 
F 0 "C517" H 11285 2541 50  0000 R CNN
F 1 "47uF" H 11285 2450 50  0000 R CNN
F 2 "Capacitor_SMD:C_0805_2012Metric" H 11438 2300 50  0001 C CNN
F 3 "~" H 11400 2450 50  0001 C CNN
F 4 "0805, 10V" H 11285 2359 50  0000 R CNN "info"
F 5 "AVT-IPE" H 11400 2450 50  0001 C CNN "stock"
	1    11400 2450
	-1   0    0    -1  
$EndComp
$Comp
L Device:C C?
U 1 1 63A0143A
P 11400 4050
AR Path="/5EF3A6E9/63A0143A" Ref="C?"  Part="1" 
AR Path="/619269F2/63A0143A" Ref="C?"  Part="1" 
AR Path="/619BA206/63A0143A" Ref="C526"  Part="1" 
F 0 "C526" H 11285 4141 50  0000 R CNN
F 1 "47uF" H 11285 4050 50  0000 R CNN
F 2 "Capacitor_SMD:C_0805_2012Metric" H 11438 3900 50  0001 C CNN
F 3 "~" H 11400 4050 50  0001 C CNN
F 4 "0805, 10V" H 11285 3959 50  0000 R CNN "info"
F 5 "AVT-IPE" H 11400 4050 50  0001 C CNN "stock"
	1    11400 4050
	-1   0    0    -1  
$EndComp
Wire Wire Line
	11400 3900 11400 3850
Connection ~ 11400 3850
Wire Wire Line
	11400 3850 11100 3850
$Comp
L Device:C C?
U 1 1 62F4E6B6
P 11400 3250
AR Path="/5EF3A6E9/62F4E6B6" Ref="C?"  Part="1" 
AR Path="/619269F2/62F4E6B6" Ref="C?"  Part="1" 
AR Path="/619BA206/62F4E6B6" Ref="C522"  Part="1" 
F 0 "C522" H 11285 3341 50  0000 R CNN
F 1 "47uF" H 11285 3250 50  0000 R CNN
F 2 "Capacitor_SMD:C_0805_2012Metric" H 11438 3100 50  0001 C CNN
F 3 "~" H 11400 3250 50  0001 C CNN
F 4 "0805, 10V" H 11285 3159 50  0000 R CNN "info"
F 5 "AVT-IPE" H 11400 3250 50  0001 C CNN "stock"
	1    11400 3250
	-1   0    0    -1  
$EndComp
Wire Wire Line
	11400 3100 11400 3050
Wire Wire Line
	11400 2300 11400 2250
Connection ~ 11400 2250
Wire Wire Line
	11400 2250 11100 2250
Wire Wire Line
	12700 1450 11400 1450
Wire Wire Line
	11400 1500 11400 1450
$Comp
L power:GND #PWR?
U 1 1 63A87435
P 11800 1900
F 0 "#PWR?" H 11800 1650 50  0001 C CNN
F 1 "GND" H 11805 1727 50  0000 C CNN
F 2 "" H 11800 1900 50  0001 C CNN
F 3 "" H 11800 1900 50  0001 C CNN
	1    11800 1900
	1    0    0    -1  
$EndComp
$Comp
L Device:C C?
U 1 1 62F4E6B8
P 11400 1650
AR Path="/5EF3A6E9/62F4E6B8" Ref="C?"  Part="1" 
AR Path="/619269F2/62F4E6B8" Ref="C?"  Part="1" 
AR Path="/619BA206/62F4E6B8" Ref="C511"  Part="1" 
F 0 "C511" H 11285 1741 50  0000 R CNN
F 1 "47uF" H 11285 1650 50  0000 R CNN
F 2 "Capacitor_SMD:C_0805_2012Metric" H 11438 1500 50  0001 C CNN
F 3 "~" H 11400 1650 50  0001 C CNN
F 4 "0805, 10V" H 11285 1559 50  0000 R CNN "info"
F 5 "AVT-IPE" H 11400 1650 50  0001 C CNN "stock"
	1    11400 1650
	-1   0    0    -1  
$EndComp
Connection ~ 11400 1450
Wire Wire Line
	11400 1450 11100 1450
Connection ~ 11400 3050
Wire Wire Line
	11400 3050 11100 3050
$Comp
L Device:C C?
U 1 1 62F4E6C4
P 10300 4050
AR Path="/5EF3A6E9/62F4E6C4" Ref="C?"  Part="1" 
AR Path="/619269F2/62F4E6C4" Ref="C?"  Part="1" 
AR Path="/619BA206/62F4E6C4" Ref="C525"  Part="1" 
F 0 "C525" H 10185 4141 50  0000 R CNN
F 1 "0.1uF" H 10185 4050 50  0000 R CNN
F 2 "Capacitor_SMD:C_0402_1005Metric" H 10338 3900 50  0001 C CNN
F 3 "~" H 10300 4050 50  0001 C CNN
F 4 "0402, 16V" H 10185 3959 50  0000 R CNN "info"
F 5 "AVT-IPE" H 10300 4050 50  0001 C CNN "stock"
	1    10300 4050
	-1   0    0    -1  
$EndComp
$Comp
L power:GND #PWR?
U 1 1 62F4E6C5
P 10300 4200
F 0 "#PWR?" H 10300 3950 50  0001 C CNN
F 1 "GND" H 10305 4027 50  0000 C CNN
F 2 "" H 10300 4200 50  0001 C CNN
F 3 "" H 10300 4200 50  0001 C CNN
	1    10300 4200
	1    0    0    -1  
$EndComp
Wire Wire Line
	10300 3900 10300 3850
$Comp
L Device:C C?
U 1 1 62F4E6C6
P 9650 4050
AR Path="/5EF3A6E9/62F4E6C6" Ref="C?"  Part="1" 
AR Path="/619269F2/62F4E6C6" Ref="C?"  Part="1" 
AR Path="/619BA206/62F4E6C6" Ref="C524"  Part="1" 
F 0 "C524" H 9535 4141 50  0000 R CNN
F 1 "22uF" H 9535 4050 50  0000 R CNN
F 2 "Capacitor_SMD:C_0805_2012Metric" H 9688 3900 50  0001 C CNN
F 3 "~" H 9650 4050 50  0001 C CNN
F 4 "0805,10V" H 9535 3959 50  0000 R CNN "info"
F 5 "AVT-IPE" H 9650 4050 50  0001 C CNN "stock"
	1    9650 4050
	-1   0    0    -1  
$EndComp
$Comp
L power:GND #PWR?
U 1 1 62F4E6C7
P 9650 4200
F 0 "#PWR?" H 9650 3950 50  0001 C CNN
F 1 "GND" H 9655 4027 50  0000 C CNN
F 2 "" H 9650 4200 50  0001 C CNN
F 3 "" H 9650 4200 50  0001 C CNN
	1    9650 4200
	1    0    0    -1  
$EndComp
Wire Wire Line
	9650 3900 9650 3850
Wire Wire Line
	10800 3850 10300 3850
Connection ~ 10300 3850
Wire Wire Line
	10300 3850 9650 3850
$Comp
L Device:C C?
U 1 1 62F4E6C8
P 10300 3250
AR Path="/5EF3A6E9/62F4E6C8" Ref="C?"  Part="1" 
AR Path="/619269F2/62F4E6C8" Ref="C?"  Part="1" 
AR Path="/619BA206/62F4E6C8" Ref="C521"  Part="1" 
F 0 "C521" H 10185 3341 50  0000 R CNN
F 1 "0.1uF" H 10185 3250 50  0000 R CNN
F 2 "Capacitor_SMD:C_0402_1005Metric" H 10338 3100 50  0001 C CNN
F 3 "~" H 10300 3250 50  0001 C CNN
F 4 "0402, 16V" H 10185 3159 50  0000 R CNN "info"
F 5 "AVT-IPE" H 10300 3250 50  0001 C CNN "stock"
	1    10300 3250
	-1   0    0    -1  
$EndComp
$Comp
L power:GND #PWR?
U 1 1 62F4E6C9
P 10300 3400
F 0 "#PWR?" H 10300 3150 50  0001 C CNN
F 1 "GND" H 10305 3227 50  0000 C CNN
F 2 "" H 10300 3400 50  0001 C CNN
F 3 "" H 10300 3400 50  0001 C CNN
	1    10300 3400
	1    0    0    -1  
$EndComp
Wire Wire Line
	10300 3100 10300 3050
$Comp
L Device:C C?
U 1 1 62F4E6CA
P 9650 3250
AR Path="/5EF3A6E9/62F4E6CA" Ref="C?"  Part="1" 
AR Path="/619269F2/62F4E6CA" Ref="C?"  Part="1" 
AR Path="/619BA206/62F4E6CA" Ref="C520"  Part="1" 
F 0 "C520" H 9535 3341 50  0000 R CNN
F 1 "10uF" H 9535 3250 50  0000 R CNN
F 2 "Capacitor_SMD:C_0805_2012Metric" H 9688 3100 50  0001 C CNN
F 3 "~" H 9650 3250 50  0001 C CNN
F 4 "0805, 16V" H 9535 3159 50  0000 R CNN "info"
F 5 "AVT-IPE" H 9650 3250 50  0001 C CNN "stock"
	1    9650 3250
	-1   0    0    -1  
$EndComp
$Comp
L power:GND #PWR?
U 1 1 63C8973E
P 9650 3400
F 0 "#PWR?" H 9650 3150 50  0001 C CNN
F 1 "GND" H 9655 3227 50  0000 C CNN
F 2 "" H 9650 3400 50  0001 C CNN
F 3 "" H 9650 3400 50  0001 C CNN
	1    9650 3400
	1    0    0    -1  
$EndComp
Wire Wire Line
	9650 3100 9650 3050
Wire Wire Line
	10800 3050 10300 3050
Connection ~ 10300 3050
Wire Wire Line
	10300 3050 9650 3050
$Comp
L Device:C C?
U 1 1 62F4E6CC
P 10300 2450
AR Path="/5EF3A6E9/62F4E6CC" Ref="C?"  Part="1" 
AR Path="/619269F2/62F4E6CC" Ref="C?"  Part="1" 
AR Path="/619BA206/62F4E6CC" Ref="C516"  Part="1" 
F 0 "C516" H 10185 2541 50  0000 R CNN
F 1 "0.1uF" H 10185 2450 50  0000 R CNN
F 2 "Capacitor_SMD:C_0402_1005Metric" H 10338 2300 50  0001 C CNN
F 3 "~" H 10300 2450 50  0001 C CNN
F 4 "0402, 16V" H 10185 2359 50  0000 R CNN "info"
F 5 "AVT-IPE" H 10300 2450 50  0001 C CNN "stock"
	1    10300 2450
	-1   0    0    -1  
$EndComp
$Comp
L power:GND #PWR?
U 1 1 63CBBA05
P 10300 2600
F 0 "#PWR?" H 10300 2350 50  0001 C CNN
F 1 "GND" H 10305 2427 50  0000 C CNN
F 2 "" H 10300 2600 50  0001 C CNN
F 3 "" H 10300 2600 50  0001 C CNN
	1    10300 2600
	1    0    0    -1  
$EndComp
Wire Wire Line
	10300 2300 10300 2250
$Comp
L Device:C C?
U 1 1 63CBBA0E
P 9650 2450
AR Path="/5EF3A6E9/63CBBA0E" Ref="C?"  Part="1" 
AR Path="/619269F2/63CBBA0E" Ref="C?"  Part="1" 
AR Path="/619BA206/63CBBA0E" Ref="C515"  Part="1" 
F 0 "C515" H 9535 2541 50  0000 R CNN
F 1 "22uF" H 9535 2450 50  0000 R CNN
F 2 "Capacitor_SMD:C_0805_2012Metric" H 9688 2300 50  0001 C CNN
F 3 "~" H 9650 2450 50  0001 C CNN
F 4 "0805,10V" H 9535 2359 50  0000 R CNN "info"
F 5 "AVT-IPE" H 9650 2450 50  0001 C CNN "stock"
	1    9650 2450
	-1   0    0    -1  
$EndComp
$Comp
L power:GND #PWR?
U 1 1 63CBBA14
P 9650 2600
F 0 "#PWR?" H 9650 2350 50  0001 C CNN
F 1 "GND" H 9655 2427 50  0000 C CNN
F 2 "" H 9650 2600 50  0001 C CNN
F 3 "" H 9650 2600 50  0001 C CNN
	1    9650 2600
	1    0    0    -1  
$EndComp
Wire Wire Line
	9650 2300 9650 2250
Wire Wire Line
	10800 2250 10300 2250
Wire Wire Line
	9350 2250 9350 2200
Connection ~ 9650 2250
Wire Wire Line
	9650 2250 9350 2250
Connection ~ 10300 2250
Wire Wire Line
	10300 2250 9650 2250
$Comp
L Device:C C?
U 1 1 63CEF00B
P 10300 1650
AR Path="/5EF3A6E9/63CEF00B" Ref="C?"  Part="1" 
AR Path="/619269F2/63CEF00B" Ref="C?"  Part="1" 
AR Path="/619BA206/63CEF00B" Ref="C502"  Part="1" 
F 0 "C502" H 10185 1741 50  0000 R CNN
F 1 "0.1uF" H 10185 1650 50  0000 R CNN
F 2 "Capacitor_SMD:C_0402_1005Metric" H 10338 1500 50  0001 C CNN
F 3 "~" H 10300 1650 50  0001 C CNN
F 4 "0402, 16V" H 10185 1559 50  0000 R CNN "info"
F 5 "AVT-IPE" H 10300 1650 50  0001 C CNN "stock"
	1    10300 1650
	-1   0    0    -1  
$EndComp
$Comp
L power:GND #PWR?
U 1 1 63CEF011
P 10300 1800
F 0 "#PWR?" H 10300 1550 50  0001 C CNN
F 1 "GND" H 10305 1627 50  0000 C CNN
F 2 "" H 10300 1800 50  0001 C CNN
F 3 "" H 10300 1800 50  0001 C CNN
	1    10300 1800
	1    0    0    -1  
$EndComp
Wire Wire Line
	10300 1500 10300 1450
$Comp
L Device:C C?
U 1 1 63CEF01A
P 9650 1650
AR Path="/5EF3A6E9/63CEF01A" Ref="C?"  Part="1" 
AR Path="/619269F2/63CEF01A" Ref="C?"  Part="1" 
AR Path="/619BA206/63CEF01A" Ref="C501"  Part="1" 
F 0 "C501" H 9535 1741 50  0000 R CNN
F 1 "10uF" H 9535 1650 50  0000 R CNN
F 2 "Capacitor_SMD:C_0805_2012Metric" H 9688 1500 50  0001 C CNN
F 3 "~" H 9650 1650 50  0001 C CNN
F 4 "0805, 16V" H 9535 1559 50  0000 R CNN "info"
F 5 "AVT-IPE" H 9650 1650 50  0001 C CNN "stock"
	1    9650 1650
	-1   0    0    -1  
$EndComp
$Comp
L power:GND #PWR?
U 1 1 62F4E6D3
P 9650 1800
F 0 "#PWR?" H 9650 1550 50  0001 C CNN
F 1 "GND" H 9655 1627 50  0000 C CNN
F 2 "" H 9650 1800 50  0001 C CNN
F 3 "" H 9650 1800 50  0001 C CNN
	1    9650 1800
	1    0    0    -1  
$EndComp
Wire Wire Line
	9650 1500 9650 1450
Wire Wire Line
	10800 1450 10300 1450
Connection ~ 10300 1450
Wire Wire Line
	9350 3850 9350 3800
Wire Wire Line
	9650 3850 9350 3850
Wire Wire Line
	9350 3050 9350 3000
Wire Wire Line
	9650 3050 9350 3050
Wire Wire Line
	10300 1450 9650 1450
Wire Wire Line
	9350 1450 9350 1400
Wire Wire Line
	9650 1450 9350 1450
Connection ~ 9650 1450
Connection ~ 9650 3850
Connection ~ 9650 3050
$Comp
L power:+3V3 #PWR?
U 1 1 6403A7A5
P 9350 1400
F 0 "#PWR?" H 9350 1250 50  0001 C CNN
F 1 "+3V3" H 9365 1573 50  0000 C CNN
F 2 "" H 9350 1400 50  0001 C CNN
F 3 "" H 9350 1400 50  0001 C CNN
	1    9350 1400
	1    0    0    -1  
$EndComp
$Comp
L power:+2V5 #PWR?
U 1 1 6403D87A
P 9350 2200
F 0 "#PWR?" H 9350 2050 50  0001 C CNN
F 1 "+2V5" H 9365 2373 50  0000 C CNN
F 2 "" H 9350 2200 50  0001 C CNN
F 3 "" H 9350 2200 50  0001 C CNN
	1    9350 2200
	1    0    0    -1  
$EndComp
$Comp
L power:+2V5 #PWR?
U 1 1 6403DBCB
P 9350 3800
F 0 "#PWR?" H 9350 3650 50  0001 C CNN
F 1 "+2V5" H 9365 3973 50  0000 C CNN
F 2 "" H 9350 3800 50  0001 C CNN
F 3 "" H 9350 3800 50  0001 C CNN
	1    9350 3800
	1    0    0    -1  
$EndComp
$Comp
L power:+3V3 #PWR?
U 1 1 6403E3B6
P 9350 3000
F 0 "#PWR?" H 9350 2850 50  0001 C CNN
F 1 "+3V3" H 9365 3173 50  0000 C CNN
F 2 "" H 9350 3000 50  0001 C CNN
F 3 "" H 9350 3000 50  0001 C CNN
	1    9350 3000
	1    0    0    -1  
$EndComp
Wire Wire Line
	13200 4550 12500 4550
Text Label 12500 4550 0    50   ~ 0
Reset_L_HS
Wire Wire Line
	13200 4650 12500 4650
Wire Wire Line
	13200 4750 12500 4750
Wire Wire Line
	13200 4850 12500 4850
Text Label 12500 4650 0    50   ~ 0
Int_L_HS
Text Label 12500 4750 0    50   ~ 0
TX_DIS_HS
Text Label 12500 4850 0    50   ~ 0
RS_LOS_HS
Wire Wire Line
	3750 3300 3050 3300
Wire Wire Line
	3750 3400 3050 3400
Wire Wire Line
	3750 3500 3050 3500
Wire Wire Line
	3750 3600 3050 3600
Text HLabel 3050 3300 0    50   Input ~ 0
Reset_L
Text HLabel 3050 3400 0    50   Output ~ 0
Int_L
Text HLabel 3050 3500 0    50   Input ~ 0
TX_DIS
Text HLabel 3050 3600 0    50   Output ~ 0
RS_LOS
Wire Wire Line
	3300 2000 3300 1950
Wire Wire Line
	4150 2600 4150 2000
Wire Wire Line
	3300 2000 3500 2000
Wire Wire Line
	3500 2050 3500 2000
Connection ~ 3500 2000
Wire Wire Line
	3500 2000 4150 2000
Wire Wire Line
	5200 2000 5200 1950
Wire Wire Line
	4350 2600 4350 2000
Wire Wire Line
	5200 2000 5000 2000
Wire Wire Line
	5000 2050 5000 2000
Connection ~ 5000 2000
Wire Wire Line
	5000 2000 4350 2000
$Comp
L power:GND #PWR?
U 1 1 62F4E6DC
P 5000 2350
F 0 "#PWR?" H 5000 2100 50  0001 C CNN
F 1 "GND" H 5005 2177 50  0000 C CNN
F 2 "" H 5000 2350 50  0001 C CNN
F 3 "" H 5000 2350 50  0001 C CNN
	1    5000 2350
	1    0    0    -1  
$EndComp
$Comp
L power:GND #PWR?
U 1 1 64FD7105
P 3500 2350
F 0 "#PWR?" H 3500 2100 50  0001 C CNN
F 1 "GND" H 3505 2177 50  0000 C CNN
F 2 "" H 3500 2350 50  0001 C CNN
F 3 "" H 3500 2350 50  0001 C CNN
	1    3500 2350
	1    0    0    -1  
$EndComp
$Comp
L power:+3V3 #PWR?
U 1 1 62F4E6DE
P 5200 1950
F 0 "#PWR?" H 5200 1800 50  0001 C CNN
F 1 "+3V3" H 5215 2123 50  0000 C CNN
F 2 "" H 5200 1950 50  0001 C CNN
F 3 "" H 5200 1950 50  0001 C CNN
	1    5200 1950
	1    0    0    -1  
$EndComp
Text HLabel 12350 4950 0    50   Input ~ 0
SCL
Text HLabel 12350 5050 0    50   BiDi ~ 0
SDA
$Comp
L KIT_Logic_LevelTranslator:SN74AVC4T774RSV U502
U 1 1 62F4E684
P 4250 3200
F 0 "U502" H 4400 3850 50  0000 L CNN
F 1 "SN74AVC4T774RSV" H 4750 3750 50  0000 C CNN
F 2 "KIT_Package_DFN_QFN:UQFN-16_1.8x2.6_Pitch0.4mm" H 4250 2100 50  0001 C CNN
F 3 "https://www.ti.com/lit/ds/symlink/sn74avc4t774.pdf?ts=1637743747763&ref_url=https%253A%252F%252Fwww.google.com%252F" H 4200 2950 50  0001 C CNN
	1    4250 3200
	1    0    0    -1  
$EndComp
$Comp
L power:GND #PWR?
U 1 1 62F4E68F
P 4250 3800
F 0 "#PWR?" H 4250 3550 50  0001 C CNN
F 1 "GND" H 4255 3627 50  0000 C CNN
F 2 "" H 4250 3800 50  0001 C CNN
F 3 "" H 4250 3800 50  0001 C CNN
	1    4250 3800
	1    0    0    -1  
$EndComp
$Comp
L power:GND #PWR?
U 1 1 62F5A91E
P 3650 3800
F 0 "#PWR?" H 3650 3550 50  0001 C CNN
F 1 "GND" H 3655 3627 50  0000 C CNN
F 2 "" H 3650 3800 50  0001 C CNN
F 3 "" H 3650 3800 50  0001 C CNN
	1    3650 3800
	1    0    0    -1  
$EndComp
Wire Wire Line
	3650 3800 3650 3100
Wire Wire Line
	3650 3100 3750 3100
Wire Wire Line
	3750 2900 3650 2900
Wire Wire Line
	3650 2900 3650 3100
Connection ~ 3650 3100
$Comp
L power:GND #PWR?
U 1 1 62F4E69E
P 4900 3800
F 0 "#PWR?" H 4900 3550 50  0001 C CNN
F 1 "GND" H 4905 3627 50  0000 C CNN
F 2 "" H 4900 3800 50  0001 C CNN
F 3 "" H 4900 3800 50  0001 C CNN
	1    4900 3800
	1    0    0    -1  
$EndComp
Wire Wire Line
	4900 3800 4900 3100
Wire Wire Line
	4900 3100 4750 3100
Wire Wire Line
	3450 2950 3450 3000
Wire Wire Line
	3450 3000 3750 3000
Wire Wire Line
	5050 2950 5050 3000
Wire Wire Line
	5050 3000 4750 3000
$Comp
L Device:L_Core_Ferrite L502
U 1 1 62F4E6A4
P 10950 2250
F 0 "L502" V 11175 2250 50  0000 C CNN
F 1 "BLM18SG260TZ1D" V 11084 2250 50  0000 C CNN
F 2 "Inductor_SMD:L_0603_1608Metric" H 10950 2250 50  0001 C CNN
F 3 "https://www.murata.com/en-us/products/productdata/8796750610462/QNFA9122.pdf" V 11090 2250 50  0001 C CNN
F 4 "Murata Electronics" V 10950 2250 50  0001 C CNN "manf"
F 5 "BLM18SG260TZ1D" V 10950 2250 50  0001 C CNN "manf#"
F 6 "Ferrite Bead, 0603, 6A, 7mOhm, 26Ohm @ 100MHz" V 10950 2250 50  0001 C CNN "info"
F 7 "BLM18SG260TZ1D-ND" V 10950 2250 50  0001 C CNN "digikey#"
F 8 "223-4932" V 10950 2250 50  0001 C CNN "rs#"
	1    10950 2250
	0    -1   -1   0   
$EndComp
$Comp
L Device:L_Core_Ferrite L503
U 1 1 6348B73B
P 10950 3050
F 0 "L503" V 11175 3050 50  0000 C CNN
F 1 "BLM18SG260TZ1D" V 11084 3050 50  0000 C CNN
F 2 "Inductor_SMD:L_0603_1608Metric" H 10950 3050 50  0001 C CNN
F 3 "https://www.murata.com/en-us/products/productdata/8796750610462/QNFA9122.pdf" V 11090 3050 50  0001 C CNN
F 4 "Murata Electronics" V 10950 3050 50  0001 C CNN "manf"
F 5 "BLM18SG260TZ1D" V 10950 3050 50  0001 C CNN "manf#"
F 6 "Ferrite Bead, 0603, 6A, 7mOhm, 26Ohm @ 100MHz" V 10950 3050 50  0001 C CNN "info"
F 7 "BLM18SG260TZ1D-ND" V 10950 3050 50  0001 C CNN "digikey#"
F 8 "223-4932" V 10950 3050 50  0001 C CNN "rs#"
	1    10950 3050
	0    -1   -1   0   
$EndComp
$Comp
L Device:L_Core_Ferrite L504
U 1 1 62F4E6A6
P 10950 3850
F 0 "L504" V 11175 3850 50  0000 C CNN
F 1 "BLM18SG260TZ1D" V 11084 3850 50  0000 C CNN
F 2 "Inductor_SMD:L_0603_1608Metric" H 10950 3850 50  0001 C CNN
F 3 "https://www.murata.com/en-us/products/productdata/8796750610462/QNFA9122.pdf" V 11090 3850 50  0001 C CNN
F 4 "Murata Electronics" V 10950 3850 50  0001 C CNN "manf"
F 5 "BLM18SG260TZ1D" V 10950 3850 50  0001 C CNN "manf#"
F 6 "Ferrite Bead, 0603, 6A, 7mOhm, 26Ohm @ 100MHz" V 10950 3850 50  0001 C CNN "info"
F 7 "BLM18SG260TZ1D-ND" V 10950 3850 50  0001 C CNN "digikey#"
F 8 "223-4932" V 10950 3850 50  0001 C CNN "rs#"
	1    10950 3850
	0    -1   -1   0   
$EndComp
$Comp
L Device:R R501
U 1 1 63502CB1
P 11600 1850
F 0 "R501" V 11715 1850 50  0000 C CNN
F 1 "0.1" V 11806 1850 50  0000 C CNN
F 2 "Resistor_SMD:R_0603_1608Metric" V 11530 1850 50  0001 C CNN
F 3 "~" H 11600 1850 50  0001 C CNN
	1    11600 1850
	0    1    1    0   
$EndComp
Wire Wire Line
	11800 1900 11800 1850
Wire Wire Line
	11800 1850 11750 1850
Wire Wire Line
	11450 1850 11400 1850
Wire Wire Line
	11400 1850 11400 1800
$Comp
L power:GND #PWR?
U 1 1 63747FE0
P 11800 2700
F 0 "#PWR?" H 11800 2450 50  0001 C CNN
F 1 "GND" H 11805 2527 50  0000 C CNN
F 2 "" H 11800 2700 50  0001 C CNN
F 3 "" H 11800 2700 50  0001 C CNN
	1    11800 2700
	1    0    0    -1  
$EndComp
$Comp
L Device:R R502
U 1 1 63747FE6
P 11600 2650
F 0 "R502" V 11715 2650 50  0000 C CNN
F 1 "0.1" V 11806 2650 50  0000 C CNN
F 2 "Resistor_SMD:R_0603_1608Metric" V 11530 2650 50  0001 C CNN
F 3 "~" H 11600 2650 50  0001 C CNN
	1    11600 2650
	0    1    1    0   
$EndComp
Wire Wire Line
	11800 2700 11800 2650
Wire Wire Line
	11800 2650 11750 2650
Wire Wire Line
	11450 2650 11400 2650
Wire Wire Line
	11400 2650 11400 2600
$Comp
L power:GND #PWR?
U 1 1 637BB5D3
P 11800 3500
F 0 "#PWR?" H 11800 3250 50  0001 C CNN
F 1 "GND" H 11805 3327 50  0000 C CNN
F 2 "" H 11800 3500 50  0001 C CNN
F 3 "" H 11800 3500 50  0001 C CNN
	1    11800 3500
	1    0    0    -1  
$EndComp
$Comp
L Device:R R503
U 1 1 637BB5D9
P 11600 3450
F 0 "R503" V 11715 3450 50  0000 C CNN
F 1 "0.1" V 11806 3450 50  0000 C CNN
F 2 "Resistor_SMD:R_0603_1608Metric" V 11530 3450 50  0001 C CNN
F 3 "~" H 11600 3450 50  0001 C CNN
	1    11600 3450
	0    1    1    0   
$EndComp
Wire Wire Line
	11800 3500 11800 3450
Wire Wire Line
	11800 3450 11750 3450
Wire Wire Line
	11450 3450 11400 3450
Wire Wire Line
	11400 3450 11400 3400
$Comp
L power:GND #PWR?
U 1 1 6382FDDF
P 11800 4300
F 0 "#PWR?" H 11800 4050 50  0001 C CNN
F 1 "GND" H 11805 4127 50  0000 C CNN
F 2 "" H 11800 4300 50  0001 C CNN
F 3 "" H 11800 4300 50  0001 C CNN
	1    11800 4300
	1    0    0    -1  
$EndComp
$Comp
L Device:R R504
U 1 1 6382FDE5
P 11600 4250
F 0 "R504" V 11715 4250 50  0000 C CNN
F 1 "0.1" V 11806 4250 50  0000 C CNN
F 2 "Resistor_SMD:R_0603_1608Metric" V 11530 4250 50  0001 C CNN
F 3 "~" H 11600 4250 50  0001 C CNN
	1    11600 4250
	0    1    1    0   
$EndComp
Wire Wire Line
	11800 4300 11800 4250
Wire Wire Line
	11800 4250 11750 4250
Wire Wire Line
	11450 4250 11400 4250
Wire Wire Line
	11400 4250 11400 4200
$Comp
L Device:C C?
U 1 1 62F4E6DA
P 3500 2200
AR Path="/5EF3A6E9/62F4E6DA" Ref="C?"  Part="1" 
AR Path="/619269F2/62F4E6DA" Ref="C?"  Part="1" 
AR Path="/619BA206/62F4E6DA" Ref="C513"  Part="1" 
F 0 "C513" H 3385 2291 50  0000 R CNN
F 1 "0.1uF" H 3385 2200 50  0000 R CNN
F 2 "Capacitor_SMD:C_0402_1005Metric" H 3538 2050 50  0001 C CNN
F 3 "~" H 3500 2200 50  0001 C CNN
F 4 "0402, 16V" H 3385 2109 50  0000 R CNN "info"
F 5 "AVT-IPE" H 3500 2200 50  0001 C CNN "stock"
	1    3500 2200
	-1   0    0    -1  
$EndComp
$Comp
L Device:C C?
U 1 1 64FD70F4
P 5000 2200
AR Path="/5EF3A6E9/64FD70F4" Ref="C?"  Part="1" 
AR Path="/619269F2/64FD70F4" Ref="C?"  Part="1" 
AR Path="/619BA206/64FD70F4" Ref="C514"  Part="1" 
F 0 "C514" H 4885 2291 50  0000 R CNN
F 1 "0.1uF" H 4885 2200 50  0000 R CNN
F 2 "Capacitor_SMD:C_0402_1005Metric" H 5038 2050 50  0001 C CNN
F 3 "~" H 5000 2200 50  0001 C CNN
F 4 "0402, 16V" H 4885 2109 50  0000 R CNN "info"
F 5 "AVT-IPE" H 5000 2200 50  0001 C CNN "stock"
	1    5000 2200
	1    0    0    -1  
$EndComp
Text Label 3150 6800 0    50   ~ 0
RX_P20
Text Label 3150 7100 0    50   ~ 0
RX_P21
Text Label 3150 7400 0    50   ~ 0
RX_P22
Text Label 3150 7700 0    50   ~ 0
RX_P23
Text Label 3150 6900 0    50   ~ 0
RX_N20
Text Label 3150 7200 0    50   ~ 0
RX_N21
Text Label 3150 7500 0    50   ~ 0
RX_N22
Text Label 3150 7800 0    50   ~ 0
RX_N23
Text Label 5250 6800 2    50   ~ 0
TX_P20
Text Label 5250 7100 2    50   ~ 0
TX_P21
Text Label 5250 7400 2    50   ~ 0
TX_P22
Text Label 5250 7700 2    50   ~ 0
TX_P23
Text Label 5250 6900 2    50   ~ 0
TX_N20
Text Label 5250 7200 2    50   ~ 0
TX_N21
Text Label 5250 7500 2    50   ~ 0
TX_N22
Text Label 5250 7800 2    50   ~ 0
TX_N23
Wire Wire Line
	4750 3300 5450 3300
Text Label 5450 3300 2    50   ~ 0
Reset_L_HS
Wire Wire Line
	4750 3400 5450 3400
Wire Wire Line
	4750 3500 5450 3500
Wire Wire Line
	4750 3600 5450 3600
Text Label 5450 3400 2    50   ~ 0
Int_L_HS
Text Label 5450 3500 2    50   ~ 0
TX_DIS_HS
Text Label 5450 3600 2    50   ~ 0
RS_LOS_HS
Wire Wire Line
	12350 4950 13200 4950
Wire Wire Line
	12350 5050 13200 5050
Wire Wire Line
	3150 6800 4400 6800
Wire Wire Line
	3150 6900 3800 6900
$Comp
L Device:C C503
U 1 1 6566328F
P 3950 6900
F 0 "C503" V 3900 7000 50  0000 L CNN
F 1 "0.1uF" V 3900 6800 50  0000 R CNN
F 2 "Capacitor_SMD:C_0201_0603Metric" H 3988 6750 50  0001 C CNN
F 3 "~" H 3950 6900 50  0001 C CNN
F 4 "185-1596" H 3950 6900 50  0001 C CNN "rs#"
F 5 "0201, 25V, X5R, 10%" V 3790 6900 50  0001 C CNN "info"
F 6 "Luis" H 3950 6900 50  0001 C CNN "stock"
	1    3950 6900
	0    1    -1   0   
$EndComp
Wire Wire Line
	4100 6900 5250 6900
$Comp
L Device:C C507
U 1 1 65663299
P 4550 6800
F 0 "C507" V 4500 6900 50  0000 L CNN
F 1 "0.1uF" V 4500 6700 50  0000 R CNN
F 2 "Capacitor_SMD:C_0201_0603Metric" H 4588 6650 50  0001 C CNN
F 3 "~" H 4550 6800 50  0001 C CNN
F 4 "185-1596" H 4550 6800 50  0001 C CNN "rs#"
F 5 "0201, 25V, X5R, 10%" V 4700 6800 50  0000 C CNN "info"
F 6 "Luis" H 4550 6800 50  0001 C CNN "stock"
	1    4550 6800
	0    1    -1   0   
$EndComp
Wire Wire Line
	4700 6800 5250 6800
Wire Wire Line
	3150 7100 4400 7100
Wire Wire Line
	3150 7200 3800 7200
$Comp
L Device:C C504
U 1 1 656D947D
P 3950 7200
F 0 "C504" V 3900 7300 50  0000 L CNN
F 1 "0.1uF" V 3900 7100 50  0000 R CNN
F 2 "Capacitor_SMD:C_0201_0603Metric" H 3988 7050 50  0001 C CNN
F 3 "~" H 3950 7200 50  0001 C CNN
F 4 "185-1596" H 3950 7200 50  0001 C CNN "rs#"
F 5 "0201, 25V, X5R, 10%" V 3790 7200 50  0001 C CNN "info"
F 6 "Luis" H 3950 7200 50  0001 C CNN "stock"
	1    3950 7200
	0    1    -1   0   
$EndComp
Wire Wire Line
	4100 7200 5250 7200
$Comp
L Device:C C508
U 1 1 656D9487
P 4550 7100
F 0 "C508" V 4500 7200 50  0000 L CNN
F 1 "0.1uF" V 4500 7000 50  0000 R CNN
F 2 "Capacitor_SMD:C_0201_0603Metric" H 4588 6950 50  0001 C CNN
F 3 "~" H 4550 7100 50  0001 C CNN
F 4 "185-1596" H 4550 7100 50  0001 C CNN "rs#"
F 5 "0201, 25V, X5R, 10%" V 4390 7100 50  0001 C CNN "info"
F 6 "Luis" H 4550 7100 50  0001 C CNN "stock"
	1    4550 7100
	0    1    -1   0   
$EndComp
Wire Wire Line
	4700 7100 5250 7100
Wire Wire Line
	3150 7400 4400 7400
Wire Wire Line
	3150 7500 3800 7500
$Comp
L Device:C C505
U 1 1 656F6E9F
P 3950 7500
F 0 "C505" V 3900 7600 50  0000 L CNN
F 1 "0.1uF" V 3900 7400 50  0000 R CNN
F 2 "Capacitor_SMD:C_0201_0603Metric" H 3988 7350 50  0001 C CNN
F 3 "~" H 3950 7500 50  0001 C CNN
F 4 "185-1596" H 3950 7500 50  0001 C CNN "rs#"
F 5 "0201, 25V, X5R, 10%" V 3790 7500 50  0001 C CNN "info"
F 6 "Luis" H 3950 7500 50  0001 C CNN "stock"
	1    3950 7500
	0    1    -1   0   
$EndComp
Wire Wire Line
	4100 7500 5250 7500
$Comp
L Device:C C509
U 1 1 656F6EA9
P 4550 7400
F 0 "C509" V 4500 7500 50  0000 L CNN
F 1 "0.1uF" V 4500 7300 50  0000 R CNN
F 2 "Capacitor_SMD:C_0201_0603Metric" H 4588 7250 50  0001 C CNN
F 3 "~" H 4550 7400 50  0001 C CNN
F 4 "185-1596" H 4550 7400 50  0001 C CNN "rs#"
F 5 "0201, 25V, X5R, 10%" V 4390 7400 50  0001 C CNN "info"
F 6 "Luis" H 4550 7400 50  0001 C CNN "stock"
	1    4550 7400
	0    1    -1   0   
$EndComp
Wire Wire Line
	4700 7400 5250 7400
Wire Wire Line
	3150 7700 4400 7700
Wire Wire Line
	3150 7800 3800 7800
$Comp
L Device:C C506
U 1 1 62F4E6EE
P 3950 7800
F 0 "C506" V 3900 7900 50  0000 L CNN
F 1 "0.1uF" V 3900 7700 50  0000 R CNN
F 2 "Capacitor_SMD:C_0201_0603Metric" H 3988 7650 50  0001 C CNN
F 3 "~" H 3950 7800 50  0001 C CNN
F 4 "185-1596" H 3950 7800 50  0001 C CNN "rs#"
F 5 "0201, 25V, X5R, 10%" V 3790 7800 50  0001 C CNN "info"
F 6 "Luis" H 3950 7800 50  0001 C CNN "stock"
	1    3950 7800
	0    1    -1   0   
$EndComp
Wire Wire Line
	4100 7800 5250 7800
$Comp
L Device:C C510
U 1 1 62F4E6EF
P 4550 7700
F 0 "C510" V 4500 7800 50  0000 L CNN
F 1 "0.1uF" V 4500 7600 50  0000 R CNN
F 2 "Capacitor_SMD:C_0201_0603Metric" H 4588 7550 50  0001 C CNN
F 3 "~" H 4550 7700 50  0001 C CNN
F 4 "185-1596" H 4550 7700 50  0001 C CNN "rs#"
F 5 "0201, 25V, X5R, 10%" V 4390 7700 50  0001 C CNN "info"
F 6 "Luis" H 4550 7700 50  0001 C CNN "stock"
	1    4550 7700
	0    1    -1   0   
$EndComp
Wire Wire Line
	4700 7700 5250 7700
Text Label 12200 1450 0    50   ~ 0
+3V3_A1
Text Label 12200 3050 0    50   ~ 0
+3V3_P1
Text Label 12200 2250 0    50   ~ 0
+2V5_C1B1
Text Label 12200 3850 0    50   ~ 0
+2V5_N1M1
Text Label 12650 8650 0    20   ~ 0
sTX_P1
Text Label 12650 8750 0    20   ~ 0
sTX_N1
Wire Wire Line
	13900 8650 14500 8650
Wire Wire Line
	13300 8750 14500 8750
$Comp
L Device:C C574
U 1 1 61C3F94A
P 13750 8650
F 0 "C574" V 13700 8750 50  0000 L CNN
F 1 "0.1uF" V 13700 8550 50  0000 R CNN
F 2 "Capacitor_SMD:C_0201_0603Metric" H 13788 8500 50  0001 C CNN
F 3 "~" H 13750 8650 50  0001 C CNN
F 4 "185-1596" H 13750 8650 50  0001 C CNN "rs#"
F 5 "0201, 25V, X5R, 10%" V 13590 8650 50  0001 C CNN "info"
F 6 "Luis" H 13750 8650 50  0001 C CNN "stock"
	1    13750 8650
	0    1    -1   0   
$EndComp
$Comp
L Device:C C576
U 1 1 61C3F8E7
P 13150 8750
F 0 "C576" V 13100 8850 50  0000 L CNN
F 1 "0.1uF" V 13100 8650 50  0000 R CNN
F 2 "Capacitor_SMD:C_0201_0603Metric" H 13188 8600 50  0001 C CNN
F 3 "~" H 13150 8750 50  0001 C CNN
F 4 "185-1596" H 13150 8750 50  0001 C CNN "rs#"
F 5 "0201, 25V, X5R, 10%" V 12990 8750 50  0001 C CNN "info"
F 6 "Luis" H 13150 8750 50  0001 C CNN "stock"
	1    13150 8750
	0    1    -1   0   
$EndComp
Wire Wire Line
	12600 8750 13000 8750
Wire Wire Line
	12600 8650 13600 8650
Text Label 14500 8650 2    50   ~ 0
TX_P1
Text Label 14500 8750 2    50   ~ 0
TX_N1
Text Label 12650 7650 0    20   ~ 0
sTX_P2
Text Label 12650 7750 0    20   ~ 0
sTX_N2
Wire Wire Line
	13900 7650 14500 7650
Wire Wire Line
	13300 7750 14500 7750
$Comp
L Device:C C554
U 1 1 61C3F953
P 13750 7650
F 0 "C554" V 13700 7750 50  0000 L CNN
F 1 "0.1uF" V 13700 7550 50  0000 R CNN
F 2 "Capacitor_SMD:C_0201_0603Metric" H 13788 7500 50  0001 C CNN
F 3 "~" H 13750 7650 50  0001 C CNN
F 4 "185-1596" H 13750 7650 50  0001 C CNN "rs#"
F 5 "0201, 25V, X5R, 10%" V 13590 7650 50  0001 C CNN "info"
F 6 "Luis" H 13750 7650 50  0001 C CNN "stock"
	1    13750 7650
	0    1    -1   0   
$EndComp
$Comp
L Device:C C556
U 1 1 61C3F8F0
P 13150 7750
F 0 "C556" V 13100 7850 50  0000 L CNN
F 1 "0.1uF" V 13100 7650 50  0000 R CNN
F 2 "Capacitor_SMD:C_0201_0603Metric" H 13188 7600 50  0001 C CNN
F 3 "~" H 13150 7750 50  0001 C CNN
F 4 "185-1596" H 13150 7750 50  0001 C CNN "rs#"
F 5 "0201, 25V, X5R, 10%" V 12990 7750 50  0001 C CNN "info"
F 6 "Luis" H 13150 7750 50  0001 C CNN "stock"
	1    13150 7750
	0    1    -1   0   
$EndComp
Wire Wire Line
	12600 7750 13000 7750
Wire Wire Line
	12600 7650 13600 7650
Text Label 14500 7650 2    50   ~ 0
TX_P2
Text Label 14500 7750 2    50   ~ 0
TX_N2
Text Label 12650 8050 0    20   ~ 0
sTX_P10
Text Label 12650 8150 0    20   ~ 0
sTX_N10
Wire Wire Line
	13900 8050 14500 8050
Wire Wire Line
	13300 8150 14500 8150
$Comp
L Device:C C562
U 1 1 61C3F99C
P 13750 8050
F 0 "C562" V 13700 8150 50  0000 L CNN
F 1 "0.1uF" V 13700 7950 50  0000 R CNN
F 2 "Capacitor_SMD:C_0201_0603Metric" H 13788 7900 50  0001 C CNN
F 3 "~" H 13750 8050 50  0001 C CNN
F 4 "185-1596" H 13750 8050 50  0001 C CNN "rs#"
F 5 "0201, 25V, X5R, 10%" V 13590 8050 50  0001 C CNN "info"
F 6 "Luis" H 13750 8050 50  0001 C CNN "stock"
	1    13750 8050
	0    1    -1   0   
$EndComp
$Comp
L Device:C C564
U 1 1 61C3F938
P 13150 8150
F 0 "C564" V 13100 8250 50  0000 L CNN
F 1 "0.1uF" V 13100 8050 50  0000 R CNN
F 2 "Capacitor_SMD:C_0201_0603Metric" H 13188 8000 50  0001 C CNN
F 3 "~" H 13150 8150 50  0001 C CNN
F 4 "185-1596" H 13150 8150 50  0001 C CNN "rs#"
F 5 "0201, 25V, X5R, 10%" V 12990 8150 50  0001 C CNN "info"
F 6 "Luis" H 13150 8150 50  0001 C CNN "stock"
	1    13150 8150
	0    1    -1   0   
$EndComp
Wire Wire Line
	12600 8150 13000 8150
Wire Wire Line
	12600 8050 13600 8050
Text Label 14500 8050 2    50   ~ 0
TX_P10
Text Label 14500 8150 2    50   ~ 0
TX_N10
Text Label 12650 7250 0    20   ~ 0
sTX_P3
Text Label 12650 7350 0    20   ~ 0
sTX_N3
Wire Wire Line
	13900 7250 14500 7250
Wire Wire Line
	13300 7350 14500 7350
$Comp
L Device:C C546
U 1 1 61C3F95C
P 13750 7250
F 0 "C546" V 13700 7350 50  0000 L CNN
F 1 "0.1uF" V 13700 7150 50  0000 R CNN
F 2 "Capacitor_SMD:C_0201_0603Metric" H 13788 7100 50  0001 C CNN
F 3 "~" H 13750 7250 50  0001 C CNN
F 4 "185-1596" H 13750 7250 50  0001 C CNN "rs#"
F 5 "0201, 25V, X5R, 10%" V 13590 7250 50  0001 C CNN "info"
F 6 "Luis" H 13750 7250 50  0001 C CNN "stock"
	1    13750 7250
	0    1    -1   0   
$EndComp
$Comp
L Device:C C548
U 1 1 61C3F8F9
P 13150 7350
F 0 "C548" V 13100 7450 50  0000 L CNN
F 1 "0.1uF" V 13100 7250 50  0000 R CNN
F 2 "Capacitor_SMD:C_0201_0603Metric" H 13188 7200 50  0001 C CNN
F 3 "~" H 13150 7350 50  0001 C CNN
F 4 "185-1596" H 13150 7350 50  0001 C CNN "rs#"
F 5 "0201, 25V, X5R, 10%" V 12990 7350 50  0001 C CNN "info"
F 6 "Luis" H 13150 7350 50  0001 C CNN "stock"
	1    13150 7350
	0    1    -1   0   
$EndComp
Wire Wire Line
	12600 7350 13000 7350
Wire Wire Line
	12600 7250 13600 7250
Text Label 14500 7250 2    50   ~ 0
TX_P3
Text Label 14500 7350 2    50   ~ 0
TX_N3
Text Label 12650 6850 0    20   ~ 0
sTX_P4
Text Label 12650 6950 0    20   ~ 0
sTX_N4
Wire Wire Line
	13900 6850 14500 6850
Wire Wire Line
	13300 6950 14500 6950
$Comp
L Device:C C538
U 1 1 61C3F965
P 13750 6850
F 0 "C538" V 13700 6950 50  0000 L CNN
F 1 "0.1uF" V 13700 6750 50  0000 R CNN
F 2 "Capacitor_SMD:C_0201_0603Metric" H 13788 6700 50  0001 C CNN
F 3 "~" H 13750 6850 50  0001 C CNN
F 4 "185-1596" H 13750 6850 50  0001 C CNN "rs#"
F 5 "0201, 25V, X5R, 10%" V 13590 6850 50  0001 C CNN "info"
F 6 "Luis" H 13750 6850 50  0001 C CNN "stock"
	1    13750 6850
	0    1    -1   0   
$EndComp
$Comp
L Device:C C540
U 1 1 61C3F902
P 13150 6950
F 0 "C540" V 13100 7050 50  0000 L CNN
F 1 "0.1uF" V 13100 6850 50  0000 R CNN
F 2 "Capacitor_SMD:C_0201_0603Metric" H 13188 6800 50  0001 C CNN
F 3 "~" H 13150 6950 50  0001 C CNN
F 4 "185-1596" H 13150 6950 50  0001 C CNN "rs#"
F 5 "0201, 25V, X5R, 10%" V 12990 6950 50  0001 C CNN "info"
F 6 "Luis" H 13150 6950 50  0001 C CNN "stock"
	1    13150 6950
	0    1    -1   0   
$EndComp
Wire Wire Line
	12600 6950 13000 6950
Wire Wire Line
	12600 6850 13600 6850
Text Label 14500 6850 2    50   ~ 0
TX_P4
Text Label 14500 6950 2    50   ~ 0
TX_N4
Text Label 11250 7250 0    20   ~ 0
sRX_P3
Text Label 11250 7350 0    20   ~ 0
sRX_N3
Wire Wire Line
	11050 7250 11400 7250
$Comp
L Device:C C545
U 1 1 61C6199F
P 10900 7250
F 0 "C545" V 10850 7350 50  0000 L CNN
F 1 "0.1uF" V 10850 7150 50  0000 R CNN
F 2 "Capacitor_SMD:C_0201_0603Metric" H 10938 7100 50  0001 C CNN
F 3 "~" H 10900 7250 50  0001 C CNN
F 4 "185-1596" H 10900 7250 50  0001 C CNN "rs#"
F 5 "0201, 25V, X5R, 10%" V 10740 7250 50  0001 C CNN "info"
F 6 "Luis" H 10900 7250 50  0001 C CNN "stock"
	1    10900 7250
	0    1    -1   0   
$EndComp
Wire Wire Line
	10450 7350 11400 7350
$Comp
L Device:C C547
U 1 1 61C61931
P 10300 7350
F 0 "C547" V 10250 7450 50  0000 L CNN
F 1 "0.1uF" V 10250 7250 50  0000 R CNN
F 2 "Capacitor_SMD:C_0201_0603Metric" H 10338 7200 50  0001 C CNN
F 3 "~" H 10300 7350 50  0001 C CNN
F 4 "185-1596" H 10300 7350 50  0001 C CNN "rs#"
F 5 "0201, 25V, X5R, 10%" V 10140 7350 50  0001 C CNN "info"
F 6 "Luis" H 10300 7350 50  0001 C CNN "stock"
	1    10300 7350
	0    1    -1   0   
$EndComp
Wire Wire Line
	9500 7350 10150 7350
Wire Wire Line
	9500 7250 10750 7250
Text Label 9500 7350 0    50   ~ 0
RX_N3
Text Label 9500 7250 0    50   ~ 0
RX_P3
Text Label 12650 7050 0    20   ~ 0
sTX_P7
Text Label 12650 7150 0    20   ~ 0
sTX_N7
Wire Wire Line
	13900 7050 14500 7050
Wire Wire Line
	13300 7150 14500 7150
$Comp
L Device:C C542
U 1 1 61C3F981
P 13750 7050
F 0 "C542" V 13700 7150 50  0000 L CNN
F 1 "0.1uF" V 13700 6950 50  0000 R CNN
F 2 "Capacitor_SMD:C_0201_0603Metric" H 13788 6900 50  0001 C CNN
F 3 "~" H 13750 7050 50  0001 C CNN
F 4 "185-1596" H 13750 7050 50  0001 C CNN "rs#"
F 5 "0201, 25V, X5R, 10%" V 13590 7050 50  0001 C CNN "info"
F 6 "Luis" H 13750 7050 50  0001 C CNN "stock"
	1    13750 7050
	0    1    -1   0   
$EndComp
Wire Wire Line
	12600 7050 13600 7050
$Comp
L Device:C C544
U 1 1 61C3F91D
P 13150 7150
F 0 "C544" V 13100 7250 50  0000 L CNN
F 1 "0.1uF" V 13100 7050 50  0000 R CNN
F 2 "Capacitor_SMD:C_0201_0603Metric" H 13188 7000 50  0001 C CNN
F 3 "~" H 13150 7150 50  0001 C CNN
F 4 "185-1596" H 13150 7150 50  0001 C CNN "rs#"
F 5 "0201, 25V, X5R, 10%" V 12990 7150 50  0001 C CNN "info"
F 6 "Luis" H 13150 7150 50  0001 C CNN "stock"
	1    13150 7150
	0    1    -1   0   
$EndComp
Wire Wire Line
	12600 7150 13000 7150
Text Label 14500 7050 2    50   ~ 0
TX_P7
Text Label 14500 7150 2    50   ~ 0
TX_N7
Text Label 12650 7450 0    20   ~ 0
sTX_P8
Text Label 12650 7550 0    20   ~ 0
sTX_N8
Wire Wire Line
	13900 7450 14500 7450
Wire Wire Line
	13300 7550 14500 7550
$Comp
L Device:C C550
U 1 1 61C3F98A
P 13750 7450
F 0 "C550" V 13700 7550 50  0000 L CNN
F 1 "0.1uF" V 13700 7350 50  0000 R CNN
F 2 "Capacitor_SMD:C_0201_0603Metric" H 13788 7300 50  0001 C CNN
F 3 "~" H 13750 7450 50  0001 C CNN
F 4 "185-1596" H 13750 7450 50  0001 C CNN "rs#"
F 5 "0201, 25V, X5R, 10%" V 13590 7450 50  0001 C CNN "info"
F 6 "Luis" H 13750 7450 50  0001 C CNN "stock"
	1    13750 7450
	0    1    -1   0   
$EndComp
$Comp
L Device:C C552
U 1 1 61C3F926
P 13150 7550
F 0 "C552" V 13100 7650 50  0000 L CNN
F 1 "0.1uF" V 13100 7450 50  0000 R CNN
F 2 "Capacitor_SMD:C_0201_0603Metric" H 13188 7400 50  0001 C CNN
F 3 "~" H 13150 7550 50  0001 C CNN
F 4 "185-1596" H 13150 7550 50  0001 C CNN "rs#"
F 5 "0201, 25V, X5R, 10%" V 12990 7550 50  0001 C CNN "info"
F 6 "Luis" H 13150 7550 50  0001 C CNN "stock"
	1    13150 7550
	0    1    -1   0   
$EndComp
Wire Wire Line
	12600 7550 13000 7550
Wire Wire Line
	12600 7450 13600 7450
Text Label 14500 7450 2    50   ~ 0
TX_P8
Text Label 14500 7550 2    50   ~ 0
TX_N8
$Comp
L power:+1V8 #PWR?
U 1 1 62B85FBD
P 3300 1950
F 0 "#PWR?" H 3300 1800 50  0001 C CNN
F 1 "+1V8" H 3315 2123 50  0000 C CNN
F 2 "" H 3300 1950 50  0001 C CNN
F 3 "" H 3300 1950 50  0001 C CNN
	1    3300 1950
	1    0    0    -1  
$EndComp
$Comp
L power:+1V8 #PWR?
U 1 1 62B8637F
P 3450 2950
F 0 "#PWR?" H 3450 2800 50  0001 C CNN
F 1 "+1V8" H 3465 3123 50  0000 C CNN
F 2 "" H 3450 2950 50  0001 C CNN
F 3 "" H 3450 2950 50  0001 C CNN
	1    3450 2950
	1    0    0    -1  
$EndComp
$Comp
L power:+1V8 #PWR?
U 1 1 62B867A1
P 5050 2950
F 0 "#PWR?" H 5050 2800 50  0001 C CNN
F 1 "+1V8" H 5065 3123 50  0000 C CNN
F 2 "" H 5050 2950 50  0001 C CNN
F 3 "" H 5050 2950 50  0001 C CNN
	1    5050 2950
	1    0    0    -1  
$EndComp
$EndSCHEMATC
