M48
; DRILL file {KiCad 5.1.12-84ad8e8a86~92~ubuntu18.04.1} date Tue 26 Apr 2022 04:36:19 PM CEST
; FORMAT={-:-/ absolute / inch / decimal}
; #@! TF.CreationDate,2022-04-26T16:36:19+02:00
; #@! TF.GenerationSoftware,Kicad,Pcbnew,5.1.12-84ad8e8a86~92~ubuntu18.04.1
; #@! TF.FileFunction,Plated,1,8,Blind
FMAT,2
INCH
T1C0.0079
%
G90
G05
T1
X5.6791Y-4.2325
X5.6791Y-4.2715
X5.8957Y-2.4608
X5.8957Y-2.4998
X5.8957Y-2.5789
X5.8957Y-2.6179
X5.9017Y-2.3868
X5.9293Y-2.3593
X5.9547Y-2.4018
X5.9547Y-2.4407
X5.9547Y-2.5199
X5.9547Y-2.5589
X5.9547Y-4.2325
X5.9547Y-4.2715
X5.9606Y-2.624
X5.9882Y-2.6516
X7.0374Y-2.0472
X7.0374Y-2.3425
X7.0965Y-2.8346
X7.0965Y-3.1299
X7.0965Y-3.6614
X7.0965Y-3.9567
T0
M30
