EESchema Schematic File Version 4
EELAYER 30 0
EELAYER END
$Descr A3 16535 11693
encoding utf-8
Sheet 5 6
Title "OpticalEVA FF-25Gx12 FMCP "
Date "2022-04-26"
Rev "1.0"
Comp "Karlsruhe Institute of Technology (KIT)"
Comment1 "IPE"
Comment2 "Luis Ardila"
Comment3 ""
Comment4 ""
$EndDescr
Wire Bus Line
	1100 1050 1250 1050
Wire Bus Line
	1100 950  1250 950 
Wire Bus Line
	1100 750  1250 750 
Wire Bus Line
	1100 650  1250 650 
Text HLabel 1100 1050 0    50   Input ~ 0
TX_P[0..23]
Text HLabel 1100 950  0    50   Input ~ 0
TX_N[0..23]
Text HLabel 1100 750  0    50   Output ~ 0
RX_P[0..23]
Text HLabel 1100 650  0    50   Output ~ 0
RX_N[0..23]
Text Label 13600 6300 0    50   ~ 0
TX_N11
Text Label 13600 6500 0    50   ~ 0
TX_N9
Text Label 13600 5700 0    50   ~ 0
TX_N8
Text Label 13600 5300 0    50   ~ 0
TX_N7
Text Label 13600 4900 0    50   ~ 0
TX_N6
Text Label 13600 5100 0    50   ~ 0
TX_N5
Text Label 13600 7100 0    50   ~ 0
TX_N0
Text Label 13600 6200 0    50   ~ 0
TX_P11
Text Label 13600 6400 0    50   ~ 0
TX_P9
Text Label 13600 5600 0    50   ~ 0
TX_P8
Text Label 13600 5200 0    50   ~ 0
TX_P7
Text Label 13600 4800 0    50   ~ 0
TX_P6
Text Label 13600 5000 0    50   ~ 0
TX_P5
Text Label 13600 7000 0    50   ~ 0
TX_P0
Text Label 13600 1600 0    50   ~ 0
RX_P11
Text Label 13600 2600 0    50   ~ 0
RX_P10
Text Label 13600 3400 0    50   ~ 0
RX_P9
Text Label 13600 2400 0    50   ~ 0
RX_P8
Text Label 13600 2200 0    50   ~ 0
RX_P7
Text Label 13600 1200 0    50   ~ 0
RX_P6
Text Label 13600 1800 0    50   ~ 0
RX_P4
Text Label 13600 2000 0    50   ~ 0
RX_P3
Text Label 13600 2800 0    50   ~ 0
RX_P2
Text Label 13600 3000 0    50   ~ 0
RX_P0
Text Label 13600 1700 0    50   ~ 0
RX_N11
Text Label 13600 2700 0    50   ~ 0
RX_N10
Text Label 13600 3500 0    50   ~ 0
RX_N9
Text Label 13600 2500 0    50   ~ 0
RX_N8
Text Label 13600 2300 0    50   ~ 0
RX_N7
Text Label 13600 1300 0    50   ~ 0
RX_N6
Text Label 13600 1900 0    50   ~ 0
RX_N4
Text Label 13600 2100 0    50   ~ 0
RX_N3
Text Label 13600 2900 0    50   ~ 0
RX_N2
Text Label 13600 3100 0    50   ~ 0
RX_N0
Text Notes 600  11100 0    100  ~ 0
NOTES:\n1) Phase match the differential pairs to within 100um skew\n2) Maintain more than 0.3mm clearance between trace and \nadjunct pads as wel ll as greater than 1.0mm clearance between adjacent high speed lines.\n3) Target 100 Ohm differeential impedance\n4) Use inductors with DC resistance of less than 0.1 Ohms.\n5) Power Consumption is 3V3 @ ?A and 3V8 @ ?A\n6) SN74AVC4T774RSV A high on DIR allows data transmission from An to Bn \nand a low on DIR allows data transmission from Bto A when OE is set to low.\n7) choose 3V3 (SEL = 0) for 16G or 3V8 (SEL = 1) for 25G, SEL and EN can interface to 1V8 directly\n8) FPF1320 has internal pull-down resistors in EN and SEL pins
$Comp
L Device:C C?
U 1 1 635336BA
P 10650 1500
AR Path="/5EF3A6E9/635336BA" Ref="C?"  Part="1" 
AR Path="/619269F2/635336BA" Ref="C?"  Part="1" 
AR Path="/619BA206/635336BA" Ref="C527"  Part="1" 
F 0 "C527" H 10535 1591 50  0000 R CNN
F 1 "0.1uF" H 10535 1500 50  0000 R CNN
F 2 "Capacitor_SMD:C_0402_1005Metric" H 10688 1350 50  0001 C CNN
F 3 "~" H 10650 1500 50  0001 C CNN
F 4 "0402, 16V" H 10535 1409 50  0000 R CNN "info"
F 5 "AVT-IPE" H 10650 1500 50  0001 C CNN "stock"
	1    10650 1500
	-1   0    0    -1  
$EndComp
$Comp
L power:GND #PWR?
U 1 1 63537CB6
P 10650 1650
F 0 "#PWR?" H 10650 1400 50  0001 C CNN
F 1 "GND" H 10655 1477 50  0000 C CNN
F 2 "" H 10650 1650 50  0001 C CNN
F 3 "" H 10650 1650 50  0001 C CNN
	1    10650 1650
	1    0    0    -1  
$EndComp
$Comp
L Device:C C?
U 1 1 63539E1C
P 10650 3250
AR Path="/5EF3A6E9/63539E1C" Ref="C?"  Part="1" 
AR Path="/619269F2/63539E1C" Ref="C?"  Part="1" 
AR Path="/619BA206/63539E1C" Ref="C528"  Part="1" 
F 0 "C528" H 10535 3341 50  0000 R CNN
F 1 "0.1uF" H 10535 3250 50  0000 R CNN
F 2 "Capacitor_SMD:C_0402_1005Metric" H 10688 3100 50  0001 C CNN
F 3 "~" H 10650 3250 50  0001 C CNN
F 4 "0402, 16V" H 10535 3159 50  0000 R CNN "info"
F 5 "AVT-IPE" H 10650 3250 50  0001 C CNN "stock"
	1    10650 3250
	-1   0    0    -1  
$EndComp
$Comp
L power:GND #PWR?
U 1 1 63539E22
P 10650 3400
F 0 "#PWR?" H 10650 3150 50  0001 C CNN
F 1 "GND" H 10655 3227 50  0000 C CNN
F 2 "" H 10650 3400 50  0001 C CNN
F 3 "" H 10650 3400 50  0001 C CNN
	1    10650 3400
	1    0    0    -1  
$EndComp
$Comp
L Device:C C?
U 1 1 6355FED4
P 10500 6800
AR Path="/5EF3A6E9/6355FED4" Ref="C?"  Part="1" 
AR Path="/619269F2/6355FED4" Ref="C?"  Part="1" 
AR Path="/619BA206/6355FED4" Ref="C526"  Part="1" 
F 0 "C526" H 10385 6891 50  0000 R CNN
F 1 "0.1uF" H 10385 6800 50  0000 R CNN
F 2 "Capacitor_SMD:C_0402_1005Metric" H 10538 6650 50  0001 C CNN
F 3 "~" H 10500 6800 50  0001 C CNN
F 4 "0402, 16V" H 10385 6709 50  0000 R CNN "info"
F 5 "AVT-IPE" H 10500 6800 50  0001 C CNN "stock"
	1    10500 6800
	-1   0    0    -1  
$EndComp
$Comp
L power:GND #PWR?
U 1 1 6355FEDA
P 10500 6950
F 0 "#PWR?" H 10500 6700 50  0001 C CNN
F 1 "GND" H 10505 6777 50  0000 C CNN
F 2 "" H 10500 6950 50  0001 C CNN
F 3 "" H 10500 6950 50  0001 C CNN
	1    10500 6950
	1    0    0    -1  
$EndComp
$Comp
L Device:C C?
U 1 1 63585EC0
P 10500 5050
AR Path="/5EF3A6E9/63585EC0" Ref="C?"  Part="1" 
AR Path="/619269F2/63585EC0" Ref="C?"  Part="1" 
AR Path="/619BA206/63585EC0" Ref="C525"  Part="1" 
F 0 "C525" H 10385 5141 50  0000 R CNN
F 1 "0.1uF" H 10385 5050 50  0000 R CNN
F 2 "Capacitor_SMD:C_0402_1005Metric" H 10538 4900 50  0001 C CNN
F 3 "~" H 10500 5050 50  0001 C CNN
F 4 "0402, 16V" H 10385 4959 50  0000 R CNN "info"
F 5 "AVT-IPE" H 10500 5050 50  0001 C CNN "stock"
	1    10500 5050
	-1   0    0    -1  
$EndComp
$Comp
L power:GND #PWR?
U 1 1 63585EC6
P 10500 5200
F 0 "#PWR?" H 10500 4950 50  0001 C CNN
F 1 "GND" H 10505 5027 50  0000 C CNN
F 2 "" H 10500 5200 50  0001 C CNN
F 3 "" H 10500 5200 50  0001 C CNN
	1    10500 5200
	1    0    0    -1  
$EndComp
Wire Wire Line
	10500 6650 10500 6600
Wire Wire Line
	10500 4900 10500 4850
Wire Wire Line
	10650 3100 10650 3050
Connection ~ 10650 3050
Wire Wire Line
	10650 1350 10650 1300
Connection ~ 10650 1300
Wire Wire Line
	1750 4850 1750 4800
Wire Wire Line
	2600 5450 2600 4850
Wire Wire Line
	1750 4850 1950 4850
Wire Wire Line
	1950 4900 1950 4850
Connection ~ 1950 4850
Wire Wire Line
	1950 4850 2600 4850
Wire Wire Line
	3650 4850 3650 4800
Wire Wire Line
	2800 5450 2800 4850
Wire Wire Line
	3650 4850 3450 4850
Wire Wire Line
	3450 4900 3450 4850
Connection ~ 3450 4850
Wire Wire Line
	3450 4850 2800 4850
$Comp
L power:GND #PWR?
U 1 1 64FD70FF
P 3450 5200
F 0 "#PWR?" H 3450 4950 50  0001 C CNN
F 1 "GND" H 3455 5027 50  0000 C CNN
F 2 "" H 3450 5200 50  0001 C CNN
F 3 "" H 3450 5200 50  0001 C CNN
	1    3450 5200
	1    0    0    -1  
$EndComp
$Comp
L power:GND #PWR?
U 1 1 64FD7105
P 1950 5200
F 0 "#PWR?" H 1950 4950 50  0001 C CNN
F 1 "GND" H 1955 5027 50  0000 C CNN
F 2 "" H 1950 5200 50  0001 C CNN
F 3 "" H 1950 5200 50  0001 C CNN
	1    1950 5200
	1    0    0    -1  
$EndComp
$Comp
L power:+3V3 #PWR?
U 1 1 64FD710B
P 3650 4800
F 0 "#PWR?" H 3650 4650 50  0001 C CNN
F 1 "+3V3" H 3665 4973 50  0000 C CNN
F 2 "" H 3650 4800 50  0001 C CNN
F 3 "" H 3650 4800 50  0001 C CNN
	1    3650 4800
	1    0    0    -1  
$EndComp
Text HLabel 1100 1250 0    50   Input ~ 0
SCL
Text HLabel 1100 1350 0    50   BiDi ~ 0
SDA
$Comp
L KIT_Logic_LevelTranslator:SN74AVC4T774RSV U502
U 1 1 6267BD36
P 2700 6050
F 0 "U502" H 2850 6700 50  0000 L CNN
F 1 "SN74AVC4T774RSV" H 3200 6600 50  0000 C CNN
F 2 "KIT_Package_DFN_QFN:UQFN-16_1.8x2.6_Pitch0.4mm" H 2700 4950 50  0001 C CNN
F 3 "https://www.ti.com/lit/ds/symlink/sn74avc4t774.pdf?ts=1637743747763&ref_url=https%253A%252F%252Fwww.google.com%252F" H 2650 5800 50  0001 C CNN
	1    2700 6050
	1    0    0    -1  
$EndComp
$Comp
L power:GND #PWR?
U 1 1 6287CB2C
P 2700 6650
F 0 "#PWR?" H 2700 6400 50  0001 C CNN
F 1 "GND" H 2705 6477 50  0000 C CNN
F 2 "" H 2700 6650 50  0001 C CNN
F 3 "" H 2700 6650 50  0001 C CNN
	1    2700 6650
	1    0    0    -1  
$EndComp
$Comp
L power:GND #PWR?
U 1 1 62F5A91E
P 2100 6650
F 0 "#PWR?" H 2100 6400 50  0001 C CNN
F 1 "GND" H 2105 6477 50  0000 C CNN
F 2 "" H 2100 6650 50  0001 C CNN
F 3 "" H 2100 6650 50  0001 C CNN
	1    2100 6650
	1    0    0    -1  
$EndComp
Wire Wire Line
	2100 6650 2100 5950
Wire Wire Line
	2100 5950 2200 5950
Wire Wire Line
	2200 5750 2100 5750
Wire Wire Line
	2100 5750 2100 5950
Connection ~ 2100 5950
$Comp
L power:GND #PWR?
U 1 1 63031D06
P 3350 6650
F 0 "#PWR?" H 3350 6400 50  0001 C CNN
F 1 "GND" H 3355 6477 50  0000 C CNN
F 2 "" H 3350 6650 50  0001 C CNN
F 3 "" H 3350 6650 50  0001 C CNN
	1    3350 6650
	1    0    0    -1  
$EndComp
Wire Wire Line
	3350 6650 3350 5950
Wire Wire Line
	3350 5950 3200 5950
Wire Wire Line
	1900 5800 1900 5850
Wire Wire Line
	1900 5850 2200 5850
Wire Wire Line
	3500 5800 3500 5850
Wire Wire Line
	3500 5850 3200 5850
$Comp
L Device:C C?
U 1 1 64FD70E6
P 1950 5050
AR Path="/5EF3A6E9/64FD70E6" Ref="C?"  Part="1" 
AR Path="/619269F2/64FD70E6" Ref="C?"  Part="1" 
AR Path="/619BA206/64FD70E6" Ref="C502"  Part="1" 
F 0 "C502" H 1835 5141 50  0000 R CNN
F 1 "0.1uF" H 1835 5050 50  0000 R CNN
F 2 "Capacitor_SMD:C_0402_1005Metric" H 1988 4900 50  0001 C CNN
F 3 "~" H 1950 5050 50  0001 C CNN
F 4 "0402, 16V" H 1835 4959 50  0000 R CNN "info"
F 5 "AVT-IPE" H 1950 5050 50  0001 C CNN "stock"
	1    1950 5050
	-1   0    0    -1  
$EndComp
$Comp
L Device:C C?
U 1 1 64FD70F4
P 3450 5050
AR Path="/5EF3A6E9/64FD70F4" Ref="C?"  Part="1" 
AR Path="/619269F2/64FD70F4" Ref="C?"  Part="1" 
AR Path="/619BA206/64FD70F4" Ref="C512"  Part="1" 
F 0 "C512" H 3335 5141 50  0000 R CNN
F 1 "0.1uF" H 3335 5050 50  0000 R CNN
F 2 "Capacitor_SMD:C_0402_1005Metric" H 3488 4900 50  0001 C CNN
F 3 "~" H 3450 5050 50  0001 C CNN
F 4 "0402, 16V" H 3335 4959 50  0000 R CNN "info"
F 5 "AVT-IPE" H 3450 5050 50  0001 C CNN "stock"
	1    3450 5050
	1    0    0    -1  
$EndComp
Text Label 13400 8600 0    50   ~ 0
RX_P21
Text Label 13400 8900 0    50   ~ 0
RX_P22
Text Label 13400 9200 0    50   ~ 0
RX_P23
Text Label 15500 8600 2    50   ~ 0
TX_P21
Text Label 15500 8900 2    50   ~ 0
TX_P22
Text Label 15500 9200 2    50   ~ 0
TX_P23
Text Label 15500 8700 2    50   ~ 0
TX_N21
Text Label 15500 9000 2    50   ~ 0
TX_N22
Text Label 15500 9300 2    50   ~ 0
TX_N23
Wire Wire Line
	13400 8600 14650 8600
Wire Wire Line
	13400 8700 14050 8700
$Comp
L Device:C C504
U 1 1 656D947D
P 14200 8700
F 0 "C504" V 14150 8800 50  0000 L CNN
F 1 "0.1uF" V 14150 8600 50  0000 R CNN
F 2 "Capacitor_SMD:C_0201_0603Metric" H 14238 8550 50  0001 C CNN
F 3 "~" H 14200 8700 50  0001 C CNN
F 4 "185-1596" H 14200 8700 50  0001 C CNN "rs#"
F 5 "0201, 25V, X5R, 10%" V 14040 8700 50  0001 C CNN "info"
F 6 "Luis" H 14200 8700 50  0001 C CNN "stock"
	1    14200 8700
	0    1    -1   0   
$EndComp
Wire Wire Line
	14350 8700 15500 8700
$Comp
L Device:C C508
U 1 1 656D9487
P 14800 8600
F 0 "C508" V 14750 8700 50  0000 L CNN
F 1 "0.1uF" V 14750 8500 50  0000 R CNN
F 2 "Capacitor_SMD:C_0201_0603Metric" H 14838 8450 50  0001 C CNN
F 3 "~" H 14800 8600 50  0001 C CNN
F 4 "185-1596" H 14800 8600 50  0001 C CNN "rs#"
F 5 "0201, 25V, X5R, 10%" V 14640 8600 50  0001 C CNN "info"
F 6 "Luis" H 14800 8600 50  0001 C CNN "stock"
	1    14800 8600
	0    1    -1   0   
$EndComp
Wire Wire Line
	14950 8600 15500 8600
Wire Wire Line
	13400 8900 14650 8900
Wire Wire Line
	13400 9000 14050 9000
$Comp
L Device:C C505
U 1 1 656F6E9F
P 14200 9000
F 0 "C505" V 14150 9100 50  0000 L CNN
F 1 "0.1uF" V 14150 8900 50  0000 R CNN
F 2 "Capacitor_SMD:C_0201_0603Metric" H 14238 8850 50  0001 C CNN
F 3 "~" H 14200 9000 50  0001 C CNN
F 4 "185-1596" H 14200 9000 50  0001 C CNN "rs#"
F 5 "0201, 25V, X5R, 10%" V 14040 9000 50  0001 C CNN "info"
F 6 "Luis" H 14200 9000 50  0001 C CNN "stock"
	1    14200 9000
	0    1    -1   0   
$EndComp
Wire Wire Line
	14350 9000 15500 9000
$Comp
L Device:C C509
U 1 1 656F6EA9
P 14800 8900
F 0 "C509" V 14750 9000 50  0000 L CNN
F 1 "0.1uF" V 14750 8800 50  0000 R CNN
F 2 "Capacitor_SMD:C_0201_0603Metric" H 14838 8750 50  0001 C CNN
F 3 "~" H 14800 8900 50  0001 C CNN
F 4 "185-1596" H 14800 8900 50  0001 C CNN "rs#"
F 5 "0201, 25V, X5R, 10%" V 14640 8900 50  0001 C CNN "info"
F 6 "Luis" H 14800 8900 50  0001 C CNN "stock"
	1    14800 8900
	0    1    -1   0   
$EndComp
Wire Wire Line
	14950 8900 15500 8900
Wire Wire Line
	13400 9200 14650 9200
Wire Wire Line
	13400 9300 14050 9300
$Comp
L Device:C C506
U 1 1 657154FC
P 14200 9300
F 0 "C506" V 14150 9400 50  0000 L CNN
F 1 "0.1uF" V 14150 9200 50  0000 R CNN
F 2 "Capacitor_SMD:C_0201_0603Metric" H 14238 9150 50  0001 C CNN
F 3 "~" H 14200 9300 50  0001 C CNN
F 4 "185-1596" H 14200 9300 50  0001 C CNN "rs#"
F 5 "0201, 25V, X5R, 10%" V 14040 9300 50  0001 C CNN "info"
F 6 "Luis" H 14200 9300 50  0001 C CNN "stock"
	1    14200 9300
	0    1    -1   0   
$EndComp
Wire Wire Line
	14350 9300 15500 9300
$Comp
L Device:C C510
U 1 1 65715506
P 14800 9200
F 0 "C510" V 14750 9300 50  0000 L CNN
F 1 "0.1uF" V 14750 9100 50  0000 R CNN
F 2 "Capacitor_SMD:C_0201_0603Metric" H 14838 9050 50  0001 C CNN
F 3 "~" H 14800 9200 50  0001 C CNN
F 4 "185-1596" H 14800 9200 50  0001 C CNN "rs#"
F 5 "0201, 25V, X5R, 10%" V 14640 9200 50  0001 C CNN "info"
F 6 "Luis" H 14800 9200 50  0001 C CNN "stock"
	1    14800 9200
	0    1    -1   0   
$EndComp
Wire Wire Line
	14950 9200 15500 9200
Text Label 10150 1300 0    50   ~ 0
+3V3_RX1
Text Label 10000 4850 0    50   ~ 0
+3V3_TX1
Text Label 10150 3050 0    50   ~ 0
+3V3_RX10
Text Label 10000 6600 0    50   ~ 0
+Vadj_FF_TX10
Text Label 13600 6000 0    50   ~ 0
TX_P2
Text Label 13600 6100 0    50   ~ 0
TX_N2
Text Label 13600 6600 0    50   ~ 0
TX_P10
Text Label 13600 6700 0    50   ~ 0
TX_N10
Text Label 13600 5800 0    50   ~ 0
TX_P3
Text Label 13600 5900 0    50   ~ 0
TX_N3
Text Label 13600 5400 0    50   ~ 0
TX_P4
Text Label 13600 5500 0    50   ~ 0
TX_N4
Text Label 13600 1500 0    50   ~ 0
RX_N5
Text Label 13600 1400 0    50   ~ 0
RX_P5
Text Label 13600 3300 0    50   ~ 0
RX_N1
Text Label 13600 3200 0    50   ~ 0
RX_P1
Text Label 13600 6900 0    50   ~ 0
TX_N1
Text Label 13600 6800 0    50   ~ 0
TX_P1
Wire Wire Line
	14950 8300 15500 8300
$Comp
L Device:C C507
U 1 1 65663299
P 14800 8300
F 0 "C507" V 14750 8400 50  0000 L CNN
F 1 "0.1uF" V 14750 8200 50  0000 R CNN
F 2 "Capacitor_SMD:C_0201_0603Metric" H 14838 8150 50  0001 C CNN
F 3 "~" H 14800 8300 50  0001 C CNN
F 4 "185-1596" H 14800 8300 50  0001 C CNN "rs#"
F 5 "0201, 25V, X5R, 10%" V 14950 8300 50  0000 C CNN "info"
F 6 "Luis" H 14800 8300 50  0001 C CNN "stock"
	1    14800 8300
	0    1    -1   0   
$EndComp
Wire Wire Line
	14350 8400 15500 8400
$Comp
L Device:C C503
U 1 1 6566328F
P 14200 8400
F 0 "C503" V 14150 8500 50  0000 L CNN
F 1 "0.1uF" V 14150 8300 50  0000 R CNN
F 2 "Capacitor_SMD:C_0201_0603Metric" H 14238 8250 50  0001 C CNN
F 3 "~" H 14200 8400 50  0001 C CNN
F 4 "185-1596" H 14200 8400 50  0001 C CNN "rs#"
F 5 "0201, 25V, X5R, 10%" V 14040 8400 50  0001 C CNN "info"
F 6 "Luis" H 14200 8400 50  0001 C CNN "stock"
	1    14200 8400
	0    1    -1   0   
$EndComp
Wire Wire Line
	13400 8400 14050 8400
Wire Wire Line
	13400 8300 14650 8300
Text Label 15500 8400 2    50   ~ 0
TX_N20
Text Label 15500 8300 2    50   ~ 0
TX_P20
Text Label 13400 8300 0    50   ~ 0
RX_P20
Text Label 13400 9300 0    50   ~ 0
RX_N23
Text Label 13400 9000 0    50   ~ 0
RX_N22
Text Label 13400 8700 0    50   ~ 0
RX_N21
Text Label 13400 8400 0    50   ~ 0
RX_N20
Wire Wire Line
	1100 1250 1250 1250
Wire Wire Line
	1100 1350 1250 1350
$Comp
L KIT_Connector:Samtec_FF_UCC8 J503
U 1 1 61B871A3
P 12150 1850
F 0 "J503" H 12550 2200 60  0000 L CNN
F 1 "Samtec_FF_UCC8" H 12200 2050 60  0000 L CNN
F 2 "KIT_Connector:SAMTEC_UCC8-010-1-H-S-1-A" H 12150 1850 50  0001 C CNN
F 3 "" H 12150 1850 50  0001 C CNN
	1    12150 1850
	1    0    0    -1  
$EndComp
$Comp
L KIT_Connector:Samtec_FF_R12_UEC5-2 J504
U 1 1 61B88148
P 14200 1200
F 0 "J504" H 14550 1550 60  0000 L CNN
F 1 "Samtec_FF_R12_UEC5-2" H 14100 1400 60  0000 L CNN
F 2 "KIT_Connector:SAMTEC_UEC5-019-2-XXX-D-RA-1" H 14450 -1400 50  0001 C CNN
F 3 "" H 14200 1200 50  0001 C CNN
	1    14200 1200
	1    0    0    -1  
$EndComp
$Comp
L KIT_Connector:Samtec_FF_T12_UEC5-2 J505
U 1 1 61B898BF
P 14200 4800
F 0 "J505" H 14600 5150 60  0000 L CNN
F 1 "Samtec_FF_T12_UEC5-2" H 14150 5000 60  0000 L CNN
F 2 "KIT_Connector:SAMTEC_UEC5-019-2-XXX-D-RA-1" H 14450 2200 50  0001 C CNN
F 3 "" H 14200 4800 50  0001 C CNN
	1    14200 4800
	1    0    0    -1  
$EndComp
$Comp
L KIT_Connector:Samtec_FF_UCC8 J502
U 1 1 61B8C8F9
P 12000 5400
F 0 "J502" H 12400 5700 60  0000 L CNN
F 1 "Samtec_FF_UCC8" H 12100 5600 60  0000 L CNN
F 2 "KIT_Connector:SAMTEC_UCC8-010-1-H-S-1-A" H 12000 5400 50  0001 C CNN
F 3 "" H 12000 5400 50  0001 C CNN
	1    12000 5400
	1    0    0    -1  
$EndComp
Wire Wire Line
	2200 3500 1500 3500
Wire Wire Line
	2200 3600 1500 3600
Text HLabel 1500 3500 0    50   Input ~ 0
RX_RESET_L
Text HLabel 1500 3600 0    50   Output ~ 0
RX_INT_L
Wire Wire Line
	1750 2200 1750 2150
Wire Wire Line
	2600 2800 2600 2200
Wire Wire Line
	1750 2200 1950 2200
Wire Wire Line
	1950 2250 1950 2200
Connection ~ 1950 2200
Wire Wire Line
	1950 2200 2600 2200
Wire Wire Line
	3650 2200 3650 2150
Wire Wire Line
	2800 2800 2800 2200
Wire Wire Line
	3650 2200 3450 2200
Wire Wire Line
	3450 2250 3450 2200
Connection ~ 3450 2200
Wire Wire Line
	3450 2200 2800 2200
$Comp
L power:GND #PWR?
U 1 1 61DA3542
P 3450 2550
F 0 "#PWR?" H 3450 2300 50  0001 C CNN
F 1 "GND" H 3455 2377 50  0000 C CNN
F 2 "" H 3450 2550 50  0001 C CNN
F 3 "" H 3450 2550 50  0001 C CNN
	1    3450 2550
	1    0    0    -1  
$EndComp
$Comp
L power:GND #PWR?
U 1 1 61DA3548
P 1950 2550
F 0 "#PWR?" H 1950 2300 50  0001 C CNN
F 1 "GND" H 1955 2377 50  0000 C CNN
F 2 "" H 1950 2550 50  0001 C CNN
F 3 "" H 1950 2550 50  0001 C CNN
	1    1950 2550
	1    0    0    -1  
$EndComp
$Comp
L power:+3V3 #PWR?
U 1 1 61DA354E
P 3650 2150
F 0 "#PWR?" H 3650 2000 50  0001 C CNN
F 1 "+3V3" H 3665 2323 50  0000 C CNN
F 2 "" H 3650 2150 50  0001 C CNN
F 3 "" H 3650 2150 50  0001 C CNN
	1    3650 2150
	1    0    0    -1  
$EndComp
$Comp
L KIT_Logic_LevelTranslator:SN74AVC4T774RSV U501
U 1 1 61DA3554
P 2700 3400
F 0 "U501" H 2850 4050 50  0000 L CNN
F 1 "SN74AVC4T774RSV" H 3200 3950 50  0000 C CNN
F 2 "KIT_Package_DFN_QFN:UQFN-16_1.8x2.6_Pitch0.4mm" H 2700 2300 50  0001 C CNN
F 3 "https://www.ti.com/lit/ds/symlink/sn74avc4t774.pdf?ts=1637743747763&ref_url=https%253A%252F%252Fwww.google.com%252F" H 2650 3150 50  0001 C CNN
	1    2700 3400
	1    0    0    -1  
$EndComp
$Comp
L power:GND #PWR?
U 1 1 61DA355A
P 2700 4000
F 0 "#PWR?" H 2700 3750 50  0001 C CNN
F 1 "GND" H 2705 3827 50  0000 C CNN
F 2 "" H 2700 4000 50  0001 C CNN
F 3 "" H 2700 4000 50  0001 C CNN
	1    2700 4000
	1    0    0    -1  
$EndComp
$Comp
L power:GND #PWR?
U 1 1 61DA3560
P 2100 4000
F 0 "#PWR?" H 2100 3750 50  0001 C CNN
F 1 "GND" H 2105 3827 50  0000 C CNN
F 2 "" H 2100 4000 50  0001 C CNN
F 3 "" H 2100 4000 50  0001 C CNN
	1    2100 4000
	1    0    0    -1  
$EndComp
Wire Wire Line
	2100 4000 2100 3300
Wire Wire Line
	2100 3300 2200 3300
Wire Wire Line
	2200 3100 2100 3100
Wire Wire Line
	2100 3100 2100 3300
Connection ~ 2100 3300
$Comp
L power:GND #PWR?
U 1 1 61DA356B
P 3350 4000
F 0 "#PWR?" H 3350 3750 50  0001 C CNN
F 1 "GND" H 3355 3827 50  0000 C CNN
F 2 "" H 3350 4000 50  0001 C CNN
F 3 "" H 3350 4000 50  0001 C CNN
	1    3350 4000
	1    0    0    -1  
$EndComp
Wire Wire Line
	3350 4000 3350 3300
Wire Wire Line
	3350 3300 3200 3300
Wire Wire Line
	1900 3150 1900 3200
Wire Wire Line
	1900 3200 2200 3200
Wire Wire Line
	3500 3150 3500 3200
Wire Wire Line
	3500 3200 3200 3200
$Comp
L Device:C C?
U 1 1 61DA3585
P 1950 2400
AR Path="/5EF3A6E9/61DA3585" Ref="C?"  Part="1" 
AR Path="/619269F2/61DA3585" Ref="C?"  Part="1" 
AR Path="/619BA206/61DA3585" Ref="C501"  Part="1" 
F 0 "C501" H 1835 2491 50  0000 R CNN
F 1 "0.1uF" H 1835 2400 50  0000 R CNN
F 2 "Capacitor_SMD:C_0402_1005Metric" H 1988 2250 50  0001 C CNN
F 3 "~" H 1950 2400 50  0001 C CNN
F 4 "0402, 16V" H 1835 2309 50  0000 R CNN "info"
F 5 "AVT-IPE" H 1950 2400 50  0001 C CNN "stock"
	1    1950 2400
	-1   0    0    -1  
$EndComp
$Comp
L Device:C C?
U 1 1 61DA358D
P 3450 2400
AR Path="/5EF3A6E9/61DA358D" Ref="C?"  Part="1" 
AR Path="/619269F2/61DA358D" Ref="C?"  Part="1" 
AR Path="/619BA206/61DA358D" Ref="C511"  Part="1" 
F 0 "C511" H 3335 2491 50  0000 R CNN
F 1 "0.1uF" H 3335 2400 50  0000 R CNN
F 2 "Capacitor_SMD:C_0402_1005Metric" H 3488 2250 50  0001 C CNN
F 3 "~" H 3450 2400 50  0001 C CNN
F 4 "0402, 16V" H 3335 2309 50  0000 R CNN "info"
F 5 "AVT-IPE" H 3450 2400 50  0001 C CNN "stock"
	1    3450 2400
	1    0    0    -1  
$EndComp
Wire Wire Line
	3200 3500 4150 3500
Text Label 4150 3500 2    50   ~ 0
RX_RESET_L_HS
Wire Wire Line
	3200 3600 4150 3600
Text HLabel 1500 3700 0    50   Input ~ 0
RX_SELECT_L
Text HLabel 1500 3800 0    50   Output ~ 0
RX_PRESENT_L
Wire Wire Line
	1500 3700 2200 3700
Wire Wire Line
	2200 3800 1500 3800
Wire Wire Line
	3200 3700 4150 3700
Wire Wire Line
	3200 3800 4150 3800
Text Label 4150 3700 2    50   ~ 0
RX_SELECT_L_HS
Text Label 4150 3800 2    50   ~ 0
RX_PRESENT_L_HS
Text Label 4150 3600 2    50   ~ 0
RX_INT_L_HS
Wire Wire Line
	2200 6150 1500 6150
Wire Wire Line
	2200 6250 1500 6250
Text HLabel 1500 6150 0    50   Input ~ 0
TX_RESET_L
Text HLabel 1500 6250 0    50   Output ~ 0
TX_INT_L
Text HLabel 1500 6350 0    50   Input ~ 0
TX_SELECT_L
Text HLabel 1500 6450 0    50   Output ~ 0
TX_PRESENT_L
Wire Wire Line
	1500 6350 2200 6350
Wire Wire Line
	2200 6450 1500 6450
Wire Wire Line
	3200 6150 4150 6150
Text Label 4150 6150 2    50   ~ 0
TX_RESET_L_HS
Wire Wire Line
	3200 6250 4150 6250
Wire Wire Line
	3200 6350 4150 6350
Wire Wire Line
	3200 6450 4150 6450
Text Label 4150 6350 2    50   ~ 0
TX_SELECT_L_HS
Text Label 4150 6450 2    50   ~ 0
TX_PRESENT_L_HS
Text Label 4150 6250 2    50   ~ 0
TX_INT_L_HS
Text Label 1250 1250 0    50   ~ 0
SCL
Text Label 1250 1350 0    50   ~ 0
SDA
Wire Wire Line
	12150 2350 11200 2350
Text Label 11200 2350 0    50   ~ 0
RX_RESET_L_HS
Wire Wire Line
	12150 2250 11200 2250
Wire Wire Line
	12150 2150 11200 2150
Wire Wire Line
	12150 2050 11200 2050
Text Label 11200 2150 0    50   ~ 0
RX_SELECT_L_HS
Text Label 11200 2050 0    50   ~ 0
RX_PRESENT_L_HS
Text Label 11200 2250 0    50   ~ 0
RX_INT_L_HS
Wire Wire Line
	10650 3050 11600 3050
Wire Wire Line
	12150 1950 12000 1950
Wire Wire Line
	12000 1950 12000 2850
$Comp
L power:GND #PWR?
U 1 1 620E2576
P 12000 3400
F 0 "#PWR?" H 12000 3150 50  0001 C CNN
F 1 "GND" H 12005 3227 50  0000 C CNN
F 2 "" H 12000 3400 50  0001 C CNN
F 3 "" H 12000 3400 50  0001 C CNN
	1    12000 3400
	1    0    0    -1  
$EndComp
Wire Wire Line
	12150 2850 12000 2850
Connection ~ 12000 2850
Wire Wire Line
	12150 2950 12000 2950
Wire Wire Line
	12000 2850 12000 2950
Connection ~ 12000 2950
Wire Wire Line
	12000 2950 12000 3400
Wire Wire Line
	12150 2750 11600 2750
Wire Wire Line
	11600 2750 11600 3050
Wire Wire Line
	11600 1300 11600 1850
Wire Wire Line
	11600 1850 12150 1850
Wire Wire Line
	10650 1300 11600 1300
NoConn ~ 12150 2650
Text Label 11200 2550 0    50   ~ 0
SCL
Text Label 11200 2450 0    50   ~ 0
SDA
Wire Wire Line
	11200 2450 12150 2450
Wire Wire Line
	11200 2550 12150 2550
Wire Wire Line
	10500 6600 10950 6600
Wire Wire Line
	11450 6300 11450 6600
Wire Wire Line
	11450 6300 12000 6300
Wire Wire Line
	11450 4850 11450 5400
Wire Wire Line
	11450 5400 12000 5400
Wire Wire Line
	10500 4850 10950 4850
Connection ~ 10500 4850
Connection ~ 10500 6600
NoConn ~ 12000 6200
Wire Wire Line
	11850 5500 11850 6400
$Comp
L power:GND #PWR?
U 1 1 6235A20D
P 11850 6950
F 0 "#PWR?" H 11850 6700 50  0001 C CNN
F 1 "GND" H 11855 6777 50  0000 C CNN
F 2 "" H 11850 6950 50  0001 C CNN
F 3 "" H 11850 6950 50  0001 C CNN
	1    11850 6950
	1    0    0    -1  
$EndComp
Wire Wire Line
	12000 6400 11850 6400
Connection ~ 11850 6400
Wire Wire Line
	12000 6500 11850 6500
Wire Wire Line
	11850 6400 11850 6500
Connection ~ 11850 6500
Wire Wire Line
	11850 6500 11850 6950
Wire Wire Line
	12000 5500 11850 5500
Wire Wire Line
	12000 5900 11050 5900
Text Label 11050 5900 0    50   ~ 0
TX_RESET_L_HS
Wire Wire Line
	12000 5700 11050 5700
Wire Wire Line
	12000 5600 11050 5600
Text Label 11050 5700 0    50   ~ 0
TX_SELECT_L_HS
Text Label 11050 5600 0    50   ~ 0
TX_PRESENT_L_HS
Text Label 11050 5800 0    50   ~ 0
TX_INT_L_HS
Wire Wire Line
	12000 5800 11050 5800
Text Label 11050 6100 0    50   ~ 0
SCL
Text Label 11050 6000 0    50   ~ 0
SDA
Wire Wire Line
	11050 6000 12000 6000
Wire Wire Line
	11050 6100 12000 6100
Wire Wire Line
	15500 3500 15650 3500
Wire Wire Line
	15650 3500 15650 3750
$Comp
L power:GND #PWR?
U 1 1 625A0697
P 15650 3750
F 0 "#PWR?" H 15650 3500 50  0001 C CNN
F 1 "GND" H 15655 3577 50  0000 C CNN
F 2 "" H 15650 3750 50  0001 C CNN
F 3 "" H 15650 3750 50  0001 C CNN
	1    15650 3750
	1    0    0    -1  
$EndComp
Wire Wire Line
	15500 7100 15650 7100
Wire Wire Line
	15650 7100 15650 7350
$Comp
L power:GND #PWR?
U 1 1 625A1827
P 15650 7350
F 0 "#PWR?" H 15650 7100 50  0001 C CNN
F 1 "GND" H 15655 7177 50  0000 C CNN
F 2 "" H 15650 7350 50  0001 C CNN
F 3 "" H 15650 7350 50  0001 C CNN
	1    15650 7350
	1    0    0    -1  
$EndComp
Wire Wire Line
	9900 1300 10650 1300
Wire Wire Line
	9900 3050 10650 3050
Wire Wire Line
	9750 4850 10500 4850
Wire Wire Line
	9750 6600 10500 6600
Text Label 8100 6600 0    50   ~ 0
+Vadj_FF_TX
Text Notes 7100 7450 0    100  ~ 0
7)
Wire Wire Line
	5250 6700 5950 6700
Wire Wire Line
	5250 6450 5250 6700
Wire Wire Line
	5650 6600 5950 6600
Wire Wire Line
	5650 6450 5650 6600
$Comp
L power:+3V8 #PWR?
U 1 1 625CD70B
P 5250 6450
F 0 "#PWR?" H 5250 6300 50  0001 C CNN
F 1 "+3V8" H 5265 6623 50  0000 C CNN
F 2 "" H 5250 6450 50  0001 C CNN
F 3 "" H 5250 6450 50  0001 C CNN
	1    5250 6450
	-1   0    0    -1  
$EndComp
$Comp
L power:+3V3 #PWR?
U 1 1 62101056
P 7850 3000
F 0 "#PWR?" H 7850 2850 50  0001 C CNN
F 1 "+3V3" H 7865 3173 50  0000 C CNN
F 2 "" H 7850 3000 50  0001 C CNN
F 3 "" H 7850 3000 50  0001 C CNN
	1    7850 3000
	1    0    0    -1  
$EndComp
$Comp
L power:GND #PWR?
U 1 1 62100B86
P 9750 5200
F 0 "#PWR?" H 9750 4950 50  0001 C CNN
F 1 "GND" H 9755 5027 50  0000 C CNN
F 2 "" H 9750 5200 50  0001 C CNN
F 3 "" H 9750 5200 50  0001 C CNN
	1    9750 5200
	1    0    0    -1  
$EndComp
$Comp
L power:GND #PWR?
U 1 1 621007FD
P 9900 3400
F 0 "#PWR?" H 9900 3150 50  0001 C CNN
F 1 "GND" H 9905 3227 50  0000 C CNN
F 2 "" H 9900 3400 50  0001 C CNN
F 3 "" H 9900 3400 50  0001 C CNN
	1    9900 3400
	1    0    0    -1  
$EndComp
$Comp
L power:GND #PWR?
U 1 1 62100595
P 9900 1650
F 0 "#PWR?" H 9900 1400 50  0001 C CNN
F 1 "GND" H 9905 1477 50  0000 C CNN
F 2 "" H 9900 1650 50  0001 C CNN
F 3 "" H 9900 1650 50  0001 C CNN
	1    9900 1650
	1    0    0    -1  
$EndComp
$Comp
L power:GND #PWR?
U 1 1 6382FDDF
P 9750 6950
F 0 "#PWR?" H 9750 6700 50  0001 C CNN
F 1 "GND" H 9755 6777 50  0000 C CNN
F 2 "" H 9750 6950 50  0001 C CNN
F 3 "" H 9750 6950 50  0001 C CNN
	1    9750 6950
	1    0    0    -1  
$EndComp
$Comp
L Device:L_Core_Ferrite L502
U 1 1 6348C196
P 9300 6600
F 0 "L502" V 9525 6600 50  0000 C CNN
F 1 "BLM18SG260TZ1D" V 9434 6600 50  0000 C CNN
F 2 "Inductor_SMD:L_0603_1608Metric" H 9300 6600 50  0001 C CNN
F 3 "https://www.murata.com/en-us/products/productdata/8796750610462/QNFA9122.pdf" V 9440 6600 50  0001 C CNN
F 4 "Murata Electronics" V 9300 6600 50  0001 C CNN "manf"
F 5 "BLM18SG260TZ1D" V 9300 6600 50  0001 C CNN "manf#"
F 6 "Ferrite Bead, 0603, 6A, 7mOhm, 26Ohm @ 100MHz" V 9300 6600 50  0001 C CNN "info"
F 7 "BLM18SG260TZ1D-ND" V 9300 6600 50  0001 C CNN "digikey#"
F 8 "223-4932" V 9300 6600 50  0001 C CNN "rs#"
	1    9300 6600
	0    -1   -1   0   
$EndComp
$Comp
L Device:L_Core_Ferrite L501
U 1 1 6348B73B
P 9300 4850
F 0 "L501" V 9525 4850 50  0000 C CNN
F 1 "BLM18SG260TZ1D" V 9434 4850 50  0000 C CNN
F 2 "Inductor_SMD:L_0603_1608Metric" H 9300 4850 50  0001 C CNN
F 3 "https://www.murata.com/en-us/products/productdata/8796750610462/QNFA9122.pdf" V 9440 4850 50  0001 C CNN
F 4 "Murata Electronics" V 9300 4850 50  0001 C CNN "manf"
F 5 "BLM18SG260TZ1D" V 9300 4850 50  0001 C CNN "manf#"
F 6 "Ferrite Bead, 0603, 6A, 7mOhm, 26Ohm @ 100MHz" V 9300 4850 50  0001 C CNN "info"
F 7 "BLM18SG260TZ1D-ND" V 9300 4850 50  0001 C CNN "digikey#"
F 8 "223-4932" V 9300 4850 50  0001 C CNN "rs#"
	1    9300 4850
	0    -1   -1   0   
$EndComp
$Comp
L Device:L_Core_Ferrite L504
U 1 1 63489EE2
P 9450 3050
F 0 "L504" V 9675 3050 50  0000 C CNN
F 1 "BLM18SG260TZ1D" V 9584 3050 50  0000 C CNN
F 2 "Inductor_SMD:L_0603_1608Metric" H 9450 3050 50  0001 C CNN
F 3 "https://www.murata.com/en-us/products/productdata/8796750610462/QNFA9122.pdf" V 9590 3050 50  0001 C CNN
F 4 "Murata Electronics" V 9450 3050 50  0001 C CNN "manf"
F 5 "BLM18SG260TZ1D" V 9450 3050 50  0001 C CNN "manf#"
F 6 "Ferrite Bead, 0603, 6A, 7mOhm, 26Ohm @ 100MHz" V 9450 3050 50  0001 C CNN "info"
F 7 "BLM18SG260TZ1D-ND" V 9450 3050 50  0001 C CNN "digikey#"
F 8 "223-4932" V 9450 3050 50  0001 C CNN "rs#"
	1    9450 3050
	0    -1   -1   0   
$EndComp
$Comp
L power:+3V3 #PWR?
U 1 1 6403E3B6
P 5650 6450
F 0 "#PWR?" H 5650 6300 50  0001 C CNN
F 1 "+3V3" H 5665 6623 50  0000 C CNN
F 2 "" H 5650 6450 50  0001 C CNN
F 3 "" H 5650 6450 50  0001 C CNN
	1    5650 6450
	-1   0    0    -1  
$EndComp
$Comp
L power:+3V3 #PWR?
U 1 1 6403A7A5
P 7850 1250
F 0 "#PWR?" H 7850 1100 50  0001 C CNN
F 1 "+3V3" H 7865 1423 50  0000 C CNN
F 2 "" H 7850 1250 50  0001 C CNN
F 3 "" H 7850 1250 50  0001 C CNN
	1    7850 1250
	1    0    0    -1  
$EndComp
Connection ~ 8150 1300
Wire Wire Line
	8150 1300 7850 1300
Wire Wire Line
	7850 1300 7850 1250
Wire Wire Line
	8800 1300 8150 1300
Connection ~ 8800 1300
Wire Wire Line
	9300 1300 8800 1300
Wire Wire Line
	8150 1350 8150 1300
$Comp
L power:GND #PWR?
U 1 1 63CEF020
P 8150 1650
F 0 "#PWR?" H 8150 1400 50  0001 C CNN
F 1 "GND" H 8155 1477 50  0000 C CNN
F 2 "" H 8150 1650 50  0001 C CNN
F 3 "" H 8150 1650 50  0001 C CNN
	1    8150 1650
	1    0    0    -1  
$EndComp
$Comp
L Device:C C?
U 1 1 63CEF01A
P 8150 1500
AR Path="/5EF3A6E9/63CEF01A" Ref="C?"  Part="1" 
AR Path="/619269F2/63CEF01A" Ref="C?"  Part="1" 
AR Path="/619BA206/63CEF01A" Ref="C515"  Part="1" 
F 0 "C515" H 8035 1591 50  0000 R CNN
F 1 "10uF" H 8035 1500 50  0000 R CNN
F 2 "Capacitor_SMD:C_0805_2012Metric" H 8188 1350 50  0001 C CNN
F 3 "~" H 8150 1500 50  0001 C CNN
F 4 "0805, 16V" H 8035 1409 50  0000 R CNN "info"
F 5 "AVT-IPE" H 8150 1500 50  0001 C CNN "stock"
	1    8150 1500
	-1   0    0    -1  
$EndComp
Wire Wire Line
	8800 1350 8800 1300
$Comp
L power:GND #PWR?
U 1 1 63CEF011
P 8800 1650
F 0 "#PWR?" H 8800 1400 50  0001 C CNN
F 1 "GND" H 8805 1477 50  0000 C CNN
F 2 "" H 8800 1650 50  0001 C CNN
F 3 "" H 8800 1650 50  0001 C CNN
	1    8800 1650
	1    0    0    -1  
$EndComp
$Comp
L Device:C C?
U 1 1 63CEF00B
P 8800 1500
AR Path="/5EF3A6E9/63CEF00B" Ref="C?"  Part="1" 
AR Path="/619269F2/63CEF00B" Ref="C?"  Part="1" 
AR Path="/619BA206/63CEF00B" Ref="C519"  Part="1" 
F 0 "C519" H 8685 1591 50  0000 R CNN
F 1 "0.1uF" H 8685 1500 50  0000 R CNN
F 2 "Capacitor_SMD:C_0402_1005Metric" H 8838 1350 50  0001 C CNN
F 3 "~" H 8800 1500 50  0001 C CNN
F 4 "0402, 16V" H 8685 1409 50  0000 R CNN "info"
F 5 "AVT-IPE" H 8800 1500 50  0001 C CNN "stock"
	1    8800 1500
	-1   0    0    -1  
$EndComp
Wire Wire Line
	8800 3050 8150 3050
Connection ~ 8800 3050
Wire Wire Line
	8150 3050 7850 3050
Connection ~ 8150 3050
Wire Wire Line
	7850 3050 7850 3000
Wire Wire Line
	9300 3050 8800 3050
Wire Wire Line
	8150 3100 8150 3050
$Comp
L power:GND #PWR?
U 1 1 63CBBA14
P 8150 3400
F 0 "#PWR?" H 8150 3150 50  0001 C CNN
F 1 "GND" H 8155 3227 50  0000 C CNN
F 2 "" H 8150 3400 50  0001 C CNN
F 3 "" H 8150 3400 50  0001 C CNN
	1    8150 3400
	1    0    0    -1  
$EndComp
$Comp
L Device:C C?
U 1 1 63CBBA0E
P 8150 3250
AR Path="/5EF3A6E9/63CBBA0E" Ref="C?"  Part="1" 
AR Path="/619269F2/63CBBA0E" Ref="C?"  Part="1" 
AR Path="/619BA206/63CBBA0E" Ref="C516"  Part="1" 
F 0 "C516" H 8035 3341 50  0000 R CNN
F 1 "22uF" H 8035 3250 50  0000 R CNN
F 2 "Capacitor_SMD:C_0805_2012Metric" H 8188 3100 50  0001 C CNN
F 3 "~" H 8150 3250 50  0001 C CNN
F 4 "0805,10V" H 8035 3159 50  0000 R CNN "info"
F 5 "AVT-IPE" H 8150 3250 50  0001 C CNN "stock"
	1    8150 3250
	-1   0    0    -1  
$EndComp
Wire Wire Line
	8800 3100 8800 3050
$Comp
L power:GND #PWR?
U 1 1 63CBBA05
P 8800 3400
F 0 "#PWR?" H 8800 3150 50  0001 C CNN
F 1 "GND" H 8805 3227 50  0000 C CNN
F 2 "" H 8800 3400 50  0001 C CNN
F 3 "" H 8800 3400 50  0001 C CNN
	1    8800 3400
	1    0    0    -1  
$EndComp
$Comp
L Device:C C?
U 1 1 63CBB9FF
P 8800 3250
AR Path="/5EF3A6E9/63CBB9FF" Ref="C?"  Part="1" 
AR Path="/619269F2/63CBB9FF" Ref="C?"  Part="1" 
AR Path="/619BA206/63CBB9FF" Ref="C520"  Part="1" 
F 0 "C520" H 8685 3341 50  0000 R CNN
F 1 "0.1uF" H 8685 3250 50  0000 R CNN
F 2 "Capacitor_SMD:C_0402_1005Metric" H 8838 3100 50  0001 C CNN
F 3 "~" H 8800 3250 50  0001 C CNN
F 4 "0402, 16V" H 8685 3159 50  0000 R CNN "info"
F 5 "AVT-IPE" H 8800 3250 50  0001 C CNN "stock"
	1    8800 3250
	-1   0    0    -1  
$EndComp
Wire Wire Line
	8650 4850 8000 4850
Connection ~ 8650 4850
Wire Wire Line
	9150 4850 8650 4850
Wire Wire Line
	8000 4900 8000 4850
$Comp
L power:GND #PWR?
U 1 1 63C8973E
P 8000 5200
F 0 "#PWR?" H 8000 4950 50  0001 C CNN
F 1 "GND" H 8005 5027 50  0000 C CNN
F 2 "" H 8000 5200 50  0001 C CNN
F 3 "" H 8000 5200 50  0001 C CNN
	1    8000 5200
	1    0    0    -1  
$EndComp
$Comp
L Device:C C?
U 1 1 63C89738
P 8000 5050
AR Path="/5EF3A6E9/63C89738" Ref="C?"  Part="1" 
AR Path="/619269F2/63C89738" Ref="C?"  Part="1" 
AR Path="/619BA206/63C89738" Ref="C513"  Part="1" 
F 0 "C513" H 7885 5141 50  0000 R CNN
F 1 "10uF" H 7885 5050 50  0000 R CNN
F 2 "Capacitor_SMD:C_0805_2012Metric" H 8038 4900 50  0001 C CNN
F 3 "~" H 8000 5050 50  0001 C CNN
F 4 "0805, 16V" H 7885 4959 50  0000 R CNN "info"
F 5 "AVT-IPE" H 8000 5050 50  0001 C CNN "stock"
	1    8000 5050
	-1   0    0    -1  
$EndComp
Wire Wire Line
	8650 4900 8650 4850
$Comp
L power:GND #PWR?
U 1 1 63C8972F
P 8650 5200
F 0 "#PWR?" H 8650 4950 50  0001 C CNN
F 1 "GND" H 8655 5027 50  0000 C CNN
F 2 "" H 8650 5200 50  0001 C CNN
F 3 "" H 8650 5200 50  0001 C CNN
	1    8650 5200
	1    0    0    -1  
$EndComp
$Comp
L Device:C C?
U 1 1 63C89729
P 8650 5050
AR Path="/5EF3A6E9/63C89729" Ref="C?"  Part="1" 
AR Path="/619269F2/63C89729" Ref="C?"  Part="1" 
AR Path="/619BA206/63C89729" Ref="C517"  Part="1" 
F 0 "C517" H 8535 5141 50  0000 R CNN
F 1 "0.1uF" H 8535 5050 50  0000 R CNN
F 2 "Capacitor_SMD:C_0402_1005Metric" H 8688 4900 50  0001 C CNN
F 3 "~" H 8650 5050 50  0001 C CNN
F 4 "0402, 16V" H 8535 4959 50  0000 R CNN "info"
F 5 "AVT-IPE" H 8650 5050 50  0001 C CNN "stock"
	1    8650 5050
	-1   0    0    -1  
$EndComp
Wire Wire Line
	8650 6600 8000 6600
Connection ~ 8650 6600
Wire Wire Line
	9150 6600 8650 6600
Wire Wire Line
	8000 6650 8000 6600
$Comp
L power:GND #PWR?
U 1 1 63BCBAD6
P 8000 6950
F 0 "#PWR?" H 8000 6700 50  0001 C CNN
F 1 "GND" H 8005 6777 50  0000 C CNN
F 2 "" H 8000 6950 50  0001 C CNN
F 3 "" H 8000 6950 50  0001 C CNN
	1    8000 6950
	1    0    0    -1  
$EndComp
$Comp
L Device:C C?
U 1 1 63BCBAD0
P 8000 6800
AR Path="/5EF3A6E9/63BCBAD0" Ref="C?"  Part="1" 
AR Path="/619269F2/63BCBAD0" Ref="C?"  Part="1" 
AR Path="/619BA206/63BCBAD0" Ref="C514"  Part="1" 
F 0 "C514" H 7885 6891 50  0000 R CNN
F 1 "22uF" H 7885 6800 50  0000 R CNN
F 2 "Capacitor_SMD:C_0805_2012Metric" H 8038 6650 50  0001 C CNN
F 3 "~" H 8000 6800 50  0001 C CNN
F 4 "0805,10V" H 7885 6709 50  0000 R CNN "info"
F 5 "AVT-IPE" H 8000 6800 50  0001 C CNN "stock"
	1    8000 6800
	-1   0    0    -1  
$EndComp
Wire Wire Line
	8650 6650 8650 6600
$Comp
L power:GND #PWR?
U 1 1 63BCBAC7
P 8650 6950
F 0 "#PWR?" H 8650 6700 50  0001 C CNN
F 1 "GND" H 8655 6777 50  0000 C CNN
F 2 "" H 8650 6950 50  0001 C CNN
F 3 "" H 8650 6950 50  0001 C CNN
	1    8650 6950
	1    0    0    -1  
$EndComp
$Comp
L Device:C C?
U 1 1 63BCBAC1
P 8650 6800
AR Path="/5EF3A6E9/63BCBAC1" Ref="C?"  Part="1" 
AR Path="/619269F2/63BCBAC1" Ref="C?"  Part="1" 
AR Path="/619BA206/63BCBAC1" Ref="C518"  Part="1" 
F 0 "C518" H 8535 6891 50  0000 R CNN
F 1 "0.1uF" H 8535 6800 50  0000 R CNN
F 2 "Capacitor_SMD:C_0402_1005Metric" H 8688 6650 50  0001 C CNN
F 3 "~" H 8650 6800 50  0001 C CNN
F 4 "0402, 16V" H 8535 6709 50  0000 R CNN "info"
F 5 "AVT-IPE" H 8650 6800 50  0001 C CNN "stock"
	1    8650 6800
	-1   0    0    -1  
$EndComp
Wire Wire Line
	9750 4850 9450 4850
Connection ~ 9750 4850
Wire Wire Line
	9900 1300 9600 1300
Connection ~ 9900 1300
$Comp
L Device:C C?
U 1 1 63A8742F
P 9900 1500
AR Path="/5EF3A6E9/63A8742F" Ref="C?"  Part="1" 
AR Path="/619269F2/63A8742F" Ref="C?"  Part="1" 
AR Path="/619BA206/63A8742F" Ref="C523"  Part="1" 
F 0 "C523" H 9785 1591 50  0000 R CNN
F 1 "47uF" H 9785 1500 50  0000 R CNN
F 2 "Capacitor_SMD:C_0805_2012Metric" H 9938 1350 50  0001 C CNN
F 3 "~" H 9900 1500 50  0001 C CNN
F 4 "0805, 10V" H 9785 1409 50  0000 R CNN "info"
F 5 "AVT-IPE" H 9900 1500 50  0001 C CNN "stock"
	1    9900 1500
	-1   0    0    -1  
$EndComp
Wire Wire Line
	9900 1350 9900 1300
Wire Wire Line
	9900 3050 9600 3050
Connection ~ 9900 3050
Wire Wire Line
	9900 3100 9900 3050
Wire Wire Line
	9750 4900 9750 4850
$Comp
L Device:C C?
U 1 1 63A5A94F
P 9750 5050
AR Path="/5EF3A6E9/63A5A94F" Ref="C?"  Part="1" 
AR Path="/619269F2/63A5A94F" Ref="C?"  Part="1" 
AR Path="/619BA206/63A5A94F" Ref="C521"  Part="1" 
F 0 "C521" H 9635 5141 50  0000 R CNN
F 1 "47uF" H 9635 5050 50  0000 R CNN
F 2 "Capacitor_SMD:C_0805_2012Metric" H 9788 4900 50  0001 C CNN
F 3 "~" H 9750 5050 50  0001 C CNN
F 4 "0805, 10V" H 9635 4959 50  0000 R CNN "info"
F 5 "AVT-IPE" H 9750 5050 50  0001 C CNN "stock"
	1    9750 5050
	-1   0    0    -1  
$EndComp
Wire Wire Line
	9750 6600 9450 6600
Connection ~ 9750 6600
Wire Wire Line
	9750 6650 9750 6600
$Comp
L Device:C C?
U 1 1 63A0143A
P 9750 6800
AR Path="/5EF3A6E9/63A0143A" Ref="C?"  Part="1" 
AR Path="/619269F2/63A0143A" Ref="C?"  Part="1" 
AR Path="/619BA206/63A0143A" Ref="C522"  Part="1" 
F 0 "C522" H 9635 6891 50  0000 R CNN
F 1 "47uF" H 9635 6800 50  0000 R CNN
F 2 "Capacitor_SMD:C_0805_2012Metric" H 9788 6650 50  0001 C CNN
F 3 "~" H 9750 6800 50  0001 C CNN
F 4 "0805, 10V" H 9635 6709 50  0000 R CNN "info"
F 5 "AVT-IPE" H 9750 6800 50  0001 C CNN "stock"
	1    9750 6800
	-1   0    0    -1  
$EndComp
$Comp
L Device:C C?
U 1 1 639A8685
P 9900 3250
AR Path="/5EF3A6E9/639A8685" Ref="C?"  Part="1" 
AR Path="/619269F2/639A8685" Ref="C?"  Part="1" 
AR Path="/619BA206/639A8685" Ref="C524"  Part="1" 
F 0 "C524" H 9785 3341 50  0000 R CNN
F 1 "47uF" H 9785 3250 50  0000 R CNN
F 2 "Capacitor_SMD:C_0805_2012Metric" H 9938 3100 50  0001 C CNN
F 3 "~" H 9900 3250 50  0001 C CNN
F 4 "0805, 10V" H 9785 3159 50  0000 R CNN "info"
F 5 "AVT-IPE" H 9900 3250 50  0001 C CNN "stock"
	1    9900 3250
	-1   0    0    -1  
$EndComp
$Comp
L Device:L_Core_Ferrite L503
U 1 1 639757F0
P 9450 1300
F 0 "L503" V 9765 1300 50  0000 C CNN
F 1 "BLM18SG260TZ1D" V 9674 1300 50  0000 C CNN
F 2 "Inductor_SMD:L_0603_1608Metric" H 9450 1300 50  0001 C CNN
F 3 "https://www.murata.com/en-us/products/productdata/8796750610462/QNFA9122.pdf" V 9590 1300 50  0001 C CNN
F 4 "Murata Electronics" V 9450 1300 50  0001 C CNN "manf"
F 5 "BLM18SG260TZ1D" V 9450 1300 50  0001 C CNN "manf#"
F 6 "Ferrite Bead, 0603, 6A, 7mOhm, 26Ohm @ 100MHz" V 9583 1300 50  0000 C CNN "info"
F 7 "BLM18SG260TZ1D-ND" V 9450 1300 50  0001 C CNN "digikey#"
F 8 "223-4932" V 9450 1300 50  0001 C CNN "rs#"
	1    9450 1300
	0    -1   -1   0   
$EndComp
Wire Wire Line
	13950 1200 14050 1300
Wire Wire Line
	13950 1300 14050 1200
Wire Wire Line
	13600 1200 13950 1200
Wire Wire Line
	14050 1200 14200 1200
Wire Wire Line
	14200 1300 14050 1300
Wire Wire Line
	13950 1300 13600 1300
Wire Wire Line
	13950 1400 14050 1500
Wire Wire Line
	13950 1500 14050 1400
Wire Wire Line
	13600 1400 13950 1400
Wire Wire Line
	14050 1400 14200 1400
Wire Wire Line
	14200 1500 14050 1500
Wire Wire Line
	13950 1500 13600 1500
Wire Wire Line
	13950 1600 14050 1700
Wire Wire Line
	13950 1700 14050 1600
Wire Wire Line
	13600 1600 13950 1600
Wire Wire Line
	14050 1600 14200 1600
Wire Wire Line
	14200 1700 14050 1700
Wire Wire Line
	13950 1700 13600 1700
Wire Wire Line
	13950 1800 14050 1900
Wire Wire Line
	13950 1900 14050 1800
Wire Wire Line
	13600 1800 13950 1800
Wire Wire Line
	14050 1800 14200 1800
Wire Wire Line
	14200 1900 14050 1900
Wire Wire Line
	13950 1900 13600 1900
Wire Wire Line
	13950 2000 14050 2100
Wire Wire Line
	13950 2100 14050 2000
Wire Wire Line
	13600 2000 13950 2000
Wire Wire Line
	14050 2000 14200 2000
Wire Wire Line
	14200 2100 14050 2100
Wire Wire Line
	13950 2100 13600 2100
Wire Wire Line
	13950 2200 14050 2300
Wire Wire Line
	13950 2300 14050 2200
Wire Wire Line
	13600 2200 13950 2200
Wire Wire Line
	14050 2200 14200 2200
Wire Wire Line
	14200 2300 14050 2300
Wire Wire Line
	13950 2300 13600 2300
Wire Wire Line
	13950 2400 14050 2500
Wire Wire Line
	13950 2500 14050 2400
Wire Wire Line
	13600 2400 13950 2400
Wire Wire Line
	14050 2400 14200 2400
Wire Wire Line
	14200 2500 14050 2500
Wire Wire Line
	13950 2500 13600 2500
Wire Wire Line
	13950 2600 14050 2700
Wire Wire Line
	13950 2700 14050 2600
Wire Wire Line
	13600 2600 13950 2600
Wire Wire Line
	14050 2600 14200 2600
Wire Wire Line
	14200 2700 14050 2700
Wire Wire Line
	13950 2700 13600 2700
Wire Wire Line
	13950 2800 14050 2900
Wire Wire Line
	13950 2900 14050 2800
Wire Wire Line
	13600 2800 13950 2800
Wire Wire Line
	14050 2800 14200 2800
Wire Wire Line
	14200 2900 14050 2900
Wire Wire Line
	13950 2900 13600 2900
Wire Wire Line
	13950 3000 14050 3100
Wire Wire Line
	13950 3100 14050 3000
Wire Wire Line
	13600 3000 13950 3000
Wire Wire Line
	14050 3000 14200 3000
Wire Wire Line
	14200 3100 14050 3100
Wire Wire Line
	13950 3100 13600 3100
Wire Wire Line
	13950 3200 14050 3300
Wire Wire Line
	13950 3300 14050 3200
Wire Wire Line
	13600 3200 13950 3200
Wire Wire Line
	14050 3200 14200 3200
Wire Wire Line
	14200 3300 14050 3300
Wire Wire Line
	13950 3300 13600 3300
Wire Wire Line
	13950 3400 14050 3500
Wire Wire Line
	13950 3500 14050 3400
Wire Wire Line
	13600 3400 13950 3400
Wire Wire Line
	14050 3400 14200 3400
Wire Wire Line
	14200 3500 14050 3500
Wire Wire Line
	13950 3500 13600 3500
Wire Wire Line
	13950 4800 14050 4900
Wire Wire Line
	13950 4900 14050 4800
Wire Wire Line
	13600 4800 13950 4800
Wire Wire Line
	14050 4800 14200 4800
Wire Wire Line
	14200 4900 14050 4900
Wire Wire Line
	13950 4900 13600 4900
Wire Wire Line
	13950 5000 14050 5100
Wire Wire Line
	13950 5100 14050 5000
Wire Wire Line
	13600 5000 13950 5000
Wire Wire Line
	14050 5000 14200 5000
Wire Wire Line
	14200 5100 14050 5100
Wire Wire Line
	13950 5100 13600 5100
Wire Wire Line
	13950 5200 14050 5300
Wire Wire Line
	13950 5300 14050 5200
Wire Wire Line
	13600 5200 13950 5200
Wire Wire Line
	14050 5200 14200 5200
Wire Wire Line
	14200 5300 14050 5300
Wire Wire Line
	13950 5300 13600 5300
Wire Wire Line
	13950 5400 14050 5500
Wire Wire Line
	13950 5500 14050 5400
Wire Wire Line
	13600 5400 13950 5400
Wire Wire Line
	14050 5400 14200 5400
Wire Wire Line
	14200 5500 14050 5500
Wire Wire Line
	13950 5500 13600 5500
Wire Wire Line
	13950 5600 14050 5700
Wire Wire Line
	13950 5700 14050 5600
Wire Wire Line
	13600 5600 13950 5600
Wire Wire Line
	14050 5600 14200 5600
Wire Wire Line
	14200 5700 14050 5700
Wire Wire Line
	13950 5700 13600 5700
Wire Wire Line
	13950 5800 14050 5900
Wire Wire Line
	13950 5900 14050 5800
Wire Wire Line
	13600 5800 13950 5800
Wire Wire Line
	14050 5800 14200 5800
Wire Wire Line
	14200 5900 14050 5900
Wire Wire Line
	13950 5900 13600 5900
Wire Wire Line
	13950 6000 14050 6100
Wire Wire Line
	13950 6100 14050 6000
Wire Wire Line
	13600 6000 13950 6000
Wire Wire Line
	14050 6000 14200 6000
Wire Wire Line
	14200 6100 14050 6100
Wire Wire Line
	13950 6100 13600 6100
Wire Wire Line
	13950 6200 14050 6300
Wire Wire Line
	13950 6300 14050 6200
Wire Wire Line
	13600 6200 13950 6200
Wire Wire Line
	14050 6200 14200 6200
Wire Wire Line
	14200 6300 14050 6300
Wire Wire Line
	13950 6300 13600 6300
Wire Wire Line
	13950 6400 14050 6500
Wire Wire Line
	13950 6500 14050 6400
Wire Wire Line
	13600 6400 13950 6400
Wire Wire Line
	14050 6400 14200 6400
Wire Wire Line
	14200 6500 14050 6500
Wire Wire Line
	13950 6500 13600 6500
Wire Wire Line
	13950 6600 14050 6700
Wire Wire Line
	13950 6700 14050 6600
Wire Wire Line
	13600 6600 13950 6600
Wire Wire Line
	14050 6600 14200 6600
Wire Wire Line
	14200 6700 14050 6700
Wire Wire Line
	13950 6700 13600 6700
Wire Wire Line
	13950 6800 14050 6900
Wire Wire Line
	13950 6900 14050 6800
Wire Wire Line
	13600 6800 13950 6800
Wire Wire Line
	14050 6800 14200 6800
Wire Wire Line
	14200 6900 14050 6900
Wire Wire Line
	13950 6900 13600 6900
Wire Wire Line
	13950 7000 14050 7100
Wire Wire Line
	13950 7100 14050 7000
Wire Wire Line
	13600 7000 13950 7000
Wire Wire Line
	14050 7000 14200 7000
Wire Wire Line
	14200 7100 14050 7100
Wire Wire Line
	13950 7100 13600 7100
$Comp
L KIT_Power_Management:FPF1320UCX U503
U 1 1 62472A6F
P 6650 6600
F 0 "U503" H 7150 6887 60  0000 C CNN
F 1 "FPF1320UCX" H 7150 6781 60  0000 C CNN
F 2 "KIT_Package_CSP:WLCSP-6_1.0x1.5mm_P0.5mm" H 6050 5900 60  0001 L CNN
F 3 "https://www.onsemi.com/pdf/datasheet/fpf1321-d.pdf" H 6850 6450 60  0001 L CNN
F 4 "onsemi" H 7150 5800 50  0001 C CNN "manf"
F 5 "FPF1320UCX" H 7150 5700 50  0001 C CNN "manf#"
F 6 "186-9927" H 7200 5500 50  0001 C CNN "rs#"
F 7 "FPF1320UCXCT-ND" H 7200 5300 50  0001 C CNN "digikey#"
F 8 "512-FPF1320UCX " H 7200 5400 50  0001 C CNN "mouser#"
F 9 "Power Switch/Driver 2:1 P-Channel 1.5A 6-WLCSP (0.96x1.66)" H 7200 5600 50  0001 C CNN "info"
	1    6650 6600
	1    0    0    -1  
$EndComp
Wire Wire Line
	8000 6600 7900 6600
Connection ~ 8000 6600
Wire Wire Line
	7650 7100 7750 7100
Wire Wire Line
	7750 7100 7750 7350
$Comp
L power:GND #PWR?
U 1 1 62576E35
P 7750 7350
F 0 "#PWR?" H 7750 7100 50  0001 C CNN
F 1 "GND" H 7755 7177 50  0000 C CNN
F 2 "" H 7750 7350 50  0001 C CNN
F 3 "" H 7750 7350 50  0001 C CNN
	1    7750 7350
	1    0    0    -1  
$EndComp
Wire Notes Line
	7850 6050 7850 7650
$Comp
L Device:C C?
U 1 1 6265B5BC
P 5650 6950
AR Path="/5EF3A6E9/6265B5BC" Ref="C?"  Part="1" 
AR Path="/619269F2/6265B5BC" Ref="C?"  Part="1" 
AR Path="/619BA206/6265B5BC" Ref="C530"  Part="1" 
AR Path="/63AB152A/6265B5BC" Ref="C?"  Part="1" 
F 0 "C530" H 5535 7041 50  0000 R CNN
F 1 "1uF" H 5535 6950 50  0000 R CNN
F 2 "Capacitor_SMD:C_0402_1005Metric" H 5688 6800 50  0001 C CNN
F 3 "~" H 5650 6950 50  0001 C CNN
F 4 "0402, 16V" H 5535 6859 50  0001 R CNN "info"
F 5 "AVT-IPE" H 5650 6950 50  0001 C CNN "stock"
	1    5650 6950
	-1   0    0    -1  
$EndComp
$Comp
L power:GND #PWR?
U 1 1 6265B5C2
P 5650 7100
AR Path="/63AB152A/6265B5C2" Ref="#PWR?"  Part="1" 
AR Path="/619BA206/6265B5C2" Ref="#PWR?"  Part="1" 
F 0 "#PWR?" H 5650 6850 50  0001 C CNN
F 1 "GND" H 5655 6927 50  0000 C CNN
F 2 "" H 5650 7100 50  0001 C CNN
F 3 "" H 5650 7100 50  0001 C CNN
	1    5650 7100
	1    0    0    -1  
$EndComp
$Comp
L Device:C C?
U 1 1 626EAB23
P 5250 6950
AR Path="/5EF3A6E9/626EAB23" Ref="C?"  Part="1" 
AR Path="/619269F2/626EAB23" Ref="C?"  Part="1" 
AR Path="/619BA206/626EAB23" Ref="C529"  Part="1" 
AR Path="/63AB152A/626EAB23" Ref="C?"  Part="1" 
F 0 "C529" H 5135 7041 50  0000 R CNN
F 1 "1uF" H 5135 6950 50  0000 R CNN
F 2 "Capacitor_SMD:C_0402_1005Metric" H 5288 6800 50  0001 C CNN
F 3 "~" H 5250 6950 50  0001 C CNN
F 4 "0402, 16V" H 5135 6859 50  0001 R CNN "info"
F 5 "AVT-IPE" H 5250 6950 50  0001 C CNN "stock"
	1    5250 6950
	-1   0    0    -1  
$EndComp
$Comp
L power:GND #PWR?
U 1 1 626EAB29
P 5250 7100
AR Path="/63AB152A/626EAB29" Ref="#PWR?"  Part="1" 
AR Path="/619BA206/626EAB29" Ref="#PWR?"  Part="1" 
F 0 "#PWR?" H 5250 6850 50  0001 C CNN
F 1 "GND" H 5255 6927 50  0000 C CNN
F 2 "" H 5250 7100 50  0001 C CNN
F 3 "" H 5250 7100 50  0001 C CNN
	1    5250 7100
	1    0    0    -1  
$EndComp
Wire Wire Line
	5250 6700 5250 6800
Connection ~ 5250 6700
Wire Wire Line
	5650 6600 5650 6800
Connection ~ 5650 6600
Wire Notes Line
	5000 6050 5000 7650
Wire Notes Line
	5000 7650 7850 7650
Wire Notes Line
	5000 6050 7850 6050
Text HLabel 6550 6900 0    50   Input ~ 0
TX_Vadj_EN
Text HLabel 6550 7100 0    50   Input ~ 0
TX_Vadj_SEL
Wire Wire Line
	6550 6900 6650 6900
Wire Wire Line
	6550 7100 6650 7100
Wire Wire Line
	5650 4850 6000 4850
$Comp
L power:+3V3 #PWR?
U 1 1 623389AC
P 5250 4700
F 0 "#PWR?" H 5250 4550 50  0001 C CNN
F 1 "+3V3" H 5265 4873 50  0000 C CNN
F 2 "" H 5250 4700 50  0001 C CNN
F 3 "" H 5250 4700 50  0001 C CNN
	1    5250 4700
	-1   0    0    -1  
$EndComp
$Comp
L KIT_Power_Management:FPF1320UCX U504
U 1 1 623389B8
P 6650 4850
F 0 "U504" H 7150 5137 60  0000 C CNN
F 1 "FPF1320UCX" H 7150 5031 60  0000 C CNN
F 2 "KIT_Package_CSP:WLCSP-6_1.0x1.5mm_P0.5mm" H 6050 4150 60  0001 L CNN
F 3 "https://www.onsemi.com/pdf/datasheet/fpf1321-d.pdf" H 6850 4700 60  0001 L CNN
F 4 "onsemi" H 7150 4050 50  0001 C CNN "manf"
F 5 "FPF1320UCX" H 7150 3950 50  0001 C CNN "manf#"
F 6 "186-9927" H 7200 3750 50  0001 C CNN "rs#"
F 7 "FPF1320UCXCT-ND" H 7200 3550 50  0001 C CNN "digikey#"
F 8 "512-FPF1320UCX " H 7200 3650 50  0001 C CNN "mouser#"
F 9 "Power Switch/Driver 2:1 P-Channel 1.5A 6-WLCSP (0.96x1.66)" H 7200 3850 50  0001 C CNN "info"
	1    6650 4850
	1    0    0    -1  
$EndComp
Wire Wire Line
	8000 4850 7900 4850
Wire Wire Line
	7650 5350 7750 5350
Wire Wire Line
	7750 5350 7750 5600
$Comp
L power:GND #PWR?
U 1 1 623389C1
P 7750 5600
F 0 "#PWR?" H 7750 5350 50  0001 C CNN
F 1 "GND" H 7755 5427 50  0000 C CNN
F 2 "" H 7750 5600 50  0001 C CNN
F 3 "" H 7750 5600 50  0001 C CNN
	1    7750 5600
	1    0    0    -1  
$EndComp
$Comp
L Device:C C?
U 1 1 623389C9
P 5650 5200
AR Path="/5EF3A6E9/623389C9" Ref="C?"  Part="1" 
AR Path="/619269F2/623389C9" Ref="C?"  Part="1" 
AR Path="/619BA206/623389C9" Ref="C531"  Part="1" 
AR Path="/63AB152A/623389C9" Ref="C?"  Part="1" 
F 0 "C531" H 5535 5291 50  0000 R CNN
F 1 "1uF" H 5535 5200 50  0000 R CNN
F 2 "Capacitor_SMD:C_0402_1005Metric" H 5688 5050 50  0001 C CNN
F 3 "~" H 5650 5200 50  0001 C CNN
F 4 "0402, 16V" H 5535 5109 50  0001 R CNN "info"
F 5 "AVT-IPE" H 5650 5200 50  0001 C CNN "stock"
	1    5650 5200
	-1   0    0    -1  
$EndComp
$Comp
L power:GND #PWR?
U 1 1 623389CF
P 5650 5350
AR Path="/63AB152A/623389CF" Ref="#PWR?"  Part="1" 
AR Path="/619BA206/623389CF" Ref="#PWR?"  Part="1" 
F 0 "#PWR?" H 5650 5100 50  0001 C CNN
F 1 "GND" H 5655 5177 50  0000 C CNN
F 2 "" H 5650 5350 50  0001 C CNN
F 3 "" H 5650 5350 50  0001 C CNN
	1    5650 5350
	1    0    0    -1  
$EndComp
Wire Wire Line
	6650 5350 6550 5350
Wire Wire Line
	6550 5350 6550 5600
$Comp
L power:GND #PWR?
U 1 1 62398289
P 6550 5600
F 0 "#PWR?" H 6550 5350 50  0001 C CNN
F 1 "GND" H 6555 5427 50  0000 C CNN
F 2 "" H 6550 5600 50  0001 C CNN
F 3 "" H 6550 5600 50  0001 C CNN
	1    6550 5600
	-1   0    0    -1  
$EndComp
Wire Wire Line
	6500 5150 6650 5150
Connection ~ 8000 4850
Text HLabel 6500 5150 0    50   Input ~ 0
TX_V3V3_EN
Text Label 8150 4850 0    50   ~ 0
+3V3_TX
$Comp
L Device:C C?
U 1 1 62709D89
P 5250 5200
AR Path="/5EF3A6E9/62709D89" Ref="C?"  Part="1" 
AR Path="/619269F2/62709D89" Ref="C?"  Part="1" 
AR Path="/619BA206/62709D89" Ref="C532"  Part="1" 
AR Path="/63AB152A/62709D89" Ref="C?"  Part="1" 
F 0 "C532" H 5135 5291 50  0000 R CNN
F 1 "1uF" H 5135 5200 50  0000 R CNN
F 2 "Capacitor_SMD:C_0402_1005Metric" H 5288 5050 50  0001 C CNN
F 3 "~" H 5250 5200 50  0001 C CNN
F 4 "0402, 16V" H 5135 5109 50  0001 R CNN "info"
F 5 "AVT-IPE" H 5250 5200 50  0001 C CNN "stock"
	1    5250 5200
	-1   0    0    -1  
$EndComp
$Comp
L power:GND #PWR?
U 1 1 62709D8F
P 5250 5350
AR Path="/63AB152A/62709D8F" Ref="#PWR?"  Part="1" 
AR Path="/619BA206/62709D8F" Ref="#PWR?"  Part="1" 
F 0 "#PWR?" H 5250 5100 50  0001 C CNN
F 1 "GND" H 5255 5177 50  0000 C CNN
F 2 "" H 5250 5350 50  0001 C CNN
F 3 "" H 5250 5350 50  0001 C CNN
	1    5250 5350
	1    0    0    -1  
$EndComp
Wire Wire Line
	5250 4700 5250 4950
$Comp
L power:+3V3 #PWR?
U 1 1 62759C48
P 5650 4700
F 0 "#PWR?" H 5650 4550 50  0001 C CNN
F 1 "+3V3" H 5665 4873 50  0000 C CNN
F 2 "" H 5650 4700 50  0001 C CNN
F 3 "" H 5650 4700 50  0001 C CNN
	1    5650 4700
	-1   0    0    -1  
$EndComp
Wire Wire Line
	5650 4700 5650 4850
Wire Wire Line
	6650 4950 5250 4950
Connection ~ 5250 4950
Wire Wire Line
	5250 4950 5250 5050
Connection ~ 5650 4850
Wire Wire Line
	5650 4850 5650 5050
$Comp
L Connector:TestPoint_Probe TP?
U 1 1 627A4AE2
P 6000 4850
AR Path="/627A4AE2" Ref="TP?"  Part="1" 
AR Path="/63AB152A/627A4AE2" Ref="TP?"  Part="1" 
AR Path="/619BA206/627A4AE2" Ref="TP503"  Part="1" 
F 0 "TP503" H 6153 4951 50  0001 L CNN
F 1 "TestPoint_Probe" H 6153 4860 50  0001 L CNN
F 2 "TestPoint:TestPoint_Pad_D1.0mm" H 6200 4850 50  0001 C CNN
F 3 "~" H 6200 4850 50  0001 C CNN
	1    6000 4850
	1    0    0    -1  
$EndComp
$Comp
L Connector:TestPoint_Probe TP?
U 1 1 627BC050
P 7900 4850
AR Path="/627BC050" Ref="TP?"  Part="1" 
AR Path="/63AB152A/627BC050" Ref="TP?"  Part="1" 
AR Path="/619BA206/627BC050" Ref="TP504"  Part="1" 
F 0 "TP504" H 8053 4951 50  0001 L CNN
F 1 "TestPoint_Probe" H 8053 4860 50  0001 L CNN
F 2 "TestPoint:TestPoint_Pad_D1.0mm" H 8100 4850 50  0001 C CNN
F 3 "~" H 8100 4850 50  0001 C CNN
	1    7900 4850
	1    0    0    -1  
$EndComp
$Comp
L Connector:TestPoint_Probe TP?
U 1 1 627D30CE
P 10950 4850
AR Path="/627D30CE" Ref="TP?"  Part="1" 
AR Path="/63AB152A/627D30CE" Ref="TP?"  Part="1" 
AR Path="/619BA206/627D30CE" Ref="TP506"  Part="1" 
F 0 "TP506" H 11103 4951 50  0001 L CNN
F 1 "TestPoint_Probe" H 11103 4860 50  0001 L CNN
F 2 "TestPoint:TestPoint_Pad_D1.0mm" H 11150 4850 50  0001 C CNN
F 3 "~" H 11150 4850 50  0001 C CNN
	1    10950 4850
	1    0    0    -1  
$EndComp
$Comp
L Connector:TestPoint_Probe TP?
U 1 1 627EA251
P 5950 6700
AR Path="/627EA251" Ref="TP?"  Part="1" 
AR Path="/63AB152A/627EA251" Ref="TP?"  Part="1" 
AR Path="/619BA206/627EA251" Ref="TP502"  Part="1" 
F 0 "TP502" H 6103 6801 50  0001 L CNN
F 1 "TestPoint_Probe" H 6103 6710 50  0001 L CNN
F 2 "TestPoint:TestPoint_Pad_D1.0mm" H 6150 6700 50  0001 C CNN
F 3 "~" H 6150 6700 50  0001 C CNN
	1    5950 6700
	1    0    0    -1  
$EndComp
$Comp
L Connector:TestPoint_Probe TP?
U 1 1 62801419
P 5950 6600
AR Path="/62801419" Ref="TP?"  Part="1" 
AR Path="/63AB152A/62801419" Ref="TP?"  Part="1" 
AR Path="/619BA206/62801419" Ref="TP501"  Part="1" 
F 0 "TP501" H 6103 6701 50  0001 L CNN
F 1 "TestPoint_Probe" H 6103 6610 50  0001 L CNN
F 2 "TestPoint:TestPoint_Pad_D1.0mm" H 6150 6600 50  0001 C CNN
F 3 "~" H 6150 6600 50  0001 C CNN
	1    5950 6600
	1    0    0    -1  
$EndComp
$Comp
L Connector:TestPoint_Probe TP?
U 1 1 6282FFCF
P 7900 6600
AR Path="/6282FFCF" Ref="TP?"  Part="1" 
AR Path="/63AB152A/6282FFCF" Ref="TP?"  Part="1" 
AR Path="/619BA206/6282FFCF" Ref="TP505"  Part="1" 
F 0 "TP505" H 8053 6701 50  0001 L CNN
F 1 "TestPoint_Probe" H 8053 6610 50  0001 L CNN
F 2 "TestPoint:TestPoint_Pad_D1.0mm" H 8100 6600 50  0001 C CNN
F 3 "~" H 8100 6600 50  0001 C CNN
	1    7900 6600
	1    0    0    -1  
$EndComp
Connection ~ 7900 4850
Wire Wire Line
	7900 4850 7650 4850
$Comp
L Connector:TestPoint_Probe TP?
U 1 1 6284F1B5
P 10950 6600
AR Path="/6284F1B5" Ref="TP?"  Part="1" 
AR Path="/63AB152A/6284F1B5" Ref="TP?"  Part="1" 
AR Path="/619BA206/6284F1B5" Ref="TP507"  Part="1" 
F 0 "TP507" H 11103 6701 50  0001 L CNN
F 1 "TestPoint_Probe" H 11103 6610 50  0001 L CNN
F 2 "TestPoint:TestPoint_Pad_D1.0mm" H 11150 6600 50  0001 C CNN
F 3 "~" H 11150 6600 50  0001 C CNN
	1    10950 6600
	1    0    0    -1  
$EndComp
Connection ~ 10950 4850
Wire Wire Line
	10950 4850 11450 4850
Connection ~ 10950 6600
Wire Wire Line
	10950 6600 11450 6600
Connection ~ 7900 6600
Wire Wire Line
	7900 6600 7650 6600
Connection ~ 6000 4850
Wire Wire Line
	6000 4850 6650 4850
Connection ~ 5950 6600
Wire Wire Line
	5950 6600 6650 6600
Connection ~ 5950 6700
Wire Wire Line
	5950 6700 6650 6700
$Comp
L power:+1V8 #PWR?
U 1 1 62CAF0C2
P 1750 2150
F 0 "#PWR?" H 1750 2000 50  0001 C CNN
F 1 "+1V8" H 1765 2323 50  0000 C CNN
F 2 "" H 1750 2150 50  0001 C CNN
F 3 "" H 1750 2150 50  0001 C CNN
	1    1750 2150
	1    0    0    -1  
$EndComp
$Comp
L power:+1V8 #PWR?
U 1 1 62CAF41E
P 1900 3150
F 0 "#PWR?" H 1900 3000 50  0001 C CNN
F 1 "+1V8" H 1915 3323 50  0000 C CNN
F 2 "" H 1900 3150 50  0001 C CNN
F 3 "" H 1900 3150 50  0001 C CNN
	1    1900 3150
	1    0    0    -1  
$EndComp
$Comp
L power:+1V8 #PWR?
U 1 1 62CAF722
P 3500 3150
F 0 "#PWR?" H 3500 3000 50  0001 C CNN
F 1 "+1V8" H 3515 3323 50  0000 C CNN
F 2 "" H 3500 3150 50  0001 C CNN
F 3 "" H 3500 3150 50  0001 C CNN
	1    3500 3150
	1    0    0    -1  
$EndComp
$Comp
L power:+1V8 #PWR?
U 1 1 62CAFACD
P 1750 4800
F 0 "#PWR?" H 1750 4650 50  0001 C CNN
F 1 "+1V8" H 1765 4973 50  0000 C CNN
F 2 "" H 1750 4800 50  0001 C CNN
F 3 "" H 1750 4800 50  0001 C CNN
	1    1750 4800
	1    0    0    -1  
$EndComp
$Comp
L power:+1V8 #PWR?
U 1 1 62CB093D
P 1900 5800
F 0 "#PWR?" H 1900 5650 50  0001 C CNN
F 1 "+1V8" H 1915 5973 50  0000 C CNN
F 2 "" H 1900 5800 50  0001 C CNN
F 3 "" H 1900 5800 50  0001 C CNN
	1    1900 5800
	1    0    0    -1  
$EndComp
$Comp
L power:+1V8 #PWR?
U 1 1 62CB0B3B
P 3500 5800
F 0 "#PWR?" H 3500 5650 50  0001 C CNN
F 1 "+1V8" H 3515 5973 50  0000 C CNN
F 2 "" H 3500 5800 50  0001 C CNN
F 3 "" H 3500 5800 50  0001 C CNN
	1    3500 5800
	1    0    0    -1  
$EndComp
$EndSCHEMATC
