M48
; DRILL file {KiCad 5.1.12-84ad8e8a86~92~ubuntu18.04.1} date Wed 27 Apr 2022 05:28:49 PM CEST
; FORMAT={-:-/ absolute / inch / decimal}
; #@! TF.CreationDate,2022-04-27T17:28:49+02:00
; #@! TF.GenerationSoftware,Kicad,Pcbnew,5.1.12-84ad8e8a86~92~ubuntu18.04.1
; #@! TF.FileFunction,Plated,1,8,Blind
FMAT,2
INCH
T1C0.0079
%
G90
G05
T1
X6.2795Y-2.5394
X6.2795Y-2.5787
X6.2795Y-2.6181
X6.2795Y-2.6575
X6.2795Y-2.6969
X6.2795Y-2.7362
X6.2795Y-2.7756
X6.2795Y-2.815
X6.2795Y-2.8543
X6.2795Y-2.8937
X6.2795Y-2.9331
X6.2795Y-2.9724
X7.0374Y-2.0472
X7.0374Y-2.3425
T0
M30
