M48
; DRILL file {KiCad 5.1.12-84ad8e8a86~92~ubuntu18.04.1} date Mon 08 Aug 2022 02:54:26 PM CEST
; FORMAT={-:-/ absolute / inch / decimal}
; #@! TF.CreationDate,2022-08-08T14:54:26+02:00
; #@! TF.GenerationSoftware,Kicad,Pcbnew,5.1.12-84ad8e8a86~92~ubuntu18.04.1
; #@! TF.FileFunction,Plated,1,5,Blind
FMAT,2
INCH
T1C0.0079
%
G90
G05
T1
X5.2461Y-2.815
X5.2461Y-2.8543
X5.2461Y-2.9134
X5.2461Y-2.9528
X5.2463Y-2.0276
X5.2463Y-2.0669
X5.2463Y-2.126
X5.2463Y-2.1654
X5.2463Y-2.2244
X5.2463Y-2.2638
X5.2463Y-2.3228
X5.2463Y-2.3622
X5.2463Y-2.5197
X5.2463Y-2.5591
X5.2463Y-2.6181
X5.2463Y-2.6575
X5.3248Y-2.1262
X5.3248Y-2.1652
X5.3248Y-2.323
X5.3248Y-2.362
X5.3248Y-2.5199
X5.3248Y-2.5589
X5.3248Y-2.6183
X5.3248Y-2.6573
X5.3248Y-2.815
X5.3248Y-2.8543
X5.3248Y-2.9134
X5.3248Y-2.9528
X5.6791Y-4.2323
X5.6791Y-4.2717
X5.6791Y-7.264
X5.6791Y-7.303
X5.9547Y-4.2323
X5.9547Y-4.2717
X5.9547Y-7.264
X5.9547Y-7.303
X6.4626Y-2.5197
X6.4626Y-2.5591
X6.4626Y-2.5984
X6.4626Y-2.6378
X6.4626Y-2.6772
X6.4626Y-2.7165
X6.4626Y-2.7559
X6.4626Y-2.7953
X6.4626Y-2.8346
X6.4626Y-2.874
X6.4626Y-2.9134
X6.4626Y-2.9528
X6.4764Y-5.5709
X6.4764Y-5.6102
X6.4764Y-5.6496
X6.4764Y-5.689
X6.4764Y-5.7283
X6.4764Y-5.7677
X6.4764Y-5.8071
X6.4764Y-5.8465
X6.4764Y-5.8858
X6.4764Y-5.9252
X6.4764Y-5.9646
X6.4764Y-6.0039
X7.0965Y-3.0709
X7.0965Y-3.3661
X7.0965Y-3.6614
X7.0965Y-3.9567
X7.0965Y-6.1024
X7.0965Y-6.3976
X7.0965Y-6.6929
X7.0965Y-6.9882
X9.1831Y-7.264
X9.1831Y-7.303
X9.3996Y-3.4057
X9.3996Y-3.4447
X9.3996Y-3.5238
X9.3996Y-3.5628
X9.4006Y-5.9293
X9.4006Y-5.9722
X9.4006Y-6.0238
X9.4006Y-6.0667
X9.4054Y-3.3319
X9.433Y-3.3044
X9.4587Y-3.3467
X9.4587Y-3.3856
X9.4587Y-3.4648
X9.4587Y-3.5037
X9.4587Y-7.264
X9.4587Y-7.303
X9.4646Y-3.5689
X9.4921Y-3.5965
X9.5167Y-5.9136
X9.5167Y-5.9565
X9.5167Y-6.0081
X9.5167Y-6.051
T0
M30
