M48
; DRILL file {KiCad 5.1.12-84ad8e8a86~92~ubuntu18.04.1} date Mon 08 Aug 2022 02:54:26 PM CEST
; FORMAT={-:-/ absolute / inch / decimal}
; #@! TF.CreationDate,2022-08-08T14:54:26+02:00
; #@! TF.GenerationSoftware,Kicad,Pcbnew,5.1.12-84ad8e8a86~92~ubuntu18.04.1
; #@! TF.FileFunction,Plated,10,12,Blind
FMAT,2
INCH
T1C0.0079
%
G90
G05
T1
X4.4104Y-3.4238
X4.4104Y-3.4738
X4.4104Y-3.8238
X4.4104Y-3.8738
X4.4104Y-6.4553
X4.4104Y-6.5053
X4.5104Y-3.0238
X4.5104Y-3.0738
X4.5104Y-3.2238
X4.5104Y-3.2738
X4.5104Y-6.0553
X4.5104Y-6.1053
X4.5104Y-6.2553
X4.5104Y-6.3053
X4.5604Y-3.3238
X4.5604Y-3.3738
X4.5604Y-3.7238
X4.5604Y-3.7738
X4.5604Y-6.3553
X4.5604Y-6.4053
X4.5604Y-6.7553
X4.5604Y-6.8053
X4.6104Y-3.6238
X4.6104Y-3.6738
X4.6104Y-6.6553
X4.6104Y-6.7053
X4.6604Y-3.7738
X4.6604Y-3.8238
X4.6604Y-6.8053
X4.6604Y-6.8553
X5.0604Y-3.8238
X5.0604Y-3.8738
X5.4232Y-3.7502
X5.4232Y-3.7892
X5.4232Y-6.7817
X5.4232Y-6.8207
X7.9144Y-2.6238
X7.9144Y-2.6738
X7.9644Y-2.7238
X7.9644Y-2.7738
X8.0144Y-2.0238
X8.0144Y-2.0738
X8.0144Y-2.2238
X8.0144Y-2.2738
X8.0144Y-2.4238
X8.0144Y-2.4738
X8.0144Y-6.0553
X8.0144Y-6.1053
X8.0144Y-6.2553
X8.0144Y-6.3053
X8.0644Y-6.3553
X8.0644Y-6.4053
X8.1144Y-3.8238
X8.1144Y-3.8738
X8.1144Y-6.6553
X8.1144Y-6.7053
X8.1644Y-6.8053
X8.1644Y-6.8553
X8.5644Y-3.2238
X8.5644Y-3.2738
X8.5644Y-3.4238
X8.5644Y-3.4738
X8.5644Y-3.6238
X8.5644Y-3.6738
X8.9272Y-6.7817
X8.9272Y-6.8207
T0
M30
