M48
; DRILL file {KiCad 5.1.12-84ad8e8a86~92~ubuntu18.04.1} date Mon 08 Aug 2022 02:54:26 PM CEST
; FORMAT={-:-/ absolute / inch / decimal}
; #@! TF.CreationDate,2022-08-08T14:54:26+02:00
; #@! TF.GenerationSoftware,Kicad,Pcbnew,5.1.12-84ad8e8a86~92~ubuntu18.04.1
; #@! TF.FileFunction,NonPlated,1,12,NPTH
FMAT,2
INCH
T1C0.0079
T2C0.0350
T3C0.0433
T4C0.0500
T5C0.1063
%
G90
G05
T1
X4.3307Y-1.9587
X4.3307Y-1.9783
X4.3307Y-1.998
X4.3307Y-2.0177
X4.3307Y-3.9272
X4.3307Y-3.9469
X4.3307Y-3.9665
X4.3307Y-3.9862
X4.3307Y-4.4587
X4.3307Y-4.4783
X4.3307Y-4.498
X4.3307Y-4.5177
X4.3307Y-4.9902
X4.3307Y-5.0098
X4.3307Y-5.0295
X4.3307Y-5.0492
X4.3307Y-6.9587
X4.3307Y-6.9783
X4.3307Y-6.998
X4.3307Y-7.0177
X5.128Y-4.6457
X5.1476Y-4.6457
X5.1673Y-4.6457
X5.187Y-4.6457
X5.935Y-4.3307
X5.9547Y-4.3307
X5.9744Y-4.3307
X5.9941Y-4.3307
X7.4213Y-2.6476
X7.4213Y-2.6673
X7.4213Y-2.687
X7.4213Y-2.7067
X7.4213Y-4.4587
X7.4213Y-4.4783
X7.4213Y-4.498
X7.4213Y-4.5177
X7.4213Y-5.6791
X7.4213Y-5.6988
X7.4213Y-5.7185
X7.4213Y-5.7382
X7.8346Y-1.9587
X7.8346Y-1.9783
X7.8346Y-1.998
X7.8346Y-2.0177
X7.8346Y-3.9272
X7.8346Y-3.9469
X7.8346Y-3.9665
X7.8346Y-3.9862
X7.8346Y-4.4587
X7.8346Y-4.4783
X7.8346Y-4.498
X7.8346Y-4.5177
X7.8346Y-4.9902
X7.8346Y-5.0098
X7.8346Y-5.0295
X7.8346Y-5.0492
X7.8346Y-6.9587
X7.8346Y-6.9783
X7.8346Y-6.998
X7.8346Y-7.0177
X8.6319Y-4.6457
X8.6516Y-4.6457
X8.6713Y-4.6457
X8.6909Y-4.6457
X9.439Y-4.3307
X9.4587Y-4.3307
X9.4783Y-4.3307
X9.498Y-4.3307
X10.9252Y-2.5689
X10.9252Y-2.5886
X10.9252Y-2.6083
X10.9252Y-2.628
X10.9252Y-3.3563
X10.9252Y-3.376
X10.9252Y-3.3957
X10.9252Y-3.4154
X10.9252Y-4.4587
X10.9252Y-4.4783
X10.9252Y-4.498
X10.9252Y-4.5177
X10.9252Y-5.6004
X10.9252Y-5.6201
X10.9252Y-5.6398
X10.9252Y-5.6594
X10.9252Y-6.3878
X10.9252Y-6.4075
X10.9252Y-6.4272
X10.9252Y-6.4469
T2
X9.4134Y-2.3238
X9.4134Y-3.2687
X9.4291Y-2.6959
X9.4291Y-3.6407
X10.002Y-2.3238
X10.002Y-2.6959
X10.002Y-3.2687
X10.002Y-3.6407
T3
X6.2992Y-2.4409
X6.2992Y-3.1102
X6.4567Y-3.1102
T4
X4.7604Y-4.0443
X4.7604Y-7.0758
X4.8805Y-1.9033
X4.8805Y-4.9348
X8.2644Y-4.0443
X8.2644Y-7.0758
X8.3844Y-1.9033
X8.3844Y-4.9348
T5
X6.9882Y-1.8878
X6.9882Y-4.1142
X6.9882Y-4.9193
X6.9882Y-7.1457
X10.4921Y-1.8878
X10.4921Y-4.1142
X10.4921Y-4.9193
X10.4921Y-7.1457
T0
M30
