%FSLAX45Y45*%
G04 Gerber Fmt 4.5, Leading zero omitted, Abs format (unit mm)*
G04 Created by KiCad (PCBNEW 5.1.12-84ad8e8a86~92~ubuntu18.04.1) date 2022-08-08 14:54:28*
%MOMM*%
%LPD*%
G01*
G04 APERTURE LIST*
%TA.AperFunction,Profile*%
%ADD10C,0.200000*%
%TD*%
%ADD11C,0.200000*%
%ADD12C,0.300000*%
G04 APERTURE END LIST*
D10*
X19900000Y-11600000D02*
X19900000Y-11550000D01*
X19900000Y-11200000D02*
X19900000Y-11250000D01*
X18850000Y-10870000D02*
X18850000Y-11250000D01*
X18850000Y-12070000D02*
X18850000Y-11550000D01*
X25240000Y-10870000D02*
X25240000Y-11100000D01*
X26800000Y-12070000D02*
X27750000Y-12070000D01*
X25720000Y-11700000D02*
X25720000Y-11860000D01*
X25620000Y-11600000D02*
G75*
G02*
X25720000Y-11700000I0J-100000D01*
G01*
X26800000Y-11960000D02*
X26800000Y-12070000D01*
X25720000Y-11860000D02*
X26700000Y-11860000D01*
X27750000Y-10870000D02*
X25240000Y-10870000D01*
X26700000Y-11860000D02*
G75*
G02*
X26800000Y-11960000I0J-100000D01*
G01*
X25240000Y-11100000D02*
G75*
G02*
X25140000Y-11200000I-100000J0D01*
G01*
X16720000Y-11600000D02*
G75*
G02*
X16820000Y-11700000I0J-100000D01*
G01*
X17800000Y-11860000D02*
G75*
G02*
X17900000Y-11960000I0J-100000D01*
G01*
X17900000Y-11960000D02*
X17900000Y-12070000D01*
X17900000Y-12070000D02*
X18850000Y-12070000D01*
X16820000Y-11860000D02*
X17800000Y-11860000D01*
X16820000Y-11700000D02*
X16820000Y-11860000D01*
X18850000Y-10870000D02*
X16340000Y-10870000D01*
X16340000Y-11100000D02*
G75*
G02*
X16240000Y-11200000I-100000J0D01*
G01*
X16340000Y-10870000D02*
X16340000Y-11100000D01*
X21850000Y-11800000D02*
X19900000Y-11800000D01*
X12950000Y-11800000D02*
X11000000Y-11800000D01*
X18850000Y-6650000D02*
X18850000Y-6125000D01*
X27750000Y-7025000D02*
X27750000Y-6750000D01*
X27750000Y-8450000D02*
X27750000Y-8125000D01*
X27750000Y-14150000D02*
X27750000Y-12270000D01*
X27750000Y-16150000D02*
X27750000Y-14450000D01*
X27750000Y-18370000D02*
X27750000Y-16450000D01*
X18850000Y-14350000D02*
X18850000Y-13825000D01*
X27950000Y-8450000D02*
X27950000Y-6750000D01*
X27950000Y-11250000D02*
X27950000Y-8750000D01*
X27950000Y-14150000D02*
X27950000Y-11550000D01*
X27950000Y-16150000D02*
X27950000Y-14450000D01*
X27950000Y-18900000D02*
X28450000Y-18900000D01*
X27950000Y-16450000D02*
X27950000Y-18900000D01*
X28450000Y-3900000D02*
X28450000Y-18900000D01*
X27950000Y-3900000D02*
X28450000Y-3900000D01*
X27950000Y-6450000D02*
X27950000Y-3900000D01*
X19050000Y-3900000D02*
X19700000Y-3900000D01*
X19050000Y-6650000D02*
X19050000Y-3900000D01*
X19700000Y-4900000D02*
X19700000Y-3900000D01*
X19700000Y-9900000D02*
X19700000Y-5200000D01*
X19700000Y-11250000D02*
X19700000Y-10200000D01*
X23900000Y-11200000D02*
X19900000Y-11200000D01*
X27750000Y-10870000D02*
X27750000Y-11250000D01*
X24200000Y-11200000D02*
X25140000Y-11200000D01*
X27750000Y-12070000D02*
X27750000Y-11550000D01*
X22150000Y-11600000D02*
X25620000Y-11600000D01*
X19900000Y-11600000D02*
X21850000Y-11600000D01*
X19700000Y-12600000D02*
X19700000Y-11550000D01*
X19700000Y-17600000D02*
X19700000Y-12900000D01*
X19700000Y-18900000D02*
X19700000Y-17900000D01*
X19050000Y-18900000D02*
X19700000Y-18900000D01*
X19050000Y-14650000D02*
X19050000Y-18900000D01*
X19050000Y-11550000D02*
X19050000Y-14350000D01*
X13250000Y-11600000D02*
X16720000Y-11600000D01*
X16240000Y-11200000D02*
X15300000Y-11200000D01*
X19050000Y-6950000D02*
X19050000Y-11250000D01*
X11000000Y-11600000D02*
X11000000Y-11550000D01*
X12950000Y-11600000D02*
X11000000Y-11600000D01*
X11000000Y-11200000D02*
X11000000Y-11250000D01*
X15000000Y-11200000D02*
X11000000Y-11200000D01*
X10800000Y-10200000D02*
X10800000Y-11250000D01*
X10800000Y-5200000D02*
X10800000Y-9900000D01*
X10800000Y-3900000D02*
X10800000Y-4900000D01*
X10300000Y-3900000D02*
X10800000Y-3900000D01*
X10300000Y-18900000D02*
X10300000Y-3900000D01*
X10800000Y-18900000D02*
X10300000Y-18900000D01*
X10800000Y-17900000D02*
X10800000Y-18900000D01*
X10800000Y-12900000D02*
X10800000Y-17600000D01*
X10800000Y-11550000D02*
X10800000Y-12600000D01*
X27750000Y-18370000D02*
X25140000Y-18370000D01*
X25040000Y-18470000D02*
X25040000Y-18700000D01*
X22740000Y-18700000D02*
X19900000Y-18700000D01*
X26600000Y-12060000D02*
X26600000Y-12170000D01*
X22150000Y-11800000D02*
X25520000Y-11800000D01*
X19900000Y-12600000D02*
X19900000Y-11800000D01*
X19900000Y-17600000D02*
X19900000Y-12900000D01*
X25620000Y-12060000D02*
G75*
G02*
X25520000Y-11960000I0J100000D01*
G01*
X25520000Y-11800000D02*
X25520000Y-11960000D01*
X26700000Y-12270000D02*
G75*
G02*
X26600000Y-12170000I0J100000D01*
G01*
X26700000Y-12270000D02*
X27750000Y-12270000D01*
X25620000Y-12060000D02*
X26600000Y-12060000D01*
X22740000Y-18700000D02*
X25040000Y-18700000D01*
X19900000Y-17900000D02*
X19900000Y-18700000D01*
X25040000Y-18470000D02*
G75*
G02*
X25140000Y-18370000I100000J0D01*
G01*
X27750000Y-6450000D02*
X27750000Y-6125000D01*
X27750000Y-7775000D02*
X27750000Y-7375000D01*
X27750000Y-5775000D02*
X27750000Y-5375000D01*
X27750000Y-9125000D02*
X27750000Y-8750000D01*
X27750000Y-9875000D02*
X27750000Y-9475000D01*
X26600000Y-4360000D02*
X26600000Y-4470000D01*
X19900000Y-4100000D02*
X25520000Y-4100000D01*
X19900000Y-4900000D02*
X19900000Y-4100000D01*
X19900000Y-9900000D02*
X19900000Y-5200000D01*
X25620000Y-4360000D02*
G75*
G02*
X25520000Y-4260000I0J100000D01*
G01*
X25520000Y-4100000D02*
X25520000Y-4260000D01*
X26700000Y-4570000D02*
G75*
G02*
X26600000Y-4470000I0J100000D01*
G01*
X27750000Y-5025000D02*
X27750000Y-4570000D01*
X26700000Y-4570000D02*
X27750000Y-4570000D01*
X25620000Y-4360000D02*
X26600000Y-4360000D01*
X24200000Y-11000000D02*
X25040000Y-11000000D01*
X19900000Y-10200000D02*
X19900000Y-11000000D01*
X27750000Y-10225000D02*
X27750000Y-10670000D01*
X25040000Y-10770000D02*
G75*
G02*
X25140000Y-10670000I100000J0D01*
G01*
X23900000Y-11000000D02*
X19900000Y-11000000D01*
X25040000Y-10770000D02*
X25040000Y-11000000D01*
X27750000Y-10670000D02*
X25140000Y-10670000D01*
X18850000Y-9125000D02*
X18850000Y-8725000D01*
X18850000Y-5025000D02*
X18850000Y-4570000D01*
X18850000Y-9875000D02*
X18850000Y-9475000D01*
X18850000Y-8375000D02*
X18850000Y-7975000D01*
X18850000Y-10670000D02*
X16240000Y-10670000D01*
X16140000Y-10770000D02*
X16140000Y-11000000D01*
X15000000Y-11000000D02*
X11000000Y-11000000D01*
X16140000Y-10770000D02*
G75*
G02*
X16240000Y-10670000I100000J0D01*
G01*
X11000000Y-10200000D02*
X11000000Y-11000000D01*
X15300000Y-11000000D02*
X16140000Y-11000000D01*
X16720000Y-4360000D02*
X17700000Y-4360000D01*
X17800000Y-4570000D02*
X18850000Y-4570000D01*
X17800000Y-4570000D02*
G75*
G02*
X17700000Y-4470000I0J100000D01*
G01*
X16620000Y-4100000D02*
X16620000Y-4260000D01*
X16720000Y-4360000D02*
G75*
G02*
X16620000Y-4260000I0J100000D01*
G01*
X11000000Y-9900000D02*
X11000000Y-5200000D01*
X11000000Y-4900000D02*
X11000000Y-4100000D01*
X11000000Y-4100000D02*
X16620000Y-4100000D01*
X17700000Y-4360000D02*
X17700000Y-4470000D01*
X18850000Y-7625000D02*
X18850000Y-6950000D01*
X18850000Y-5775000D02*
X18850000Y-5375000D01*
X18850000Y-10225000D02*
X18850000Y-10670000D01*
X18850000Y-18370000D02*
X16240000Y-18370000D01*
X16140000Y-18470000D02*
X16140000Y-18700000D01*
X13840000Y-18700000D02*
X11000000Y-18700000D01*
X16140000Y-18470000D02*
G75*
G02*
X16240000Y-18370000I100000J0D01*
G01*
X18850000Y-17925000D02*
X18850000Y-18370000D01*
X11000000Y-17900000D02*
X11000000Y-18700000D01*
X13840000Y-18700000D02*
X16140000Y-18700000D01*
X16720000Y-12060000D02*
X17700000Y-12060000D01*
X17800000Y-12270000D02*
X18850000Y-12270000D01*
X18850000Y-12725000D02*
X18850000Y-12270000D01*
X17800000Y-12270000D02*
G75*
G02*
X17700000Y-12170000I0J100000D01*
G01*
X16620000Y-11800000D02*
X16620000Y-11960000D01*
X16720000Y-12060000D02*
G75*
G02*
X16620000Y-11960000I0J100000D01*
G01*
X11000000Y-17600000D02*
X11000000Y-12900000D01*
X11000000Y-12600000D02*
X11000000Y-11800000D01*
X13250000Y-11800000D02*
X16620000Y-11800000D01*
X17700000Y-12060000D02*
X17700000Y-12170000D01*
X18850000Y-17575000D02*
X18850000Y-17175000D01*
X18850000Y-16825000D02*
X18850000Y-16425000D01*
X18850000Y-16075000D02*
X18850000Y-15675000D01*
X18850000Y-15325000D02*
X18850000Y-14650000D01*
X18850000Y-13475000D02*
X18850000Y-13075000D01*
D11*
X10990000Y-4965000D02*
X11010000Y-4985000D01*
X11010000Y-4965000D02*
X10990000Y-4985000D01*
X10990000Y-5015000D02*
X11010000Y-5035000D01*
X11010000Y-5015000D02*
X10990000Y-5035000D01*
X10990000Y-5065000D02*
X11010000Y-5085000D01*
X11010000Y-5065000D02*
X10990000Y-5085000D01*
X10990000Y-5115000D02*
X11010000Y-5135000D01*
X11010000Y-5115000D02*
X10990000Y-5135000D01*
X10990000Y-9965000D02*
X11010000Y-9985000D01*
X11010000Y-9965000D02*
X10990000Y-9985000D01*
X10990000Y-10015000D02*
X11010000Y-10035000D01*
X11010000Y-10015000D02*
X10990000Y-10035000D01*
X10990000Y-10065000D02*
X11010000Y-10085000D01*
X11010000Y-10065000D02*
X10990000Y-10085000D01*
X10990000Y-10115000D02*
X11010000Y-10135000D01*
X11010000Y-10115000D02*
X10990000Y-10135000D01*
X10990000Y-11315000D02*
X11010000Y-11335000D01*
X11010000Y-11315000D02*
X10990000Y-11335000D01*
X10990000Y-11365000D02*
X11010000Y-11385000D01*
X11010000Y-11365000D02*
X10990000Y-11385000D01*
X10990000Y-11415000D02*
X11010000Y-11435000D01*
X11010000Y-11415000D02*
X10990000Y-11435000D01*
X10990000Y-11465000D02*
X11010000Y-11485000D01*
X11010000Y-11465000D02*
X10990000Y-11485000D01*
X10990000Y-12665000D02*
X11010000Y-12685000D01*
X11010000Y-12665000D02*
X10990000Y-12685000D01*
X10990000Y-12715000D02*
X11010000Y-12735000D01*
X11010000Y-12715000D02*
X10990000Y-12735000D01*
X10990000Y-12765000D02*
X11010000Y-12785000D01*
X11010000Y-12765000D02*
X10990000Y-12785000D01*
X10990000Y-12815000D02*
X11010000Y-12835000D01*
X11010000Y-12815000D02*
X10990000Y-12835000D01*
X10990000Y-17665000D02*
X11010000Y-17685000D01*
X11010000Y-17665000D02*
X10990000Y-17685000D01*
X10990000Y-17715000D02*
X11010000Y-17735000D01*
X11010000Y-17715000D02*
X10990000Y-17735000D01*
X10990000Y-17765000D02*
X11010000Y-17785000D01*
X11010000Y-17765000D02*
X10990000Y-17785000D01*
X10990000Y-17815000D02*
X11010000Y-17835000D01*
X11010000Y-17815000D02*
X10990000Y-17835000D01*
X13015000Y-11790000D02*
X13035000Y-11810000D01*
X13035000Y-11790000D02*
X13015000Y-11810000D01*
X13065000Y-11790000D02*
X13085000Y-11810000D01*
X13085000Y-11790000D02*
X13065000Y-11810000D01*
X13115000Y-11790000D02*
X13135000Y-11810000D01*
X13135000Y-11790000D02*
X13115000Y-11810000D01*
X13165000Y-11790000D02*
X13185000Y-11810000D01*
X13185000Y-11790000D02*
X13165000Y-11810000D01*
X15065000Y-10990000D02*
X15085000Y-11010000D01*
X15085000Y-10990000D02*
X15065000Y-11010000D01*
X15115000Y-10990000D02*
X15135000Y-11010000D01*
X15135000Y-10990000D02*
X15115000Y-11010000D01*
X15165000Y-10990000D02*
X15185000Y-11010000D01*
X15185000Y-10990000D02*
X15165000Y-11010000D01*
X15215000Y-10990000D02*
X15235000Y-11010000D01*
X15235000Y-10990000D02*
X15215000Y-11010000D01*
X18840000Y-6715000D02*
X18860000Y-6735000D01*
X18860000Y-6715000D02*
X18840000Y-6735000D01*
X18840000Y-6765000D02*
X18860000Y-6785000D01*
X18860000Y-6765000D02*
X18840000Y-6785000D01*
X18840000Y-6815000D02*
X18860000Y-6835000D01*
X18860000Y-6815000D02*
X18840000Y-6835000D01*
X18840000Y-6865000D02*
X18860000Y-6885000D01*
X18860000Y-6865000D02*
X18840000Y-6885000D01*
X18840000Y-11315000D02*
X18860000Y-11335000D01*
X18860000Y-11315000D02*
X18840000Y-11335000D01*
X18840000Y-11365000D02*
X18860000Y-11385000D01*
X18860000Y-11365000D02*
X18840000Y-11385000D01*
X18840000Y-11415000D02*
X18860000Y-11435000D01*
X18860000Y-11415000D02*
X18840000Y-11435000D01*
X18840000Y-11465000D02*
X18860000Y-11485000D01*
X18860000Y-11465000D02*
X18840000Y-11485000D01*
X18840000Y-14415000D02*
X18860000Y-14435000D01*
X18860000Y-14415000D02*
X18840000Y-14435000D01*
X18840000Y-14465000D02*
X18860000Y-14485000D01*
X18860000Y-14465000D02*
X18840000Y-14485000D01*
X18840000Y-14515000D02*
X18860000Y-14535000D01*
X18860000Y-14515000D02*
X18840000Y-14535000D01*
X18840000Y-14565000D02*
X18860000Y-14585000D01*
X18860000Y-14565000D02*
X18840000Y-14585000D01*
X19890000Y-4965000D02*
X19910000Y-4985000D01*
X19910000Y-4965000D02*
X19890000Y-4985000D01*
X19890000Y-5015000D02*
X19910000Y-5035000D01*
X19910000Y-5015000D02*
X19890000Y-5035000D01*
X19890000Y-5065000D02*
X19910000Y-5085000D01*
X19910000Y-5065000D02*
X19890000Y-5085000D01*
X19890000Y-5115000D02*
X19910000Y-5135000D01*
X19910000Y-5115000D02*
X19890000Y-5135000D01*
X19890000Y-9965000D02*
X19910000Y-9985000D01*
X19910000Y-9965000D02*
X19890000Y-9985000D01*
X19890000Y-10015000D02*
X19910000Y-10035000D01*
X19910000Y-10015000D02*
X19890000Y-10035000D01*
X19890000Y-10065000D02*
X19910000Y-10085000D01*
X19910000Y-10065000D02*
X19890000Y-10085000D01*
X19890000Y-10115000D02*
X19910000Y-10135000D01*
X19910000Y-10115000D02*
X19890000Y-10135000D01*
X19890000Y-11315000D02*
X19910000Y-11335000D01*
X19910000Y-11315000D02*
X19890000Y-11335000D01*
X19890000Y-11365000D02*
X19910000Y-11385000D01*
X19910000Y-11365000D02*
X19890000Y-11385000D01*
X19890000Y-11415000D02*
X19910000Y-11435000D01*
X19910000Y-11415000D02*
X19890000Y-11435000D01*
X19890000Y-11465000D02*
X19910000Y-11485000D01*
X19910000Y-11465000D02*
X19890000Y-11485000D01*
X19890000Y-12665000D02*
X19910000Y-12685000D01*
X19910000Y-12665000D02*
X19890000Y-12685000D01*
X19890000Y-12715000D02*
X19910000Y-12735000D01*
X19910000Y-12715000D02*
X19890000Y-12735000D01*
X19890000Y-12765000D02*
X19910000Y-12785000D01*
X19910000Y-12765000D02*
X19890000Y-12785000D01*
X19890000Y-12815000D02*
X19910000Y-12835000D01*
X19910000Y-12815000D02*
X19890000Y-12835000D01*
X19890000Y-17665000D02*
X19910000Y-17685000D01*
X19910000Y-17665000D02*
X19890000Y-17685000D01*
X19890000Y-17715000D02*
X19910000Y-17735000D01*
X19910000Y-17715000D02*
X19890000Y-17735000D01*
X19890000Y-17765000D02*
X19910000Y-17785000D01*
X19910000Y-17765000D02*
X19890000Y-17785000D01*
X19890000Y-17815000D02*
X19910000Y-17835000D01*
X19910000Y-17815000D02*
X19890000Y-17835000D01*
X21915000Y-11790000D02*
X21935000Y-11810000D01*
X21935000Y-11790000D02*
X21915000Y-11810000D01*
X21965000Y-11790000D02*
X21985000Y-11810000D01*
X21985000Y-11790000D02*
X21965000Y-11810000D01*
X22015000Y-11790000D02*
X22035000Y-11810000D01*
X22035000Y-11790000D02*
X22015000Y-11810000D01*
X22065000Y-11790000D02*
X22085000Y-11810000D01*
X22085000Y-11790000D02*
X22065000Y-11810000D01*
X23965000Y-10990000D02*
X23985000Y-11010000D01*
X23985000Y-10990000D02*
X23965000Y-11010000D01*
X24015000Y-10990000D02*
X24035000Y-11010000D01*
X24035000Y-10990000D02*
X24015000Y-11010000D01*
X24065000Y-10990000D02*
X24085000Y-11010000D01*
X24085000Y-10990000D02*
X24065000Y-11010000D01*
X24115000Y-10990000D02*
X24135000Y-11010000D01*
X24135000Y-10990000D02*
X24115000Y-11010000D01*
X27740000Y-6515000D02*
X27760000Y-6535000D01*
X27760000Y-6515000D02*
X27740000Y-6535000D01*
X27740000Y-6565000D02*
X27760000Y-6585000D01*
X27760000Y-6565000D02*
X27740000Y-6585000D01*
X27740000Y-6615000D02*
X27760000Y-6635000D01*
X27760000Y-6615000D02*
X27740000Y-6635000D01*
X27740000Y-6665000D02*
X27760000Y-6685000D01*
X27760000Y-6665000D02*
X27740000Y-6685000D01*
X27740000Y-8515000D02*
X27760000Y-8535000D01*
X27760000Y-8515000D02*
X27740000Y-8535000D01*
X27740000Y-8565000D02*
X27760000Y-8585000D01*
X27760000Y-8565000D02*
X27740000Y-8585000D01*
X27740000Y-8615000D02*
X27760000Y-8635000D01*
X27760000Y-8615000D02*
X27740000Y-8635000D01*
X27740000Y-8665000D02*
X27760000Y-8685000D01*
X27760000Y-8665000D02*
X27740000Y-8685000D01*
X27740000Y-11315000D02*
X27760000Y-11335000D01*
X27760000Y-11315000D02*
X27740000Y-11335000D01*
X27740000Y-11365000D02*
X27760000Y-11385000D01*
X27760000Y-11365000D02*
X27740000Y-11385000D01*
X27740000Y-11415000D02*
X27760000Y-11435000D01*
X27760000Y-11415000D02*
X27740000Y-11435000D01*
X27740000Y-11465000D02*
X27760000Y-11485000D01*
X27760000Y-11465000D02*
X27740000Y-11485000D01*
X27740000Y-14215000D02*
X27760000Y-14235000D01*
X27760000Y-14215000D02*
X27740000Y-14235000D01*
X27740000Y-14265000D02*
X27760000Y-14285000D01*
X27760000Y-14265000D02*
X27740000Y-14285000D01*
X27740000Y-14315000D02*
X27760000Y-14335000D01*
X27760000Y-14315000D02*
X27740000Y-14335000D01*
X27740000Y-14365000D02*
X27760000Y-14385000D01*
X27760000Y-14365000D02*
X27740000Y-14385000D01*
X27740000Y-16215000D02*
X27760000Y-16235000D01*
X27760000Y-16215000D02*
X27740000Y-16235000D01*
X27740000Y-16265000D02*
X27760000Y-16285000D01*
X27760000Y-16265000D02*
X27740000Y-16285000D01*
X27740000Y-16315000D02*
X27760000Y-16335000D01*
X27760000Y-16315000D02*
X27740000Y-16335000D01*
X27740000Y-16365000D02*
X27760000Y-16385000D01*
X27760000Y-16365000D02*
X27740000Y-16385000D01*
X23954500Y-5902500D02*
G75*
G03*
X23954500Y-5902500I-44500J0D01*
G01*
X23954500Y-8302500D02*
G75*
G03*
X23954500Y-8302500I-44500J0D01*
G01*
X23994500Y-6847500D02*
G75*
G03*
X23994500Y-6847500I-44500J0D01*
G01*
X23994500Y-9247500D02*
G75*
G03*
X23994500Y-9247500I-44500J0D01*
G01*
X25449500Y-5902500D02*
G75*
G03*
X25449500Y-5902500I-44500J0D01*
G01*
X25449500Y-6847500D02*
G75*
G03*
X25449500Y-6847500I-44500J0D01*
G01*
X25449500Y-8302500D02*
G75*
G03*
X25449500Y-8302500I-44500J0D01*
G01*
X25449500Y-9247500D02*
G75*
G03*
X25449500Y-9247500I-44500J0D01*
G01*
X16000000Y-6145000D02*
X16000000Y-6255000D01*
X15945000Y-6200000D02*
X16055000Y-6200000D01*
X16000000Y-7845000D02*
X16000000Y-7955000D01*
X15945000Y-7900000D02*
X16055000Y-7900000D01*
X16400000Y-7845000D02*
X16400000Y-7955000D01*
X16345000Y-7900000D02*
X16455000Y-7900000D01*
X12136402Y-10317452D02*
X12136402Y-10227648D01*
X12046598Y-10227648D01*
X12046598Y-10317452D01*
X12136402Y-10317452D01*
X12136402Y-18017452D02*
X12136402Y-17927648D01*
X12046598Y-17927648D01*
X12046598Y-18017452D01*
X12136402Y-18017452D01*
X12441402Y-4879352D02*
X12441402Y-4789548D01*
X12351598Y-4789548D01*
X12351598Y-4879352D01*
X12441402Y-4879352D01*
X12441402Y-12579352D02*
X12441402Y-12489548D01*
X12351598Y-12489548D01*
X12351598Y-12579352D01*
X12441402Y-12579352D01*
X21036402Y-10317452D02*
X21036402Y-10227648D01*
X20946598Y-10227648D01*
X20946598Y-10317452D01*
X21036402Y-10317452D01*
X21036402Y-18017452D02*
X21036402Y-17927648D01*
X20946598Y-17927648D01*
X20946598Y-18017452D01*
X21036402Y-18017452D01*
X21341402Y-4879352D02*
X21341402Y-4789548D01*
X21251598Y-4789548D01*
X21251598Y-4879352D01*
X21341402Y-4879352D01*
X21341402Y-12579352D02*
X21341402Y-12489548D01*
X21251598Y-12489548D01*
X21251598Y-12579352D01*
X21341402Y-12579352D01*
X17750000Y-4930000D02*
X17885000Y-4795000D01*
X17750000Y-4660000D01*
X17615000Y-4795000D01*
X17750000Y-4930000D01*
X17750000Y-10585000D02*
X17885000Y-10450000D01*
X17750000Y-10315000D01*
X17615000Y-10450000D01*
X17750000Y-10585000D01*
X17750000Y-12630000D02*
X17885000Y-12495000D01*
X17750000Y-12360000D01*
X17615000Y-12495000D01*
X17750000Y-12630000D01*
X17750000Y-18285000D02*
X17885000Y-18150000D01*
X17750000Y-18015000D01*
X17615000Y-18150000D01*
X17750000Y-18285000D01*
X26650000Y-4930000D02*
X26785000Y-4795000D01*
X26650000Y-4660000D01*
X26515000Y-4795000D01*
X26650000Y-4930000D01*
X26650000Y-10585000D02*
X26785000Y-10450000D01*
X26650000Y-10315000D01*
X26515000Y-10450000D01*
X26650000Y-10585000D01*
X26650000Y-12630000D02*
X26785000Y-12495000D01*
X26650000Y-12360000D01*
X26515000Y-12495000D01*
X26650000Y-12630000D01*
X26650000Y-18285000D02*
X26785000Y-18150000D01*
X26650000Y-18015000D01*
X26515000Y-18150000D01*
X26650000Y-18285000D01*
D12*
X10576428Y-19375714D02*
X10576428Y-19075714D01*
X10647857Y-19075714D01*
X10690714Y-19090000D01*
X10719286Y-19118572D01*
X10733571Y-19147143D01*
X10747857Y-19204286D01*
X10747857Y-19247143D01*
X10733571Y-19304286D01*
X10719286Y-19332857D01*
X10690714Y-19361429D01*
X10647857Y-19375714D01*
X10576428Y-19375714D01*
X10876428Y-19375714D02*
X10876428Y-19175714D01*
X10876428Y-19232857D02*
X10890714Y-19204286D01*
X10905000Y-19190000D01*
X10933571Y-19175714D01*
X10962143Y-19175714D01*
X11062143Y-19375714D02*
X11062143Y-19175714D01*
X11062143Y-19075714D02*
X11047857Y-19090000D01*
X11062143Y-19104286D01*
X11076428Y-19090000D01*
X11062143Y-19075714D01*
X11062143Y-19104286D01*
X11247857Y-19375714D02*
X11219286Y-19361429D01*
X11205000Y-19332857D01*
X11205000Y-19075714D01*
X11405000Y-19375714D02*
X11376428Y-19361429D01*
X11362143Y-19332857D01*
X11362143Y-19075714D01*
X11747857Y-19375714D02*
X11747857Y-19075714D01*
X11847857Y-19290000D01*
X11947857Y-19075714D01*
X11947857Y-19375714D01*
X12219286Y-19375714D02*
X12219286Y-19218572D01*
X12205000Y-19190000D01*
X12176428Y-19175714D01*
X12119286Y-19175714D01*
X12090714Y-19190000D01*
X12219286Y-19361429D02*
X12190714Y-19375714D01*
X12119286Y-19375714D01*
X12090714Y-19361429D01*
X12076428Y-19332857D01*
X12076428Y-19304286D01*
X12090714Y-19275714D01*
X12119286Y-19261429D01*
X12190714Y-19261429D01*
X12219286Y-19247143D01*
X12362143Y-19175714D02*
X12362143Y-19475714D01*
X12362143Y-19190000D02*
X12390714Y-19175714D01*
X12447857Y-19175714D01*
X12476428Y-19190000D01*
X12490714Y-19204286D01*
X12505000Y-19232857D01*
X12505000Y-19318572D01*
X12490714Y-19347143D01*
X12476428Y-19361429D01*
X12447857Y-19375714D01*
X12390714Y-19375714D01*
X12362143Y-19361429D01*
X12633571Y-19347143D02*
X12647857Y-19361429D01*
X12633571Y-19375714D01*
X12619286Y-19361429D01*
X12633571Y-19347143D01*
X12633571Y-19375714D01*
X12633571Y-19190000D02*
X12647857Y-19204286D01*
X12633571Y-19218572D01*
X12619286Y-19204286D01*
X12633571Y-19190000D01*
X12633571Y-19218572D01*
X10270000Y-19860000D02*
X10290000Y-19880000D01*
X10290000Y-19860000D02*
X10270000Y-19880000D01*
X10633571Y-19705714D02*
X10662143Y-19705714D01*
X10690714Y-19720000D01*
X10705000Y-19734286D01*
X10719286Y-19762857D01*
X10733571Y-19820000D01*
X10733571Y-19891429D01*
X10719286Y-19948572D01*
X10705000Y-19977143D01*
X10690714Y-19991429D01*
X10662143Y-20005714D01*
X10633571Y-20005714D01*
X10605000Y-19991429D01*
X10590714Y-19977143D01*
X10576428Y-19948572D01*
X10562143Y-19891429D01*
X10562143Y-19820000D01*
X10576428Y-19762857D01*
X10590714Y-19734286D01*
X10605000Y-19720000D01*
X10633571Y-19705714D01*
X10862143Y-19977143D02*
X10876428Y-19991429D01*
X10862143Y-20005714D01*
X10847857Y-19991429D01*
X10862143Y-19977143D01*
X10862143Y-20005714D01*
X10990714Y-19734286D02*
X11005000Y-19720000D01*
X11033571Y-19705714D01*
X11105000Y-19705714D01*
X11133571Y-19720000D01*
X11147857Y-19734286D01*
X11162143Y-19762857D01*
X11162143Y-19791429D01*
X11147857Y-19834286D01*
X10976428Y-20005714D01*
X11162143Y-20005714D01*
X11347857Y-19705714D02*
X11376428Y-19705714D01*
X11405000Y-19720000D01*
X11419286Y-19734286D01*
X11433571Y-19762857D01*
X11447857Y-19820000D01*
X11447857Y-19891429D01*
X11433571Y-19948572D01*
X11419286Y-19977143D01*
X11405000Y-19991429D01*
X11376428Y-20005714D01*
X11347857Y-20005714D01*
X11319286Y-19991429D01*
X11305000Y-19977143D01*
X11290714Y-19948572D01*
X11276428Y-19891429D01*
X11276428Y-19820000D01*
X11290714Y-19762857D01*
X11305000Y-19734286D01*
X11319286Y-19720000D01*
X11347857Y-19705714D01*
X11633571Y-19705714D02*
X11662143Y-19705714D01*
X11690714Y-19720000D01*
X11705000Y-19734286D01*
X11719286Y-19762857D01*
X11733571Y-19820000D01*
X11733571Y-19891429D01*
X11719286Y-19948572D01*
X11705000Y-19977143D01*
X11690714Y-19991429D01*
X11662143Y-20005714D01*
X11633571Y-20005714D01*
X11605000Y-19991429D01*
X11590714Y-19977143D01*
X11576428Y-19948572D01*
X11562143Y-19891429D01*
X11562143Y-19820000D01*
X11576428Y-19762857D01*
X11590714Y-19734286D01*
X11605000Y-19720000D01*
X11633571Y-19705714D01*
X11862143Y-20005714D02*
X11862143Y-19805714D01*
X11862143Y-19834286D02*
X11876428Y-19820000D01*
X11905000Y-19805714D01*
X11947857Y-19805714D01*
X11976428Y-19820000D01*
X11990714Y-19848572D01*
X11990714Y-20005714D01*
X11990714Y-19848572D02*
X12005000Y-19820000D01*
X12033571Y-19805714D01*
X12076428Y-19805714D01*
X12105000Y-19820000D01*
X12119286Y-19848572D01*
X12119286Y-20005714D01*
X12262143Y-20005714D02*
X12262143Y-19805714D01*
X12262143Y-19834286D02*
X12276428Y-19820000D01*
X12305000Y-19805714D01*
X12347857Y-19805714D01*
X12376428Y-19820000D01*
X12390714Y-19848572D01*
X12390714Y-20005714D01*
X12390714Y-19848572D02*
X12405000Y-19820000D01*
X12433571Y-19805714D01*
X12476428Y-19805714D01*
X12505000Y-19820000D01*
X12519286Y-19848572D01*
X12519286Y-20005714D01*
X13105000Y-19691429D02*
X12847857Y-20077143D01*
X13490714Y-19705714D02*
X13519286Y-19705714D01*
X13547857Y-19720000D01*
X13562143Y-19734286D01*
X13576428Y-19762857D01*
X13590714Y-19820000D01*
X13590714Y-19891429D01*
X13576428Y-19948572D01*
X13562143Y-19977143D01*
X13547857Y-19991429D01*
X13519286Y-20005714D01*
X13490714Y-20005714D01*
X13462143Y-19991429D01*
X13447857Y-19977143D01*
X13433571Y-19948572D01*
X13419286Y-19891429D01*
X13419286Y-19820000D01*
X13433571Y-19762857D01*
X13447857Y-19734286D01*
X13462143Y-19720000D01*
X13490714Y-19705714D01*
X13719286Y-19977143D02*
X13733571Y-19991429D01*
X13719286Y-20005714D01*
X13705000Y-19991429D01*
X13719286Y-19977143D01*
X13719286Y-20005714D01*
X13919286Y-19705714D02*
X13947857Y-19705714D01*
X13976428Y-19720000D01*
X13990714Y-19734286D01*
X14005000Y-19762857D01*
X14019286Y-19820000D01*
X14019286Y-19891429D01*
X14005000Y-19948572D01*
X13990714Y-19977143D01*
X13976428Y-19991429D01*
X13947857Y-20005714D01*
X13919286Y-20005714D01*
X13890714Y-19991429D01*
X13876428Y-19977143D01*
X13862143Y-19948572D01*
X13847857Y-19891429D01*
X13847857Y-19820000D01*
X13862143Y-19762857D01*
X13876428Y-19734286D01*
X13890714Y-19720000D01*
X13919286Y-19705714D01*
X14205000Y-19705714D02*
X14233571Y-19705714D01*
X14262143Y-19720000D01*
X14276428Y-19734286D01*
X14290714Y-19762857D01*
X14305000Y-19820000D01*
X14305000Y-19891429D01*
X14290714Y-19948572D01*
X14276428Y-19977143D01*
X14262143Y-19991429D01*
X14233571Y-20005714D01*
X14205000Y-20005714D01*
X14176428Y-19991429D01*
X14162143Y-19977143D01*
X14147857Y-19948572D01*
X14133571Y-19891429D01*
X14133571Y-19820000D01*
X14147857Y-19762857D01*
X14162143Y-19734286D01*
X14176428Y-19720000D01*
X14205000Y-19705714D01*
X14405000Y-19705714D02*
X14605000Y-19705714D01*
X14476428Y-20005714D01*
X14733571Y-20005714D02*
X14790714Y-20005714D01*
X14819286Y-19991429D01*
X14833571Y-19977143D01*
X14862143Y-19934286D01*
X14876428Y-19877143D01*
X14876428Y-19762857D01*
X14862143Y-19734286D01*
X14847857Y-19720000D01*
X14819286Y-19705714D01*
X14762143Y-19705714D01*
X14733571Y-19720000D01*
X14719286Y-19734286D01*
X14705000Y-19762857D01*
X14705000Y-19834286D01*
X14719286Y-19862857D01*
X14733571Y-19877143D01*
X14762143Y-19891429D01*
X14819286Y-19891429D01*
X14847857Y-19877143D01*
X14862143Y-19862857D01*
X14876428Y-19834286D01*
X14990714Y-19705714D02*
X14990714Y-19762857D01*
X15105000Y-19705714D02*
X15105000Y-19762857D01*
X15547857Y-20120000D02*
X15533571Y-20105714D01*
X15505000Y-20062857D01*
X15490714Y-20034286D01*
X15476428Y-19991429D01*
X15462143Y-19920000D01*
X15462143Y-19862857D01*
X15476428Y-19791429D01*
X15490714Y-19748572D01*
X15505000Y-19720000D01*
X15533571Y-19677143D01*
X15547857Y-19662857D01*
X15705000Y-19834286D02*
X15676428Y-19820000D01*
X15662143Y-19805714D01*
X15647857Y-19777143D01*
X15647857Y-19762857D01*
X15662143Y-19734286D01*
X15676428Y-19720000D01*
X15705000Y-19705714D01*
X15762143Y-19705714D01*
X15790714Y-19720000D01*
X15805000Y-19734286D01*
X15819286Y-19762857D01*
X15819286Y-19777143D01*
X15805000Y-19805714D01*
X15790714Y-19820000D01*
X15762143Y-19834286D01*
X15705000Y-19834286D01*
X15676428Y-19848572D01*
X15662143Y-19862857D01*
X15647857Y-19891429D01*
X15647857Y-19948572D01*
X15662143Y-19977143D01*
X15676428Y-19991429D01*
X15705000Y-20005714D01*
X15762143Y-20005714D01*
X15790714Y-19991429D01*
X15805000Y-19977143D01*
X15819286Y-19948572D01*
X15819286Y-19891429D01*
X15805000Y-19862857D01*
X15790714Y-19848572D01*
X15762143Y-19834286D01*
X15990714Y-19834286D02*
X15962143Y-19820000D01*
X15947857Y-19805714D01*
X15933571Y-19777143D01*
X15933571Y-19762857D01*
X15947857Y-19734286D01*
X15962143Y-19720000D01*
X15990714Y-19705714D01*
X16047857Y-19705714D01*
X16076428Y-19720000D01*
X16090714Y-19734286D01*
X16105000Y-19762857D01*
X16105000Y-19777143D01*
X16090714Y-19805714D01*
X16076428Y-19820000D01*
X16047857Y-19834286D01*
X15990714Y-19834286D01*
X15962143Y-19848572D01*
X15947857Y-19862857D01*
X15933571Y-19891429D01*
X15933571Y-19948572D01*
X15947857Y-19977143D01*
X15962143Y-19991429D01*
X15990714Y-20005714D01*
X16047857Y-20005714D01*
X16076428Y-19991429D01*
X16090714Y-19977143D01*
X16105000Y-19948572D01*
X16105000Y-19891429D01*
X16090714Y-19862857D01*
X16076428Y-19848572D01*
X16047857Y-19834286D01*
X16462143Y-20005714D02*
X16462143Y-19705714D01*
X16590714Y-20005714D02*
X16590714Y-19848572D01*
X16576428Y-19820000D01*
X16547857Y-19805714D01*
X16505000Y-19805714D01*
X16476428Y-19820000D01*
X16462143Y-19834286D01*
X16776428Y-20005714D02*
X16747857Y-19991429D01*
X16733571Y-19977143D01*
X16719286Y-19948572D01*
X16719286Y-19862857D01*
X16733571Y-19834286D01*
X16747857Y-19820000D01*
X16776428Y-19805714D01*
X16819286Y-19805714D01*
X16847857Y-19820000D01*
X16862143Y-19834286D01*
X16876428Y-19862857D01*
X16876428Y-19948572D01*
X16862143Y-19977143D01*
X16847857Y-19991429D01*
X16819286Y-20005714D01*
X16776428Y-20005714D01*
X17047857Y-20005714D02*
X17019286Y-19991429D01*
X17005000Y-19962857D01*
X17005000Y-19705714D01*
X17276428Y-19991429D02*
X17247857Y-20005714D01*
X17190714Y-20005714D01*
X17162143Y-19991429D01*
X17147857Y-19962857D01*
X17147857Y-19848572D01*
X17162143Y-19820000D01*
X17190714Y-19805714D01*
X17247857Y-19805714D01*
X17276428Y-19820000D01*
X17290714Y-19848572D01*
X17290714Y-19877143D01*
X17147857Y-19905714D01*
X17405000Y-19991429D02*
X17433571Y-20005714D01*
X17490714Y-20005714D01*
X17519286Y-19991429D01*
X17533571Y-19962857D01*
X17533571Y-19948572D01*
X17519286Y-19920000D01*
X17490714Y-19905714D01*
X17447857Y-19905714D01*
X17419286Y-19891429D01*
X17405000Y-19862857D01*
X17405000Y-19848572D01*
X17419286Y-19820000D01*
X17447857Y-19805714D01*
X17490714Y-19805714D01*
X17519286Y-19820000D01*
X17633571Y-20120000D02*
X17647857Y-20105714D01*
X17676428Y-20062857D01*
X17690714Y-20034286D01*
X17705000Y-19991429D01*
X17719286Y-19920000D01*
X17719286Y-19862857D01*
X17705000Y-19791429D01*
X17690714Y-19748572D01*
X17676428Y-19720000D01*
X17647857Y-19677143D01*
X17633571Y-19662857D01*
X18176428Y-20120000D02*
X18162143Y-20105714D01*
X18133571Y-20062857D01*
X18119286Y-20034286D01*
X18105000Y-19991429D01*
X18090714Y-19920000D01*
X18090714Y-19862857D01*
X18105000Y-19791429D01*
X18119286Y-19748572D01*
X18133571Y-19720000D01*
X18162143Y-19677143D01*
X18176428Y-19662857D01*
X18290714Y-19805714D02*
X18290714Y-20005714D01*
X18290714Y-19834286D02*
X18305000Y-19820000D01*
X18333571Y-19805714D01*
X18376428Y-19805714D01*
X18405000Y-19820000D01*
X18419286Y-19848572D01*
X18419286Y-20005714D01*
X18605000Y-20005714D02*
X18576428Y-19991429D01*
X18562143Y-19977143D01*
X18547857Y-19948572D01*
X18547857Y-19862857D01*
X18562143Y-19834286D01*
X18576428Y-19820000D01*
X18605000Y-19805714D01*
X18647857Y-19805714D01*
X18676428Y-19820000D01*
X18690714Y-19834286D01*
X18705000Y-19862857D01*
X18705000Y-19948572D01*
X18690714Y-19977143D01*
X18676428Y-19991429D01*
X18647857Y-20005714D01*
X18605000Y-20005714D01*
X18790714Y-19805714D02*
X18905000Y-19805714D01*
X18833571Y-19705714D02*
X18833571Y-19962857D01*
X18847857Y-19991429D01*
X18876428Y-20005714D01*
X18905000Y-20005714D01*
X19233571Y-19805714D02*
X19233571Y-20105714D01*
X19233571Y-19820000D02*
X19262143Y-19805714D01*
X19319286Y-19805714D01*
X19347857Y-19820000D01*
X19362143Y-19834286D01*
X19376428Y-19862857D01*
X19376428Y-19948572D01*
X19362143Y-19977143D01*
X19347857Y-19991429D01*
X19319286Y-20005714D01*
X19262143Y-20005714D01*
X19233571Y-19991429D01*
X19547857Y-20005714D02*
X19519286Y-19991429D01*
X19505000Y-19962857D01*
X19505000Y-19705714D01*
X19790714Y-20005714D02*
X19790714Y-19848572D01*
X19776428Y-19820000D01*
X19747857Y-19805714D01*
X19690714Y-19805714D01*
X19662143Y-19820000D01*
X19790714Y-19991429D02*
X19762143Y-20005714D01*
X19690714Y-20005714D01*
X19662143Y-19991429D01*
X19647857Y-19962857D01*
X19647857Y-19934286D01*
X19662143Y-19905714D01*
X19690714Y-19891429D01*
X19762143Y-19891429D01*
X19790714Y-19877143D01*
X19890714Y-19805714D02*
X20005000Y-19805714D01*
X19933571Y-19705714D02*
X19933571Y-19962857D01*
X19947857Y-19991429D01*
X19976428Y-20005714D01*
X20005000Y-20005714D01*
X20219286Y-19991429D02*
X20190714Y-20005714D01*
X20133571Y-20005714D01*
X20105000Y-19991429D01*
X20090714Y-19962857D01*
X20090714Y-19848572D01*
X20105000Y-19820000D01*
X20133571Y-19805714D01*
X20190714Y-19805714D01*
X20219286Y-19820000D01*
X20233571Y-19848572D01*
X20233571Y-19877143D01*
X20090714Y-19905714D01*
X20490714Y-20005714D02*
X20490714Y-19705714D01*
X20490714Y-19991429D02*
X20462143Y-20005714D01*
X20405000Y-20005714D01*
X20376428Y-19991429D01*
X20362143Y-19977143D01*
X20347857Y-19948572D01*
X20347857Y-19862857D01*
X20362143Y-19834286D01*
X20376428Y-19820000D01*
X20405000Y-19805714D01*
X20462143Y-19805714D01*
X20490714Y-19820000D01*
X20605000Y-20120000D02*
X20619286Y-20105714D01*
X20647857Y-20062857D01*
X20662143Y-20034286D01*
X20676428Y-19991429D01*
X20690714Y-19920000D01*
X20690714Y-19862857D01*
X20676428Y-19791429D01*
X20662143Y-19748572D01*
X20647857Y-19720000D01*
X20619286Y-19677143D01*
X20605000Y-19662857D01*
X10290000Y-20266000D02*
G75*
G03*
X10290000Y-20266000I-44500J0D01*
G01*
X10633571Y-20101714D02*
X10662143Y-20101714D01*
X10690714Y-20116000D01*
X10705000Y-20130286D01*
X10719286Y-20158857D01*
X10733571Y-20216000D01*
X10733571Y-20287429D01*
X10719286Y-20344572D01*
X10705000Y-20373143D01*
X10690714Y-20387429D01*
X10662143Y-20401714D01*
X10633571Y-20401714D01*
X10605000Y-20387429D01*
X10590714Y-20373143D01*
X10576428Y-20344572D01*
X10562143Y-20287429D01*
X10562143Y-20216000D01*
X10576428Y-20158857D01*
X10590714Y-20130286D01*
X10605000Y-20116000D01*
X10633571Y-20101714D01*
X10862143Y-20373143D02*
X10876428Y-20387429D01*
X10862143Y-20401714D01*
X10847857Y-20387429D01*
X10862143Y-20373143D01*
X10862143Y-20401714D01*
X11047857Y-20230286D02*
X11019286Y-20216000D01*
X11005000Y-20201714D01*
X10990714Y-20173143D01*
X10990714Y-20158857D01*
X11005000Y-20130286D01*
X11019286Y-20116000D01*
X11047857Y-20101714D01*
X11105000Y-20101714D01*
X11133571Y-20116000D01*
X11147857Y-20130286D01*
X11162143Y-20158857D01*
X11162143Y-20173143D01*
X11147857Y-20201714D01*
X11133571Y-20216000D01*
X11105000Y-20230286D01*
X11047857Y-20230286D01*
X11019286Y-20244572D01*
X11005000Y-20258857D01*
X10990714Y-20287429D01*
X10990714Y-20344572D01*
X11005000Y-20373143D01*
X11019286Y-20387429D01*
X11047857Y-20401714D01*
X11105000Y-20401714D01*
X11133571Y-20387429D01*
X11147857Y-20373143D01*
X11162143Y-20344572D01*
X11162143Y-20287429D01*
X11147857Y-20258857D01*
X11133571Y-20244572D01*
X11105000Y-20230286D01*
X11305000Y-20401714D02*
X11362143Y-20401714D01*
X11390714Y-20387429D01*
X11405000Y-20373143D01*
X11433571Y-20330286D01*
X11447857Y-20273143D01*
X11447857Y-20158857D01*
X11433571Y-20130286D01*
X11419286Y-20116000D01*
X11390714Y-20101714D01*
X11333571Y-20101714D01*
X11305000Y-20116000D01*
X11290714Y-20130286D01*
X11276428Y-20158857D01*
X11276428Y-20230286D01*
X11290714Y-20258857D01*
X11305000Y-20273143D01*
X11333571Y-20287429D01*
X11390714Y-20287429D01*
X11419286Y-20273143D01*
X11433571Y-20258857D01*
X11447857Y-20230286D01*
X11633571Y-20101714D02*
X11662143Y-20101714D01*
X11690714Y-20116000D01*
X11705000Y-20130286D01*
X11719286Y-20158857D01*
X11733571Y-20216000D01*
X11733571Y-20287429D01*
X11719286Y-20344572D01*
X11705000Y-20373143D01*
X11690714Y-20387429D01*
X11662143Y-20401714D01*
X11633571Y-20401714D01*
X11605000Y-20387429D01*
X11590714Y-20373143D01*
X11576428Y-20344572D01*
X11562143Y-20287429D01*
X11562143Y-20216000D01*
X11576428Y-20158857D01*
X11590714Y-20130286D01*
X11605000Y-20116000D01*
X11633571Y-20101714D01*
X11862143Y-20401714D02*
X11862143Y-20201714D01*
X11862143Y-20230286D02*
X11876428Y-20216000D01*
X11905000Y-20201714D01*
X11947857Y-20201714D01*
X11976428Y-20216000D01*
X11990714Y-20244572D01*
X11990714Y-20401714D01*
X11990714Y-20244572D02*
X12005000Y-20216000D01*
X12033571Y-20201714D01*
X12076428Y-20201714D01*
X12105000Y-20216000D01*
X12119286Y-20244572D01*
X12119286Y-20401714D01*
X12262143Y-20401714D02*
X12262143Y-20201714D01*
X12262143Y-20230286D02*
X12276428Y-20216000D01*
X12305000Y-20201714D01*
X12347857Y-20201714D01*
X12376428Y-20216000D01*
X12390714Y-20244572D01*
X12390714Y-20401714D01*
X12390714Y-20244572D02*
X12405000Y-20216000D01*
X12433571Y-20201714D01*
X12476428Y-20201714D01*
X12505000Y-20216000D01*
X12519286Y-20244572D01*
X12519286Y-20401714D01*
X13105000Y-20087429D02*
X12847857Y-20473143D01*
X13490714Y-20101714D02*
X13519286Y-20101714D01*
X13547857Y-20116000D01*
X13562143Y-20130286D01*
X13576428Y-20158857D01*
X13590714Y-20216000D01*
X13590714Y-20287429D01*
X13576428Y-20344572D01*
X13562143Y-20373143D01*
X13547857Y-20387429D01*
X13519286Y-20401714D01*
X13490714Y-20401714D01*
X13462143Y-20387429D01*
X13447857Y-20373143D01*
X13433571Y-20344572D01*
X13419286Y-20287429D01*
X13419286Y-20216000D01*
X13433571Y-20158857D01*
X13447857Y-20130286D01*
X13462143Y-20116000D01*
X13490714Y-20101714D01*
X13719286Y-20373143D02*
X13733571Y-20387429D01*
X13719286Y-20401714D01*
X13705000Y-20387429D01*
X13719286Y-20373143D01*
X13719286Y-20401714D01*
X13919286Y-20101714D02*
X13947857Y-20101714D01*
X13976428Y-20116000D01*
X13990714Y-20130286D01*
X14005000Y-20158857D01*
X14019286Y-20216000D01*
X14019286Y-20287429D01*
X14005000Y-20344572D01*
X13990714Y-20373143D01*
X13976428Y-20387429D01*
X13947857Y-20401714D01*
X13919286Y-20401714D01*
X13890714Y-20387429D01*
X13876428Y-20373143D01*
X13862143Y-20344572D01*
X13847857Y-20287429D01*
X13847857Y-20216000D01*
X13862143Y-20158857D01*
X13876428Y-20130286D01*
X13890714Y-20116000D01*
X13919286Y-20101714D01*
X14119286Y-20101714D02*
X14305000Y-20101714D01*
X14205000Y-20216000D01*
X14247857Y-20216000D01*
X14276428Y-20230286D01*
X14290714Y-20244572D01*
X14305000Y-20273143D01*
X14305000Y-20344572D01*
X14290714Y-20373143D01*
X14276428Y-20387429D01*
X14247857Y-20401714D01*
X14162143Y-20401714D01*
X14133571Y-20387429D01*
X14119286Y-20373143D01*
X14576428Y-20101714D02*
X14433571Y-20101714D01*
X14419286Y-20244572D01*
X14433571Y-20230286D01*
X14462143Y-20216000D01*
X14533571Y-20216000D01*
X14562143Y-20230286D01*
X14576428Y-20244572D01*
X14590714Y-20273143D01*
X14590714Y-20344572D01*
X14576428Y-20373143D01*
X14562143Y-20387429D01*
X14533571Y-20401714D01*
X14462143Y-20401714D01*
X14433571Y-20387429D01*
X14419286Y-20373143D01*
X14776428Y-20101714D02*
X14805000Y-20101714D01*
X14833571Y-20116000D01*
X14847857Y-20130286D01*
X14862143Y-20158857D01*
X14876428Y-20216000D01*
X14876428Y-20287429D01*
X14862143Y-20344572D01*
X14847857Y-20373143D01*
X14833571Y-20387429D01*
X14805000Y-20401714D01*
X14776428Y-20401714D01*
X14747857Y-20387429D01*
X14733571Y-20373143D01*
X14719286Y-20344572D01*
X14705000Y-20287429D01*
X14705000Y-20216000D01*
X14719286Y-20158857D01*
X14733571Y-20130286D01*
X14747857Y-20116000D01*
X14776428Y-20101714D01*
X14990714Y-20101714D02*
X14990714Y-20158857D01*
X15105000Y-20101714D02*
X15105000Y-20158857D01*
X15547857Y-20516000D02*
X15533571Y-20501714D01*
X15505000Y-20458857D01*
X15490714Y-20430286D01*
X15476428Y-20387429D01*
X15462143Y-20316000D01*
X15462143Y-20258857D01*
X15476428Y-20187429D01*
X15490714Y-20144572D01*
X15505000Y-20116000D01*
X15533571Y-20073143D01*
X15547857Y-20058857D01*
X15705000Y-20230286D02*
X15676428Y-20216000D01*
X15662143Y-20201714D01*
X15647857Y-20173143D01*
X15647857Y-20158857D01*
X15662143Y-20130286D01*
X15676428Y-20116000D01*
X15705000Y-20101714D01*
X15762143Y-20101714D01*
X15790714Y-20116000D01*
X15805000Y-20130286D01*
X15819286Y-20158857D01*
X15819286Y-20173143D01*
X15805000Y-20201714D01*
X15790714Y-20216000D01*
X15762143Y-20230286D01*
X15705000Y-20230286D01*
X15676428Y-20244572D01*
X15662143Y-20258857D01*
X15647857Y-20287429D01*
X15647857Y-20344572D01*
X15662143Y-20373143D01*
X15676428Y-20387429D01*
X15705000Y-20401714D01*
X15762143Y-20401714D01*
X15790714Y-20387429D01*
X15805000Y-20373143D01*
X15819286Y-20344572D01*
X15819286Y-20287429D01*
X15805000Y-20258857D01*
X15790714Y-20244572D01*
X15762143Y-20230286D01*
X16176428Y-20401714D02*
X16176428Y-20101714D01*
X16305000Y-20401714D02*
X16305000Y-20244572D01*
X16290714Y-20216000D01*
X16262143Y-20201714D01*
X16219286Y-20201714D01*
X16190714Y-20216000D01*
X16176428Y-20230286D01*
X16490714Y-20401714D02*
X16462143Y-20387429D01*
X16447857Y-20373143D01*
X16433571Y-20344572D01*
X16433571Y-20258857D01*
X16447857Y-20230286D01*
X16462143Y-20216000D01*
X16490714Y-20201714D01*
X16533571Y-20201714D01*
X16562143Y-20216000D01*
X16576428Y-20230286D01*
X16590714Y-20258857D01*
X16590714Y-20344572D01*
X16576428Y-20373143D01*
X16562143Y-20387429D01*
X16533571Y-20401714D01*
X16490714Y-20401714D01*
X16762143Y-20401714D02*
X16733571Y-20387429D01*
X16719286Y-20358857D01*
X16719286Y-20101714D01*
X16990714Y-20387429D02*
X16962143Y-20401714D01*
X16905000Y-20401714D01*
X16876428Y-20387429D01*
X16862143Y-20358857D01*
X16862143Y-20244572D01*
X16876428Y-20216000D01*
X16905000Y-20201714D01*
X16962143Y-20201714D01*
X16990714Y-20216000D01*
X17005000Y-20244572D01*
X17005000Y-20273143D01*
X16862143Y-20301714D01*
X17119286Y-20387429D02*
X17147857Y-20401714D01*
X17205000Y-20401714D01*
X17233571Y-20387429D01*
X17247857Y-20358857D01*
X17247857Y-20344572D01*
X17233571Y-20316000D01*
X17205000Y-20301714D01*
X17162143Y-20301714D01*
X17133571Y-20287429D01*
X17119286Y-20258857D01*
X17119286Y-20244572D01*
X17133571Y-20216000D01*
X17162143Y-20201714D01*
X17205000Y-20201714D01*
X17233571Y-20216000D01*
X17347857Y-20516000D02*
X17362143Y-20501714D01*
X17390714Y-20458857D01*
X17405000Y-20430286D01*
X17419286Y-20387429D01*
X17433571Y-20316000D01*
X17433571Y-20258857D01*
X17419286Y-20187429D01*
X17405000Y-20144572D01*
X17390714Y-20116000D01*
X17362143Y-20073143D01*
X17347857Y-20058857D01*
X17890714Y-20516000D02*
X17876428Y-20501714D01*
X17847857Y-20458857D01*
X17833571Y-20430286D01*
X17819286Y-20387429D01*
X17805000Y-20316000D01*
X17805000Y-20258857D01*
X17819286Y-20187429D01*
X17833571Y-20144572D01*
X17847857Y-20116000D01*
X17876428Y-20073143D01*
X17890714Y-20058857D01*
X18005000Y-20201714D02*
X18005000Y-20401714D01*
X18005000Y-20230286D02*
X18019286Y-20216000D01*
X18047857Y-20201714D01*
X18090714Y-20201714D01*
X18119286Y-20216000D01*
X18133571Y-20244572D01*
X18133571Y-20401714D01*
X18319286Y-20401714D02*
X18290714Y-20387429D01*
X18276428Y-20373143D01*
X18262143Y-20344572D01*
X18262143Y-20258857D01*
X18276428Y-20230286D01*
X18290714Y-20216000D01*
X18319286Y-20201714D01*
X18362143Y-20201714D01*
X18390714Y-20216000D01*
X18405000Y-20230286D01*
X18419286Y-20258857D01*
X18419286Y-20344572D01*
X18405000Y-20373143D01*
X18390714Y-20387429D01*
X18362143Y-20401714D01*
X18319286Y-20401714D01*
X18505000Y-20201714D02*
X18619286Y-20201714D01*
X18547857Y-20101714D02*
X18547857Y-20358857D01*
X18562143Y-20387429D01*
X18590714Y-20401714D01*
X18619286Y-20401714D01*
X18947857Y-20201714D02*
X18947857Y-20501714D01*
X18947857Y-20216000D02*
X18976428Y-20201714D01*
X19033571Y-20201714D01*
X19062143Y-20216000D01*
X19076428Y-20230286D01*
X19090714Y-20258857D01*
X19090714Y-20344572D01*
X19076428Y-20373143D01*
X19062143Y-20387429D01*
X19033571Y-20401714D01*
X18976428Y-20401714D01*
X18947857Y-20387429D01*
X19262143Y-20401714D02*
X19233571Y-20387429D01*
X19219286Y-20358857D01*
X19219286Y-20101714D01*
X19505000Y-20401714D02*
X19505000Y-20244572D01*
X19490714Y-20216000D01*
X19462143Y-20201714D01*
X19405000Y-20201714D01*
X19376428Y-20216000D01*
X19505000Y-20387429D02*
X19476428Y-20401714D01*
X19405000Y-20401714D01*
X19376428Y-20387429D01*
X19362143Y-20358857D01*
X19362143Y-20330286D01*
X19376428Y-20301714D01*
X19405000Y-20287429D01*
X19476428Y-20287429D01*
X19505000Y-20273143D01*
X19605000Y-20201714D02*
X19719286Y-20201714D01*
X19647857Y-20101714D02*
X19647857Y-20358857D01*
X19662143Y-20387429D01*
X19690714Y-20401714D01*
X19719286Y-20401714D01*
X19933571Y-20387429D02*
X19905000Y-20401714D01*
X19847857Y-20401714D01*
X19819286Y-20387429D01*
X19805000Y-20358857D01*
X19805000Y-20244572D01*
X19819286Y-20216000D01*
X19847857Y-20201714D01*
X19905000Y-20201714D01*
X19933571Y-20216000D01*
X19947857Y-20244572D01*
X19947857Y-20273143D01*
X19805000Y-20301714D01*
X20205000Y-20401714D02*
X20205000Y-20101714D01*
X20205000Y-20387429D02*
X20176428Y-20401714D01*
X20119286Y-20401714D01*
X20090714Y-20387429D01*
X20076428Y-20373143D01*
X20062143Y-20344572D01*
X20062143Y-20258857D01*
X20076428Y-20230286D01*
X20090714Y-20216000D01*
X20119286Y-20201714D01*
X20176428Y-20201714D01*
X20205000Y-20216000D01*
X20319286Y-20516000D02*
X20333571Y-20501714D01*
X20362143Y-20458857D01*
X20376428Y-20430286D01*
X20390714Y-20387429D01*
X20405000Y-20316000D01*
X20405000Y-20258857D01*
X20390714Y-20187429D01*
X20376428Y-20144572D01*
X20362143Y-20116000D01*
X20333571Y-20073143D01*
X20319286Y-20058857D01*
X10235000Y-20607000D02*
X10235000Y-20717000D01*
X10180000Y-20662000D02*
X10290000Y-20662000D01*
X10733571Y-20797714D02*
X10562143Y-20797714D01*
X10647857Y-20797714D02*
X10647857Y-20497714D01*
X10619286Y-20540572D01*
X10590714Y-20569143D01*
X10562143Y-20583429D01*
X10862143Y-20769143D02*
X10876428Y-20783429D01*
X10862143Y-20797714D01*
X10847857Y-20783429D01*
X10862143Y-20769143D01*
X10862143Y-20797714D01*
X11162143Y-20797714D02*
X10990714Y-20797714D01*
X11076428Y-20797714D02*
X11076428Y-20497714D01*
X11047857Y-20540572D01*
X11019286Y-20569143D01*
X10990714Y-20583429D01*
X11347857Y-20497714D02*
X11376428Y-20497714D01*
X11405000Y-20512000D01*
X11419286Y-20526286D01*
X11433571Y-20554857D01*
X11447857Y-20612000D01*
X11447857Y-20683429D01*
X11433571Y-20740572D01*
X11419286Y-20769143D01*
X11405000Y-20783429D01*
X11376428Y-20797714D01*
X11347857Y-20797714D01*
X11319286Y-20783429D01*
X11305000Y-20769143D01*
X11290714Y-20740572D01*
X11276428Y-20683429D01*
X11276428Y-20612000D01*
X11290714Y-20554857D01*
X11305000Y-20526286D01*
X11319286Y-20512000D01*
X11347857Y-20497714D01*
X11633571Y-20497714D02*
X11662143Y-20497714D01*
X11690714Y-20512000D01*
X11705000Y-20526286D01*
X11719286Y-20554857D01*
X11733571Y-20612000D01*
X11733571Y-20683429D01*
X11719286Y-20740572D01*
X11705000Y-20769143D01*
X11690714Y-20783429D01*
X11662143Y-20797714D01*
X11633571Y-20797714D01*
X11605000Y-20783429D01*
X11590714Y-20769143D01*
X11576428Y-20740572D01*
X11562143Y-20683429D01*
X11562143Y-20612000D01*
X11576428Y-20554857D01*
X11590714Y-20526286D01*
X11605000Y-20512000D01*
X11633571Y-20497714D01*
X11862143Y-20797714D02*
X11862143Y-20597714D01*
X11862143Y-20626286D02*
X11876428Y-20612000D01*
X11905000Y-20597714D01*
X11947857Y-20597714D01*
X11976428Y-20612000D01*
X11990714Y-20640572D01*
X11990714Y-20797714D01*
X11990714Y-20640572D02*
X12005000Y-20612000D01*
X12033571Y-20597714D01*
X12076428Y-20597714D01*
X12105000Y-20612000D01*
X12119286Y-20640572D01*
X12119286Y-20797714D01*
X12262143Y-20797714D02*
X12262143Y-20597714D01*
X12262143Y-20626286D02*
X12276428Y-20612000D01*
X12305000Y-20597714D01*
X12347857Y-20597714D01*
X12376428Y-20612000D01*
X12390714Y-20640572D01*
X12390714Y-20797714D01*
X12390714Y-20640572D02*
X12405000Y-20612000D01*
X12433571Y-20597714D01*
X12476428Y-20597714D01*
X12505000Y-20612000D01*
X12519286Y-20640572D01*
X12519286Y-20797714D01*
X13105000Y-20483429D02*
X12847857Y-20869143D01*
X13490714Y-20497714D02*
X13519286Y-20497714D01*
X13547857Y-20512000D01*
X13562143Y-20526286D01*
X13576428Y-20554857D01*
X13590714Y-20612000D01*
X13590714Y-20683429D01*
X13576428Y-20740572D01*
X13562143Y-20769143D01*
X13547857Y-20783429D01*
X13519286Y-20797714D01*
X13490714Y-20797714D01*
X13462143Y-20783429D01*
X13447857Y-20769143D01*
X13433571Y-20740572D01*
X13419286Y-20683429D01*
X13419286Y-20612000D01*
X13433571Y-20554857D01*
X13447857Y-20526286D01*
X13462143Y-20512000D01*
X13490714Y-20497714D01*
X13719286Y-20769143D02*
X13733571Y-20783429D01*
X13719286Y-20797714D01*
X13705000Y-20783429D01*
X13719286Y-20769143D01*
X13719286Y-20797714D01*
X13919286Y-20497714D02*
X13947857Y-20497714D01*
X13976428Y-20512000D01*
X13990714Y-20526286D01*
X14005000Y-20554857D01*
X14019286Y-20612000D01*
X14019286Y-20683429D01*
X14005000Y-20740572D01*
X13990714Y-20769143D01*
X13976428Y-20783429D01*
X13947857Y-20797714D01*
X13919286Y-20797714D01*
X13890714Y-20783429D01*
X13876428Y-20769143D01*
X13862143Y-20740572D01*
X13847857Y-20683429D01*
X13847857Y-20612000D01*
X13862143Y-20554857D01*
X13876428Y-20526286D01*
X13890714Y-20512000D01*
X13919286Y-20497714D01*
X14276428Y-20597714D02*
X14276428Y-20797714D01*
X14205000Y-20483429D02*
X14133571Y-20697714D01*
X14319286Y-20697714D01*
X14405000Y-20497714D02*
X14590714Y-20497714D01*
X14490714Y-20612000D01*
X14533571Y-20612000D01*
X14562143Y-20626286D01*
X14576428Y-20640572D01*
X14590714Y-20669143D01*
X14590714Y-20740572D01*
X14576428Y-20769143D01*
X14562143Y-20783429D01*
X14533571Y-20797714D01*
X14447857Y-20797714D01*
X14419286Y-20783429D01*
X14405000Y-20769143D01*
X14690714Y-20497714D02*
X14876428Y-20497714D01*
X14776428Y-20612000D01*
X14819286Y-20612000D01*
X14847857Y-20626286D01*
X14862143Y-20640572D01*
X14876428Y-20669143D01*
X14876428Y-20740572D01*
X14862143Y-20769143D01*
X14847857Y-20783429D01*
X14819286Y-20797714D01*
X14733571Y-20797714D01*
X14705000Y-20783429D01*
X14690714Y-20769143D01*
X14990714Y-20497714D02*
X14990714Y-20554857D01*
X15105000Y-20497714D02*
X15105000Y-20554857D01*
X15547857Y-20912000D02*
X15533571Y-20897714D01*
X15505000Y-20854857D01*
X15490714Y-20826286D01*
X15476428Y-20783429D01*
X15462143Y-20712000D01*
X15462143Y-20654857D01*
X15476428Y-20583429D01*
X15490714Y-20540572D01*
X15505000Y-20512000D01*
X15533571Y-20469143D01*
X15547857Y-20454857D01*
X15633571Y-20497714D02*
X15819286Y-20497714D01*
X15719286Y-20612000D01*
X15762143Y-20612000D01*
X15790714Y-20626286D01*
X15805000Y-20640572D01*
X15819286Y-20669143D01*
X15819286Y-20740572D01*
X15805000Y-20769143D01*
X15790714Y-20783429D01*
X15762143Y-20797714D01*
X15676428Y-20797714D01*
X15647857Y-20783429D01*
X15633571Y-20769143D01*
X16176428Y-20797714D02*
X16176428Y-20497714D01*
X16305000Y-20797714D02*
X16305000Y-20640572D01*
X16290714Y-20612000D01*
X16262143Y-20597714D01*
X16219286Y-20597714D01*
X16190714Y-20612000D01*
X16176428Y-20626286D01*
X16490714Y-20797714D02*
X16462143Y-20783429D01*
X16447857Y-20769143D01*
X16433571Y-20740572D01*
X16433571Y-20654857D01*
X16447857Y-20626286D01*
X16462143Y-20612000D01*
X16490714Y-20597714D01*
X16533571Y-20597714D01*
X16562143Y-20612000D01*
X16576428Y-20626286D01*
X16590714Y-20654857D01*
X16590714Y-20740572D01*
X16576428Y-20769143D01*
X16562143Y-20783429D01*
X16533571Y-20797714D01*
X16490714Y-20797714D01*
X16762143Y-20797714D02*
X16733571Y-20783429D01*
X16719286Y-20754857D01*
X16719286Y-20497714D01*
X16990714Y-20783429D02*
X16962143Y-20797714D01*
X16905000Y-20797714D01*
X16876428Y-20783429D01*
X16862143Y-20754857D01*
X16862143Y-20640572D01*
X16876428Y-20612000D01*
X16905000Y-20597714D01*
X16962143Y-20597714D01*
X16990714Y-20612000D01*
X17005000Y-20640572D01*
X17005000Y-20669143D01*
X16862143Y-20697714D01*
X17119286Y-20783429D02*
X17147857Y-20797714D01*
X17205000Y-20797714D01*
X17233571Y-20783429D01*
X17247857Y-20754857D01*
X17247857Y-20740572D01*
X17233571Y-20712000D01*
X17205000Y-20697714D01*
X17162143Y-20697714D01*
X17133571Y-20683429D01*
X17119286Y-20654857D01*
X17119286Y-20640572D01*
X17133571Y-20612000D01*
X17162143Y-20597714D01*
X17205000Y-20597714D01*
X17233571Y-20612000D01*
X17347857Y-20912000D02*
X17362143Y-20897714D01*
X17390714Y-20854857D01*
X17405000Y-20826286D01*
X17419286Y-20783429D01*
X17433571Y-20712000D01*
X17433571Y-20654857D01*
X17419286Y-20583429D01*
X17405000Y-20540572D01*
X17390714Y-20512000D01*
X17362143Y-20469143D01*
X17347857Y-20454857D01*
X17890714Y-20912000D02*
X17876428Y-20897714D01*
X17847857Y-20854857D01*
X17833571Y-20826286D01*
X17819286Y-20783429D01*
X17805000Y-20712000D01*
X17805000Y-20654857D01*
X17819286Y-20583429D01*
X17833571Y-20540572D01*
X17847857Y-20512000D01*
X17876428Y-20469143D01*
X17890714Y-20454857D01*
X18005000Y-20597714D02*
X18005000Y-20797714D01*
X18005000Y-20626286D02*
X18019286Y-20612000D01*
X18047857Y-20597714D01*
X18090714Y-20597714D01*
X18119286Y-20612000D01*
X18133571Y-20640572D01*
X18133571Y-20797714D01*
X18319286Y-20797714D02*
X18290714Y-20783429D01*
X18276428Y-20769143D01*
X18262143Y-20740572D01*
X18262143Y-20654857D01*
X18276428Y-20626286D01*
X18290714Y-20612000D01*
X18319286Y-20597714D01*
X18362143Y-20597714D01*
X18390714Y-20612000D01*
X18405000Y-20626286D01*
X18419286Y-20654857D01*
X18419286Y-20740572D01*
X18405000Y-20769143D01*
X18390714Y-20783429D01*
X18362143Y-20797714D01*
X18319286Y-20797714D01*
X18505000Y-20597714D02*
X18619286Y-20597714D01*
X18547857Y-20497714D02*
X18547857Y-20754857D01*
X18562143Y-20783429D01*
X18590714Y-20797714D01*
X18619286Y-20797714D01*
X18947857Y-20597714D02*
X18947857Y-20897714D01*
X18947857Y-20612000D02*
X18976428Y-20597714D01*
X19033571Y-20597714D01*
X19062143Y-20612000D01*
X19076428Y-20626286D01*
X19090714Y-20654857D01*
X19090714Y-20740572D01*
X19076428Y-20769143D01*
X19062143Y-20783429D01*
X19033571Y-20797714D01*
X18976428Y-20797714D01*
X18947857Y-20783429D01*
X19262143Y-20797714D02*
X19233571Y-20783429D01*
X19219286Y-20754857D01*
X19219286Y-20497714D01*
X19505000Y-20797714D02*
X19505000Y-20640572D01*
X19490714Y-20612000D01*
X19462143Y-20597714D01*
X19405000Y-20597714D01*
X19376428Y-20612000D01*
X19505000Y-20783429D02*
X19476428Y-20797714D01*
X19405000Y-20797714D01*
X19376428Y-20783429D01*
X19362143Y-20754857D01*
X19362143Y-20726286D01*
X19376428Y-20697714D01*
X19405000Y-20683429D01*
X19476428Y-20683429D01*
X19505000Y-20669143D01*
X19605000Y-20597714D02*
X19719286Y-20597714D01*
X19647857Y-20497714D02*
X19647857Y-20754857D01*
X19662143Y-20783429D01*
X19690714Y-20797714D01*
X19719286Y-20797714D01*
X19933571Y-20783429D02*
X19905000Y-20797714D01*
X19847857Y-20797714D01*
X19819286Y-20783429D01*
X19805000Y-20754857D01*
X19805000Y-20640572D01*
X19819286Y-20612000D01*
X19847857Y-20597714D01*
X19905000Y-20597714D01*
X19933571Y-20612000D01*
X19947857Y-20640572D01*
X19947857Y-20669143D01*
X19805000Y-20697714D01*
X20205000Y-20797714D02*
X20205000Y-20497714D01*
X20205000Y-20783429D02*
X20176428Y-20797714D01*
X20119286Y-20797714D01*
X20090714Y-20783429D01*
X20076428Y-20769143D01*
X20062143Y-20740572D01*
X20062143Y-20654857D01*
X20076428Y-20626286D01*
X20090714Y-20612000D01*
X20119286Y-20597714D01*
X20176428Y-20597714D01*
X20205000Y-20612000D01*
X20319286Y-20912000D02*
X20333571Y-20897714D01*
X20362143Y-20854857D01*
X20376428Y-20826286D01*
X20390714Y-20783429D01*
X20405000Y-20712000D01*
X20405000Y-20654857D01*
X20390714Y-20583429D01*
X20376428Y-20540572D01*
X20362143Y-20512000D01*
X20333571Y-20469143D01*
X20319286Y-20454857D01*
X10271402Y-21102902D02*
X10271402Y-21013098D01*
X10181598Y-21013098D01*
X10181598Y-21102902D01*
X10271402Y-21102902D01*
X10733571Y-21193714D02*
X10562143Y-21193714D01*
X10647857Y-21193714D02*
X10647857Y-20893714D01*
X10619286Y-20936572D01*
X10590714Y-20965143D01*
X10562143Y-20979429D01*
X10862143Y-21165143D02*
X10876428Y-21179429D01*
X10862143Y-21193714D01*
X10847857Y-21179429D01*
X10862143Y-21165143D01*
X10862143Y-21193714D01*
X10990714Y-20922286D02*
X11005000Y-20908000D01*
X11033571Y-20893714D01*
X11105000Y-20893714D01*
X11133571Y-20908000D01*
X11147857Y-20922286D01*
X11162143Y-20950857D01*
X11162143Y-20979429D01*
X11147857Y-21022286D01*
X10976428Y-21193714D01*
X11162143Y-21193714D01*
X11262143Y-20893714D02*
X11462143Y-20893714D01*
X11333571Y-21193714D01*
X11633571Y-20893714D02*
X11662143Y-20893714D01*
X11690714Y-20908000D01*
X11705000Y-20922286D01*
X11719286Y-20950857D01*
X11733571Y-21008000D01*
X11733571Y-21079429D01*
X11719286Y-21136572D01*
X11705000Y-21165143D01*
X11690714Y-21179429D01*
X11662143Y-21193714D01*
X11633571Y-21193714D01*
X11605000Y-21179429D01*
X11590714Y-21165143D01*
X11576428Y-21136572D01*
X11562143Y-21079429D01*
X11562143Y-21008000D01*
X11576428Y-20950857D01*
X11590714Y-20922286D01*
X11605000Y-20908000D01*
X11633571Y-20893714D01*
X11862143Y-21193714D02*
X11862143Y-20993714D01*
X11862143Y-21022286D02*
X11876428Y-21008000D01*
X11905000Y-20993714D01*
X11947857Y-20993714D01*
X11976428Y-21008000D01*
X11990714Y-21036572D01*
X11990714Y-21193714D01*
X11990714Y-21036572D02*
X12005000Y-21008000D01*
X12033571Y-20993714D01*
X12076428Y-20993714D01*
X12105000Y-21008000D01*
X12119286Y-21036572D01*
X12119286Y-21193714D01*
X12262143Y-21193714D02*
X12262143Y-20993714D01*
X12262143Y-21022286D02*
X12276428Y-21008000D01*
X12305000Y-20993714D01*
X12347857Y-20993714D01*
X12376428Y-21008000D01*
X12390714Y-21036572D01*
X12390714Y-21193714D01*
X12390714Y-21036572D02*
X12405000Y-21008000D01*
X12433571Y-20993714D01*
X12476428Y-20993714D01*
X12505000Y-21008000D01*
X12519286Y-21036572D01*
X12519286Y-21193714D01*
X13105000Y-20879429D02*
X12847857Y-21265143D01*
X13490714Y-20893714D02*
X13519286Y-20893714D01*
X13547857Y-20908000D01*
X13562143Y-20922286D01*
X13576428Y-20950857D01*
X13590714Y-21008000D01*
X13590714Y-21079429D01*
X13576428Y-21136572D01*
X13562143Y-21165143D01*
X13547857Y-21179429D01*
X13519286Y-21193714D01*
X13490714Y-21193714D01*
X13462143Y-21179429D01*
X13447857Y-21165143D01*
X13433571Y-21136572D01*
X13419286Y-21079429D01*
X13419286Y-21008000D01*
X13433571Y-20950857D01*
X13447857Y-20922286D01*
X13462143Y-20908000D01*
X13490714Y-20893714D01*
X13719286Y-21165143D02*
X13733571Y-21179429D01*
X13719286Y-21193714D01*
X13705000Y-21179429D01*
X13719286Y-21165143D01*
X13719286Y-21193714D01*
X13919286Y-20893714D02*
X13947857Y-20893714D01*
X13976428Y-20908000D01*
X13990714Y-20922286D01*
X14005000Y-20950857D01*
X14019286Y-21008000D01*
X14019286Y-21079429D01*
X14005000Y-21136572D01*
X13990714Y-21165143D01*
X13976428Y-21179429D01*
X13947857Y-21193714D01*
X13919286Y-21193714D01*
X13890714Y-21179429D01*
X13876428Y-21165143D01*
X13862143Y-21136572D01*
X13847857Y-21079429D01*
X13847857Y-21008000D01*
X13862143Y-20950857D01*
X13876428Y-20922286D01*
X13890714Y-20908000D01*
X13919286Y-20893714D01*
X14290714Y-20893714D02*
X14147857Y-20893714D01*
X14133571Y-21036572D01*
X14147857Y-21022286D01*
X14176428Y-21008000D01*
X14247857Y-21008000D01*
X14276428Y-21022286D01*
X14290714Y-21036572D01*
X14305000Y-21065143D01*
X14305000Y-21136572D01*
X14290714Y-21165143D01*
X14276428Y-21179429D01*
X14247857Y-21193714D01*
X14176428Y-21193714D01*
X14147857Y-21179429D01*
X14133571Y-21165143D01*
X14490714Y-20893714D02*
X14519286Y-20893714D01*
X14547857Y-20908000D01*
X14562143Y-20922286D01*
X14576428Y-20950857D01*
X14590714Y-21008000D01*
X14590714Y-21079429D01*
X14576428Y-21136572D01*
X14562143Y-21165143D01*
X14547857Y-21179429D01*
X14519286Y-21193714D01*
X14490714Y-21193714D01*
X14462143Y-21179429D01*
X14447857Y-21165143D01*
X14433571Y-21136572D01*
X14419286Y-21079429D01*
X14419286Y-21008000D01*
X14433571Y-20950857D01*
X14447857Y-20922286D01*
X14462143Y-20908000D01*
X14490714Y-20893714D01*
X14776428Y-20893714D02*
X14805000Y-20893714D01*
X14833571Y-20908000D01*
X14847857Y-20922286D01*
X14862143Y-20950857D01*
X14876428Y-21008000D01*
X14876428Y-21079429D01*
X14862143Y-21136572D01*
X14847857Y-21165143D01*
X14833571Y-21179429D01*
X14805000Y-21193714D01*
X14776428Y-21193714D01*
X14747857Y-21179429D01*
X14733571Y-21165143D01*
X14719286Y-21136572D01*
X14705000Y-21079429D01*
X14705000Y-21008000D01*
X14719286Y-20950857D01*
X14733571Y-20922286D01*
X14747857Y-20908000D01*
X14776428Y-20893714D01*
X14990714Y-20893714D02*
X14990714Y-20950857D01*
X15105000Y-20893714D02*
X15105000Y-20950857D01*
X15547857Y-21308000D02*
X15533571Y-21293714D01*
X15505000Y-21250857D01*
X15490714Y-21222286D01*
X15476428Y-21179429D01*
X15462143Y-21108000D01*
X15462143Y-21050857D01*
X15476428Y-20979429D01*
X15490714Y-20936572D01*
X15505000Y-20908000D01*
X15533571Y-20865143D01*
X15547857Y-20850857D01*
X15705000Y-21022286D02*
X15676428Y-21008000D01*
X15662143Y-20993714D01*
X15647857Y-20965143D01*
X15647857Y-20950857D01*
X15662143Y-20922286D01*
X15676428Y-20908000D01*
X15705000Y-20893714D01*
X15762143Y-20893714D01*
X15790714Y-20908000D01*
X15805000Y-20922286D01*
X15819286Y-20950857D01*
X15819286Y-20965143D01*
X15805000Y-20993714D01*
X15790714Y-21008000D01*
X15762143Y-21022286D01*
X15705000Y-21022286D01*
X15676428Y-21036572D01*
X15662143Y-21050857D01*
X15647857Y-21079429D01*
X15647857Y-21136572D01*
X15662143Y-21165143D01*
X15676428Y-21179429D01*
X15705000Y-21193714D01*
X15762143Y-21193714D01*
X15790714Y-21179429D01*
X15805000Y-21165143D01*
X15819286Y-21136572D01*
X15819286Y-21079429D01*
X15805000Y-21050857D01*
X15790714Y-21036572D01*
X15762143Y-21022286D01*
X16176428Y-21193714D02*
X16176428Y-20893714D01*
X16305000Y-21193714D02*
X16305000Y-21036572D01*
X16290714Y-21008000D01*
X16262143Y-20993714D01*
X16219286Y-20993714D01*
X16190714Y-21008000D01*
X16176428Y-21022286D01*
X16490714Y-21193714D02*
X16462143Y-21179429D01*
X16447857Y-21165143D01*
X16433571Y-21136572D01*
X16433571Y-21050857D01*
X16447857Y-21022286D01*
X16462143Y-21008000D01*
X16490714Y-20993714D01*
X16533571Y-20993714D01*
X16562143Y-21008000D01*
X16576428Y-21022286D01*
X16590714Y-21050857D01*
X16590714Y-21136572D01*
X16576428Y-21165143D01*
X16562143Y-21179429D01*
X16533571Y-21193714D01*
X16490714Y-21193714D01*
X16762143Y-21193714D02*
X16733571Y-21179429D01*
X16719286Y-21150857D01*
X16719286Y-20893714D01*
X16990714Y-21179429D02*
X16962143Y-21193714D01*
X16905000Y-21193714D01*
X16876428Y-21179429D01*
X16862143Y-21150857D01*
X16862143Y-21036572D01*
X16876428Y-21008000D01*
X16905000Y-20993714D01*
X16962143Y-20993714D01*
X16990714Y-21008000D01*
X17005000Y-21036572D01*
X17005000Y-21065143D01*
X16862143Y-21093714D01*
X17119286Y-21179429D02*
X17147857Y-21193714D01*
X17205000Y-21193714D01*
X17233571Y-21179429D01*
X17247857Y-21150857D01*
X17247857Y-21136572D01*
X17233571Y-21108000D01*
X17205000Y-21093714D01*
X17162143Y-21093714D01*
X17133571Y-21079429D01*
X17119286Y-21050857D01*
X17119286Y-21036572D01*
X17133571Y-21008000D01*
X17162143Y-20993714D01*
X17205000Y-20993714D01*
X17233571Y-21008000D01*
X17347857Y-21308000D02*
X17362143Y-21293714D01*
X17390714Y-21250857D01*
X17405000Y-21222286D01*
X17419286Y-21179429D01*
X17433571Y-21108000D01*
X17433571Y-21050857D01*
X17419286Y-20979429D01*
X17405000Y-20936572D01*
X17390714Y-20908000D01*
X17362143Y-20865143D01*
X17347857Y-20850857D01*
X17890714Y-21308000D02*
X17876428Y-21293714D01*
X17847857Y-21250857D01*
X17833571Y-21222286D01*
X17819286Y-21179429D01*
X17805000Y-21108000D01*
X17805000Y-21050857D01*
X17819286Y-20979429D01*
X17833571Y-20936572D01*
X17847857Y-20908000D01*
X17876428Y-20865143D01*
X17890714Y-20850857D01*
X18005000Y-20993714D02*
X18005000Y-21193714D01*
X18005000Y-21022286D02*
X18019286Y-21008000D01*
X18047857Y-20993714D01*
X18090714Y-20993714D01*
X18119286Y-21008000D01*
X18133571Y-21036572D01*
X18133571Y-21193714D01*
X18319286Y-21193714D02*
X18290714Y-21179429D01*
X18276428Y-21165143D01*
X18262143Y-21136572D01*
X18262143Y-21050857D01*
X18276428Y-21022286D01*
X18290714Y-21008000D01*
X18319286Y-20993714D01*
X18362143Y-20993714D01*
X18390714Y-21008000D01*
X18405000Y-21022286D01*
X18419286Y-21050857D01*
X18419286Y-21136572D01*
X18405000Y-21165143D01*
X18390714Y-21179429D01*
X18362143Y-21193714D01*
X18319286Y-21193714D01*
X18505000Y-20993714D02*
X18619286Y-20993714D01*
X18547857Y-20893714D02*
X18547857Y-21150857D01*
X18562143Y-21179429D01*
X18590714Y-21193714D01*
X18619286Y-21193714D01*
X18947857Y-20993714D02*
X18947857Y-21293714D01*
X18947857Y-21008000D02*
X18976428Y-20993714D01*
X19033571Y-20993714D01*
X19062143Y-21008000D01*
X19076428Y-21022286D01*
X19090714Y-21050857D01*
X19090714Y-21136572D01*
X19076428Y-21165143D01*
X19062143Y-21179429D01*
X19033571Y-21193714D01*
X18976428Y-21193714D01*
X18947857Y-21179429D01*
X19262143Y-21193714D02*
X19233571Y-21179429D01*
X19219286Y-21150857D01*
X19219286Y-20893714D01*
X19505000Y-21193714D02*
X19505000Y-21036572D01*
X19490714Y-21008000D01*
X19462143Y-20993714D01*
X19405000Y-20993714D01*
X19376428Y-21008000D01*
X19505000Y-21179429D02*
X19476428Y-21193714D01*
X19405000Y-21193714D01*
X19376428Y-21179429D01*
X19362143Y-21150857D01*
X19362143Y-21122286D01*
X19376428Y-21093714D01*
X19405000Y-21079429D01*
X19476428Y-21079429D01*
X19505000Y-21065143D01*
X19605000Y-20993714D02*
X19719286Y-20993714D01*
X19647857Y-20893714D02*
X19647857Y-21150857D01*
X19662143Y-21179429D01*
X19690714Y-21193714D01*
X19719286Y-21193714D01*
X19933571Y-21179429D02*
X19905000Y-21193714D01*
X19847857Y-21193714D01*
X19819286Y-21179429D01*
X19805000Y-21150857D01*
X19805000Y-21036572D01*
X19819286Y-21008000D01*
X19847857Y-20993714D01*
X19905000Y-20993714D01*
X19933571Y-21008000D01*
X19947857Y-21036572D01*
X19947857Y-21065143D01*
X19805000Y-21093714D01*
X20205000Y-21193714D02*
X20205000Y-20893714D01*
X20205000Y-21179429D02*
X20176428Y-21193714D01*
X20119286Y-21193714D01*
X20090714Y-21179429D01*
X20076428Y-21165143D01*
X20062143Y-21136572D01*
X20062143Y-21050857D01*
X20076428Y-21022286D01*
X20090714Y-21008000D01*
X20119286Y-20993714D01*
X20176428Y-20993714D01*
X20205000Y-21008000D01*
X20319286Y-21308000D02*
X20333571Y-21293714D01*
X20362143Y-21250857D01*
X20376428Y-21222286D01*
X20390714Y-21179429D01*
X20405000Y-21108000D01*
X20405000Y-21050857D01*
X20390714Y-20979429D01*
X20376428Y-20936572D01*
X20362143Y-20908000D01*
X20333571Y-20865143D01*
X20319286Y-20850857D01*
X10155000Y-21589000D02*
X10290000Y-21454000D01*
X10155000Y-21319000D01*
X10020000Y-21454000D01*
X10155000Y-21589000D01*
X10562143Y-21318286D02*
X10576428Y-21304000D01*
X10605000Y-21289714D01*
X10676428Y-21289714D01*
X10705000Y-21304000D01*
X10719286Y-21318286D01*
X10733571Y-21346857D01*
X10733571Y-21375429D01*
X10719286Y-21418286D01*
X10547857Y-21589714D01*
X10733571Y-21589714D01*
X10862143Y-21561143D02*
X10876428Y-21575429D01*
X10862143Y-21589714D01*
X10847857Y-21575429D01*
X10862143Y-21561143D01*
X10862143Y-21589714D01*
X10976428Y-21289714D02*
X11176428Y-21289714D01*
X11047857Y-21589714D01*
X11347857Y-21289714D02*
X11376428Y-21289714D01*
X11405000Y-21304000D01*
X11419286Y-21318286D01*
X11433571Y-21346857D01*
X11447857Y-21404000D01*
X11447857Y-21475429D01*
X11433571Y-21532572D01*
X11419286Y-21561143D01*
X11405000Y-21575429D01*
X11376428Y-21589714D01*
X11347857Y-21589714D01*
X11319286Y-21575429D01*
X11305000Y-21561143D01*
X11290714Y-21532572D01*
X11276428Y-21475429D01*
X11276428Y-21404000D01*
X11290714Y-21346857D01*
X11305000Y-21318286D01*
X11319286Y-21304000D01*
X11347857Y-21289714D01*
X11633571Y-21289714D02*
X11662143Y-21289714D01*
X11690714Y-21304000D01*
X11705000Y-21318286D01*
X11719286Y-21346857D01*
X11733571Y-21404000D01*
X11733571Y-21475429D01*
X11719286Y-21532572D01*
X11705000Y-21561143D01*
X11690714Y-21575429D01*
X11662143Y-21589714D01*
X11633571Y-21589714D01*
X11605000Y-21575429D01*
X11590714Y-21561143D01*
X11576428Y-21532572D01*
X11562143Y-21475429D01*
X11562143Y-21404000D01*
X11576428Y-21346857D01*
X11590714Y-21318286D01*
X11605000Y-21304000D01*
X11633571Y-21289714D01*
X11862143Y-21589714D02*
X11862143Y-21389714D01*
X11862143Y-21418286D02*
X11876428Y-21404000D01*
X11905000Y-21389714D01*
X11947857Y-21389714D01*
X11976428Y-21404000D01*
X11990714Y-21432572D01*
X11990714Y-21589714D01*
X11990714Y-21432572D02*
X12005000Y-21404000D01*
X12033571Y-21389714D01*
X12076428Y-21389714D01*
X12105000Y-21404000D01*
X12119286Y-21432572D01*
X12119286Y-21589714D01*
X12262143Y-21589714D02*
X12262143Y-21389714D01*
X12262143Y-21418286D02*
X12276428Y-21404000D01*
X12305000Y-21389714D01*
X12347857Y-21389714D01*
X12376428Y-21404000D01*
X12390714Y-21432572D01*
X12390714Y-21589714D01*
X12390714Y-21432572D02*
X12405000Y-21404000D01*
X12433571Y-21389714D01*
X12476428Y-21389714D01*
X12505000Y-21404000D01*
X12519286Y-21432572D01*
X12519286Y-21589714D01*
X13105000Y-21275429D02*
X12847857Y-21661143D01*
X13490714Y-21289714D02*
X13519286Y-21289714D01*
X13547857Y-21304000D01*
X13562143Y-21318286D01*
X13576428Y-21346857D01*
X13590714Y-21404000D01*
X13590714Y-21475429D01*
X13576428Y-21532572D01*
X13562143Y-21561143D01*
X13547857Y-21575429D01*
X13519286Y-21589714D01*
X13490714Y-21589714D01*
X13462143Y-21575429D01*
X13447857Y-21561143D01*
X13433571Y-21532572D01*
X13419286Y-21475429D01*
X13419286Y-21404000D01*
X13433571Y-21346857D01*
X13447857Y-21318286D01*
X13462143Y-21304000D01*
X13490714Y-21289714D01*
X13719286Y-21561143D02*
X13733571Y-21575429D01*
X13719286Y-21589714D01*
X13705000Y-21575429D01*
X13719286Y-21561143D01*
X13719286Y-21589714D01*
X14019286Y-21589714D02*
X13847857Y-21589714D01*
X13933571Y-21589714D02*
X13933571Y-21289714D01*
X13905000Y-21332572D01*
X13876428Y-21361143D01*
X13847857Y-21375429D01*
X14205000Y-21289714D02*
X14233571Y-21289714D01*
X14262143Y-21304000D01*
X14276428Y-21318286D01*
X14290714Y-21346857D01*
X14305000Y-21404000D01*
X14305000Y-21475429D01*
X14290714Y-21532572D01*
X14276428Y-21561143D01*
X14262143Y-21575429D01*
X14233571Y-21589714D01*
X14205000Y-21589714D01*
X14176428Y-21575429D01*
X14162143Y-21561143D01*
X14147857Y-21532572D01*
X14133571Y-21475429D01*
X14133571Y-21404000D01*
X14147857Y-21346857D01*
X14162143Y-21318286D01*
X14176428Y-21304000D01*
X14205000Y-21289714D01*
X14562143Y-21289714D02*
X14505000Y-21289714D01*
X14476428Y-21304000D01*
X14462143Y-21318286D01*
X14433571Y-21361143D01*
X14419286Y-21418286D01*
X14419286Y-21532572D01*
X14433571Y-21561143D01*
X14447857Y-21575429D01*
X14476428Y-21589714D01*
X14533571Y-21589714D01*
X14562143Y-21575429D01*
X14576428Y-21561143D01*
X14590714Y-21532572D01*
X14590714Y-21461143D01*
X14576428Y-21432572D01*
X14562143Y-21418286D01*
X14533571Y-21404000D01*
X14476428Y-21404000D01*
X14447857Y-21418286D01*
X14433571Y-21432572D01*
X14419286Y-21461143D01*
X14690714Y-21289714D02*
X14876428Y-21289714D01*
X14776428Y-21404000D01*
X14819286Y-21404000D01*
X14847857Y-21418286D01*
X14862143Y-21432572D01*
X14876428Y-21461143D01*
X14876428Y-21532572D01*
X14862143Y-21561143D01*
X14847857Y-21575429D01*
X14819286Y-21589714D01*
X14733571Y-21589714D01*
X14705000Y-21575429D01*
X14690714Y-21561143D01*
X14990714Y-21289714D02*
X14990714Y-21346857D01*
X15105000Y-21289714D02*
X15105000Y-21346857D01*
X15547857Y-21704000D02*
X15533571Y-21689714D01*
X15505000Y-21646857D01*
X15490714Y-21618286D01*
X15476428Y-21575429D01*
X15462143Y-21504000D01*
X15462143Y-21446857D01*
X15476428Y-21375429D01*
X15490714Y-21332572D01*
X15505000Y-21304000D01*
X15533571Y-21261143D01*
X15547857Y-21246857D01*
X15705000Y-21418286D02*
X15676428Y-21404000D01*
X15662143Y-21389714D01*
X15647857Y-21361143D01*
X15647857Y-21346857D01*
X15662143Y-21318286D01*
X15676428Y-21304000D01*
X15705000Y-21289714D01*
X15762143Y-21289714D01*
X15790714Y-21304000D01*
X15805000Y-21318286D01*
X15819286Y-21346857D01*
X15819286Y-21361143D01*
X15805000Y-21389714D01*
X15790714Y-21404000D01*
X15762143Y-21418286D01*
X15705000Y-21418286D01*
X15676428Y-21432572D01*
X15662143Y-21446857D01*
X15647857Y-21475429D01*
X15647857Y-21532572D01*
X15662143Y-21561143D01*
X15676428Y-21575429D01*
X15705000Y-21589714D01*
X15762143Y-21589714D01*
X15790714Y-21575429D01*
X15805000Y-21561143D01*
X15819286Y-21532572D01*
X15819286Y-21475429D01*
X15805000Y-21446857D01*
X15790714Y-21432572D01*
X15762143Y-21418286D01*
X16176428Y-21589714D02*
X16176428Y-21289714D01*
X16305000Y-21589714D02*
X16305000Y-21432572D01*
X16290714Y-21404000D01*
X16262143Y-21389714D01*
X16219286Y-21389714D01*
X16190714Y-21404000D01*
X16176428Y-21418286D01*
X16490714Y-21589714D02*
X16462143Y-21575429D01*
X16447857Y-21561143D01*
X16433571Y-21532572D01*
X16433571Y-21446857D01*
X16447857Y-21418286D01*
X16462143Y-21404000D01*
X16490714Y-21389714D01*
X16533571Y-21389714D01*
X16562143Y-21404000D01*
X16576428Y-21418286D01*
X16590714Y-21446857D01*
X16590714Y-21532572D01*
X16576428Y-21561143D01*
X16562143Y-21575429D01*
X16533571Y-21589714D01*
X16490714Y-21589714D01*
X16762143Y-21589714D02*
X16733571Y-21575429D01*
X16719286Y-21546857D01*
X16719286Y-21289714D01*
X16990714Y-21575429D02*
X16962143Y-21589714D01*
X16905000Y-21589714D01*
X16876428Y-21575429D01*
X16862143Y-21546857D01*
X16862143Y-21432572D01*
X16876428Y-21404000D01*
X16905000Y-21389714D01*
X16962143Y-21389714D01*
X16990714Y-21404000D01*
X17005000Y-21432572D01*
X17005000Y-21461143D01*
X16862143Y-21489714D01*
X17119286Y-21575429D02*
X17147857Y-21589714D01*
X17205000Y-21589714D01*
X17233571Y-21575429D01*
X17247857Y-21546857D01*
X17247857Y-21532572D01*
X17233571Y-21504000D01*
X17205000Y-21489714D01*
X17162143Y-21489714D01*
X17133571Y-21475429D01*
X17119286Y-21446857D01*
X17119286Y-21432572D01*
X17133571Y-21404000D01*
X17162143Y-21389714D01*
X17205000Y-21389714D01*
X17233571Y-21404000D01*
X17347857Y-21704000D02*
X17362143Y-21689714D01*
X17390714Y-21646857D01*
X17405000Y-21618286D01*
X17419286Y-21575429D01*
X17433571Y-21504000D01*
X17433571Y-21446857D01*
X17419286Y-21375429D01*
X17405000Y-21332572D01*
X17390714Y-21304000D01*
X17362143Y-21261143D01*
X17347857Y-21246857D01*
X17890714Y-21704000D02*
X17876428Y-21689714D01*
X17847857Y-21646857D01*
X17833571Y-21618286D01*
X17819286Y-21575429D01*
X17805000Y-21504000D01*
X17805000Y-21446857D01*
X17819286Y-21375429D01*
X17833571Y-21332572D01*
X17847857Y-21304000D01*
X17876428Y-21261143D01*
X17890714Y-21246857D01*
X18005000Y-21389714D02*
X18005000Y-21589714D01*
X18005000Y-21418286D02*
X18019286Y-21404000D01*
X18047857Y-21389714D01*
X18090714Y-21389714D01*
X18119286Y-21404000D01*
X18133571Y-21432572D01*
X18133571Y-21589714D01*
X18319286Y-21589714D02*
X18290714Y-21575429D01*
X18276428Y-21561143D01*
X18262143Y-21532572D01*
X18262143Y-21446857D01*
X18276428Y-21418286D01*
X18290714Y-21404000D01*
X18319286Y-21389714D01*
X18362143Y-21389714D01*
X18390714Y-21404000D01*
X18405000Y-21418286D01*
X18419286Y-21446857D01*
X18419286Y-21532572D01*
X18405000Y-21561143D01*
X18390714Y-21575429D01*
X18362143Y-21589714D01*
X18319286Y-21589714D01*
X18505000Y-21389714D02*
X18619286Y-21389714D01*
X18547857Y-21289714D02*
X18547857Y-21546857D01*
X18562143Y-21575429D01*
X18590714Y-21589714D01*
X18619286Y-21589714D01*
X18947857Y-21389714D02*
X18947857Y-21689714D01*
X18947857Y-21404000D02*
X18976428Y-21389714D01*
X19033571Y-21389714D01*
X19062143Y-21404000D01*
X19076428Y-21418286D01*
X19090714Y-21446857D01*
X19090714Y-21532572D01*
X19076428Y-21561143D01*
X19062143Y-21575429D01*
X19033571Y-21589714D01*
X18976428Y-21589714D01*
X18947857Y-21575429D01*
X19262143Y-21589714D02*
X19233571Y-21575429D01*
X19219286Y-21546857D01*
X19219286Y-21289714D01*
X19505000Y-21589714D02*
X19505000Y-21432572D01*
X19490714Y-21404000D01*
X19462143Y-21389714D01*
X19405000Y-21389714D01*
X19376428Y-21404000D01*
X19505000Y-21575429D02*
X19476428Y-21589714D01*
X19405000Y-21589714D01*
X19376428Y-21575429D01*
X19362143Y-21546857D01*
X19362143Y-21518286D01*
X19376428Y-21489714D01*
X19405000Y-21475429D01*
X19476428Y-21475429D01*
X19505000Y-21461143D01*
X19605000Y-21389714D02*
X19719286Y-21389714D01*
X19647857Y-21289714D02*
X19647857Y-21546857D01*
X19662143Y-21575429D01*
X19690714Y-21589714D01*
X19719286Y-21589714D01*
X19933571Y-21575429D02*
X19905000Y-21589714D01*
X19847857Y-21589714D01*
X19819286Y-21575429D01*
X19805000Y-21546857D01*
X19805000Y-21432572D01*
X19819286Y-21404000D01*
X19847857Y-21389714D01*
X19905000Y-21389714D01*
X19933571Y-21404000D01*
X19947857Y-21432572D01*
X19947857Y-21461143D01*
X19805000Y-21489714D01*
X20205000Y-21589714D02*
X20205000Y-21289714D01*
X20205000Y-21575429D02*
X20176428Y-21589714D01*
X20119286Y-21589714D01*
X20090714Y-21575429D01*
X20076428Y-21561143D01*
X20062143Y-21532572D01*
X20062143Y-21446857D01*
X20076428Y-21418286D01*
X20090714Y-21404000D01*
X20119286Y-21389714D01*
X20176428Y-21389714D01*
X20205000Y-21404000D01*
X20319286Y-21704000D02*
X20333571Y-21689714D01*
X20362143Y-21646857D01*
X20376428Y-21618286D01*
X20390714Y-21575429D01*
X20405000Y-21504000D01*
X20405000Y-21446857D01*
X20390714Y-21375429D01*
X20376428Y-21332572D01*
X20362143Y-21304000D01*
X20333571Y-21261143D01*
X20319286Y-21246857D01*
M02*
