%FSLAX45Y45*%
G04 Gerber Fmt 4.5, Leading zero omitted, Abs format (unit mm)*
G04 Created by KiCad (PCBNEW 5.1.12-84ad8e8a86~92~ubuntu18.04.1) date 2022-08-08 14:54:28*
%MOMM*%
%LPD*%
G01*
G04 APERTURE LIST*
%TA.AperFunction,Profile*%
%ADD10C,0.200000*%
%TD*%
%ADD11C,0.200000*%
%ADD12C,0.300000*%
G04 APERTURE END LIST*
D10*
X19900000Y-11600000D02*
X19900000Y-11550000D01*
X19900000Y-11200000D02*
X19900000Y-11250000D01*
X18850000Y-10870000D02*
X18850000Y-11250000D01*
X18850000Y-12070000D02*
X18850000Y-11550000D01*
X25240000Y-10870000D02*
X25240000Y-11100000D01*
X26800000Y-12070000D02*
X27750000Y-12070000D01*
X25720000Y-11700000D02*
X25720000Y-11860000D01*
X25620000Y-11600000D02*
G75*
G02*
X25720000Y-11700000I0J-100000D01*
G01*
X26800000Y-11960000D02*
X26800000Y-12070000D01*
X25720000Y-11860000D02*
X26700000Y-11860000D01*
X27750000Y-10870000D02*
X25240000Y-10870000D01*
X26700000Y-11860000D02*
G75*
G02*
X26800000Y-11960000I0J-100000D01*
G01*
X25240000Y-11100000D02*
G75*
G02*
X25140000Y-11200000I-100000J0D01*
G01*
X16720000Y-11600000D02*
G75*
G02*
X16820000Y-11700000I0J-100000D01*
G01*
X17800000Y-11860000D02*
G75*
G02*
X17900000Y-11960000I0J-100000D01*
G01*
X17900000Y-11960000D02*
X17900000Y-12070000D01*
X17900000Y-12070000D02*
X18850000Y-12070000D01*
X16820000Y-11860000D02*
X17800000Y-11860000D01*
X16820000Y-11700000D02*
X16820000Y-11860000D01*
X18850000Y-10870000D02*
X16340000Y-10870000D01*
X16340000Y-11100000D02*
G75*
G02*
X16240000Y-11200000I-100000J0D01*
G01*
X16340000Y-10870000D02*
X16340000Y-11100000D01*
X21850000Y-11800000D02*
X19900000Y-11800000D01*
X12950000Y-11800000D02*
X11000000Y-11800000D01*
X18850000Y-6650000D02*
X18850000Y-6125000D01*
X27750000Y-7025000D02*
X27750000Y-6750000D01*
X27750000Y-8450000D02*
X27750000Y-8125000D01*
X27750000Y-14150000D02*
X27750000Y-12270000D01*
X27750000Y-16150000D02*
X27750000Y-14450000D01*
X27750000Y-18370000D02*
X27750000Y-16450000D01*
X18850000Y-14350000D02*
X18850000Y-13825000D01*
X27950000Y-8450000D02*
X27950000Y-6750000D01*
X27950000Y-11250000D02*
X27950000Y-8750000D01*
X27950000Y-14150000D02*
X27950000Y-11550000D01*
X27950000Y-16150000D02*
X27950000Y-14450000D01*
X27950000Y-18900000D02*
X28450000Y-18900000D01*
X27950000Y-16450000D02*
X27950000Y-18900000D01*
X28450000Y-3900000D02*
X28450000Y-18900000D01*
X27950000Y-3900000D02*
X28450000Y-3900000D01*
X27950000Y-6450000D02*
X27950000Y-3900000D01*
X19050000Y-3900000D02*
X19700000Y-3900000D01*
X19050000Y-6650000D02*
X19050000Y-3900000D01*
X19700000Y-4900000D02*
X19700000Y-3900000D01*
X19700000Y-9900000D02*
X19700000Y-5200000D01*
X19700000Y-11250000D02*
X19700000Y-10200000D01*
X23900000Y-11200000D02*
X19900000Y-11200000D01*
X27750000Y-10870000D02*
X27750000Y-11250000D01*
X24200000Y-11200000D02*
X25140000Y-11200000D01*
X27750000Y-12070000D02*
X27750000Y-11550000D01*
X22150000Y-11600000D02*
X25620000Y-11600000D01*
X19900000Y-11600000D02*
X21850000Y-11600000D01*
X19700000Y-12600000D02*
X19700000Y-11550000D01*
X19700000Y-17600000D02*
X19700000Y-12900000D01*
X19700000Y-18900000D02*
X19700000Y-17900000D01*
X19050000Y-18900000D02*
X19700000Y-18900000D01*
X19050000Y-14650000D02*
X19050000Y-18900000D01*
X19050000Y-11550000D02*
X19050000Y-14350000D01*
X13250000Y-11600000D02*
X16720000Y-11600000D01*
X16240000Y-11200000D02*
X15300000Y-11200000D01*
X19050000Y-6950000D02*
X19050000Y-11250000D01*
X11000000Y-11600000D02*
X11000000Y-11550000D01*
X12950000Y-11600000D02*
X11000000Y-11600000D01*
X11000000Y-11200000D02*
X11000000Y-11250000D01*
X15000000Y-11200000D02*
X11000000Y-11200000D01*
X10800000Y-10200000D02*
X10800000Y-11250000D01*
X10800000Y-5200000D02*
X10800000Y-9900000D01*
X10800000Y-3900000D02*
X10800000Y-4900000D01*
X10300000Y-3900000D02*
X10800000Y-3900000D01*
X10300000Y-18900000D02*
X10300000Y-3900000D01*
X10800000Y-18900000D02*
X10300000Y-18900000D01*
X10800000Y-17900000D02*
X10800000Y-18900000D01*
X10800000Y-12900000D02*
X10800000Y-17600000D01*
X10800000Y-11550000D02*
X10800000Y-12600000D01*
X27750000Y-18370000D02*
X25140000Y-18370000D01*
X25040000Y-18470000D02*
X25040000Y-18700000D01*
X22740000Y-18700000D02*
X19900000Y-18700000D01*
X26600000Y-12060000D02*
X26600000Y-12170000D01*
X22150000Y-11800000D02*
X25520000Y-11800000D01*
X19900000Y-12600000D02*
X19900000Y-11800000D01*
X19900000Y-17600000D02*
X19900000Y-12900000D01*
X25620000Y-12060000D02*
G75*
G02*
X25520000Y-11960000I0J100000D01*
G01*
X25520000Y-11800000D02*
X25520000Y-11960000D01*
X26700000Y-12270000D02*
G75*
G02*
X26600000Y-12170000I0J100000D01*
G01*
X26700000Y-12270000D02*
X27750000Y-12270000D01*
X25620000Y-12060000D02*
X26600000Y-12060000D01*
X22740000Y-18700000D02*
X25040000Y-18700000D01*
X19900000Y-17900000D02*
X19900000Y-18700000D01*
X25040000Y-18470000D02*
G75*
G02*
X25140000Y-18370000I100000J0D01*
G01*
X27750000Y-6450000D02*
X27750000Y-6125000D01*
X27750000Y-7775000D02*
X27750000Y-7375000D01*
X27750000Y-5775000D02*
X27750000Y-5375000D01*
X27750000Y-9125000D02*
X27750000Y-8750000D01*
X27750000Y-9875000D02*
X27750000Y-9475000D01*
X26600000Y-4360000D02*
X26600000Y-4470000D01*
X19900000Y-4100000D02*
X25520000Y-4100000D01*
X19900000Y-4900000D02*
X19900000Y-4100000D01*
X19900000Y-9900000D02*
X19900000Y-5200000D01*
X25620000Y-4360000D02*
G75*
G02*
X25520000Y-4260000I0J100000D01*
G01*
X25520000Y-4100000D02*
X25520000Y-4260000D01*
X26700000Y-4570000D02*
G75*
G02*
X26600000Y-4470000I0J100000D01*
G01*
X27750000Y-5025000D02*
X27750000Y-4570000D01*
X26700000Y-4570000D02*
X27750000Y-4570000D01*
X25620000Y-4360000D02*
X26600000Y-4360000D01*
X24200000Y-11000000D02*
X25040000Y-11000000D01*
X19900000Y-10200000D02*
X19900000Y-11000000D01*
X27750000Y-10225000D02*
X27750000Y-10670000D01*
X25040000Y-10770000D02*
G75*
G02*
X25140000Y-10670000I100000J0D01*
G01*
X23900000Y-11000000D02*
X19900000Y-11000000D01*
X25040000Y-10770000D02*
X25040000Y-11000000D01*
X27750000Y-10670000D02*
X25140000Y-10670000D01*
X18850000Y-9125000D02*
X18850000Y-8725000D01*
X18850000Y-5025000D02*
X18850000Y-4570000D01*
X18850000Y-9875000D02*
X18850000Y-9475000D01*
X18850000Y-8375000D02*
X18850000Y-7975000D01*
X18850000Y-10670000D02*
X16240000Y-10670000D01*
X16140000Y-10770000D02*
X16140000Y-11000000D01*
X15000000Y-11000000D02*
X11000000Y-11000000D01*
X16140000Y-10770000D02*
G75*
G02*
X16240000Y-10670000I100000J0D01*
G01*
X11000000Y-10200000D02*
X11000000Y-11000000D01*
X15300000Y-11000000D02*
X16140000Y-11000000D01*
X16720000Y-4360000D02*
X17700000Y-4360000D01*
X17800000Y-4570000D02*
X18850000Y-4570000D01*
X17800000Y-4570000D02*
G75*
G02*
X17700000Y-4470000I0J100000D01*
G01*
X16620000Y-4100000D02*
X16620000Y-4260000D01*
X16720000Y-4360000D02*
G75*
G02*
X16620000Y-4260000I0J100000D01*
G01*
X11000000Y-9900000D02*
X11000000Y-5200000D01*
X11000000Y-4900000D02*
X11000000Y-4100000D01*
X11000000Y-4100000D02*
X16620000Y-4100000D01*
X17700000Y-4360000D02*
X17700000Y-4470000D01*
X18850000Y-7625000D02*
X18850000Y-6950000D01*
X18850000Y-5775000D02*
X18850000Y-5375000D01*
X18850000Y-10225000D02*
X18850000Y-10670000D01*
X18850000Y-18370000D02*
X16240000Y-18370000D01*
X16140000Y-18470000D02*
X16140000Y-18700000D01*
X13840000Y-18700000D02*
X11000000Y-18700000D01*
X16140000Y-18470000D02*
G75*
G02*
X16240000Y-18370000I100000J0D01*
G01*
X18850000Y-17925000D02*
X18850000Y-18370000D01*
X11000000Y-17900000D02*
X11000000Y-18700000D01*
X13840000Y-18700000D02*
X16140000Y-18700000D01*
X16720000Y-12060000D02*
X17700000Y-12060000D01*
X17800000Y-12270000D02*
X18850000Y-12270000D01*
X18850000Y-12725000D02*
X18850000Y-12270000D01*
X17800000Y-12270000D02*
G75*
G02*
X17700000Y-12170000I0J100000D01*
G01*
X16620000Y-11800000D02*
X16620000Y-11960000D01*
X16720000Y-12060000D02*
G75*
G02*
X16620000Y-11960000I0J100000D01*
G01*
X11000000Y-17600000D02*
X11000000Y-12900000D01*
X11000000Y-12600000D02*
X11000000Y-11800000D01*
X13250000Y-11800000D02*
X16620000Y-11800000D01*
X17700000Y-12060000D02*
X17700000Y-12170000D01*
X18850000Y-17575000D02*
X18850000Y-17175000D01*
X18850000Y-16825000D02*
X18850000Y-16425000D01*
X18850000Y-16075000D02*
X18850000Y-15675000D01*
X18850000Y-15325000D02*
X18850000Y-14650000D01*
X18850000Y-13475000D02*
X18850000Y-13075000D01*
D11*
X11319500Y-8432500D02*
X11339500Y-8452500D01*
X11339500Y-8432500D02*
X11319500Y-8452500D01*
X11319500Y-8559500D02*
X11339500Y-8579500D01*
X11339500Y-8559500D02*
X11319500Y-8579500D01*
X11319500Y-16132500D02*
X11339500Y-16152500D01*
X11339500Y-16132500D02*
X11319500Y-16152500D01*
X11319500Y-16259500D02*
X11339500Y-16279500D01*
X11339500Y-16259500D02*
X11319500Y-16279500D01*
X11446500Y-8686500D02*
X11466500Y-8706500D01*
X11466500Y-8686500D02*
X11446500Y-8706500D01*
X11446500Y-8813500D02*
X11466500Y-8833500D01*
X11466500Y-8813500D02*
X11446500Y-8833500D01*
X11446500Y-9321500D02*
X11466500Y-9341500D01*
X11466500Y-9321500D02*
X11446500Y-9341500D01*
X11446500Y-9448500D02*
X11466500Y-9468500D01*
X11466500Y-9448500D02*
X11446500Y-9468500D01*
X11446500Y-9702500D02*
X11466500Y-9722500D01*
X11466500Y-9702500D02*
X11446500Y-9722500D01*
X11446500Y-9829500D02*
X11466500Y-9849500D01*
X11466500Y-9829500D02*
X11446500Y-9849500D01*
X11446500Y-16386500D02*
X11466500Y-16406500D01*
X11466500Y-16386500D02*
X11446500Y-16406500D01*
X11446500Y-16513500D02*
X11466500Y-16533500D01*
X11466500Y-16513500D02*
X11446500Y-16533500D01*
X11446500Y-17021500D02*
X11466500Y-17041500D01*
X11466500Y-17021500D02*
X11446500Y-17041500D01*
X11446500Y-17148500D02*
X11466500Y-17168500D01*
X11466500Y-17148500D02*
X11446500Y-17168500D01*
X11446500Y-17402500D02*
X11466500Y-17422500D01*
X11466500Y-17402500D02*
X11446500Y-17422500D01*
X11446500Y-17529500D02*
X11466500Y-17549500D01*
X11466500Y-17529500D02*
X11446500Y-17549500D01*
X11573500Y-7924500D02*
X11593500Y-7944500D01*
X11593500Y-7924500D02*
X11573500Y-7944500D01*
X11573500Y-8051500D02*
X11593500Y-8071500D01*
X11593500Y-8051500D02*
X11573500Y-8071500D01*
X11573500Y-8940500D02*
X11593500Y-8960500D01*
X11593500Y-8940500D02*
X11573500Y-8960500D01*
X11573500Y-9067500D02*
X11593500Y-9087500D01*
X11593500Y-9067500D02*
X11573500Y-9087500D01*
X11573500Y-15624500D02*
X11593500Y-15644500D01*
X11593500Y-15624500D02*
X11573500Y-15644500D01*
X11573500Y-15751500D02*
X11593500Y-15771500D01*
X11593500Y-15751500D02*
X11573500Y-15771500D01*
X11573500Y-16640500D02*
X11593500Y-16660500D01*
X11593500Y-16640500D02*
X11573500Y-16660500D01*
X11573500Y-16767500D02*
X11593500Y-16787500D01*
X11593500Y-16767500D02*
X11573500Y-16787500D01*
X11700500Y-7162500D02*
X11720500Y-7182500D01*
X11720500Y-7162500D02*
X11700500Y-7182500D01*
X11700500Y-7289500D02*
X11720500Y-7309500D01*
X11720500Y-7289500D02*
X11700500Y-7309500D01*
X11700500Y-14862500D02*
X11720500Y-14882500D01*
X11720500Y-14862500D02*
X11700500Y-14882500D01*
X11700500Y-14989500D02*
X11720500Y-15009500D01*
X11720500Y-14989500D02*
X11700500Y-15009500D01*
X20092500Y-9194500D02*
X20112500Y-9214500D01*
X20112500Y-9194500D02*
X20092500Y-9214500D01*
X20092500Y-9321500D02*
X20112500Y-9341500D01*
X20112500Y-9321500D02*
X20092500Y-9341500D01*
X20219500Y-8940500D02*
X20239500Y-8960500D01*
X20239500Y-8940500D02*
X20219500Y-8960500D01*
X20219500Y-9067500D02*
X20239500Y-9087500D01*
X20239500Y-9067500D02*
X20219500Y-9087500D01*
X20219500Y-9448500D02*
X20239500Y-9468500D01*
X20239500Y-9448500D02*
X20219500Y-9468500D01*
X20219500Y-9575500D02*
X20239500Y-9595500D01*
X20239500Y-9575500D02*
X20219500Y-9595500D01*
X20346500Y-6654500D02*
X20366500Y-6674500D01*
X20366500Y-6654500D02*
X20346500Y-6674500D01*
X20346500Y-6781500D02*
X20366500Y-6801500D01*
X20366500Y-6781500D02*
X20346500Y-6801500D01*
X20346500Y-7162500D02*
X20366500Y-7182500D01*
X20366500Y-7162500D02*
X20346500Y-7182500D01*
X20346500Y-7289500D02*
X20366500Y-7309500D01*
X20366500Y-7289500D02*
X20346500Y-7309500D01*
X20346500Y-16386500D02*
X20366500Y-16406500D01*
X20366500Y-16386500D02*
X20346500Y-16406500D01*
X20346500Y-16513500D02*
X20366500Y-16533500D01*
X20366500Y-16513500D02*
X20346500Y-16533500D01*
X20346500Y-17021500D02*
X20366500Y-17041500D01*
X20366500Y-17021500D02*
X20346500Y-17041500D01*
X20346500Y-17148500D02*
X20366500Y-17168500D01*
X20366500Y-17148500D02*
X20346500Y-17168500D01*
X20346500Y-17402500D02*
X20366500Y-17422500D01*
X20366500Y-17402500D02*
X20346500Y-17422500D01*
X20346500Y-17529500D02*
X20366500Y-17549500D01*
X20366500Y-17529500D02*
X20346500Y-17549500D01*
X20473500Y-5384500D02*
X20493500Y-5404500D01*
X20493500Y-5384500D02*
X20473500Y-5404500D01*
X20473500Y-5511500D02*
X20493500Y-5531500D01*
X20493500Y-5511500D02*
X20473500Y-5531500D01*
X20473500Y-5892500D02*
X20493500Y-5912500D01*
X20493500Y-5892500D02*
X20473500Y-5912500D01*
X20473500Y-6019500D02*
X20493500Y-6039500D01*
X20493500Y-6019500D02*
X20473500Y-6039500D01*
X20473500Y-6400500D02*
X20493500Y-6420500D01*
X20493500Y-6400500D02*
X20473500Y-6420500D01*
X20473500Y-6527500D02*
X20493500Y-6547500D01*
X20493500Y-6527500D02*
X20473500Y-6547500D01*
X20473500Y-6908500D02*
X20493500Y-6928500D01*
X20493500Y-6908500D02*
X20473500Y-6928500D01*
X20473500Y-7035500D02*
X20493500Y-7055500D01*
X20493500Y-7035500D02*
X20473500Y-7055500D01*
X20473500Y-7416500D02*
X20493500Y-7436500D01*
X20493500Y-7416500D02*
X20473500Y-7436500D01*
X20473500Y-7543500D02*
X20493500Y-7563500D01*
X20493500Y-7543500D02*
X20473500Y-7563500D01*
X20473500Y-15624500D02*
X20493500Y-15644500D01*
X20493500Y-15624500D02*
X20473500Y-15644500D01*
X20473500Y-15751500D02*
X20493500Y-15771500D01*
X20493500Y-15751500D02*
X20473500Y-15771500D01*
X20600500Y-7289500D02*
X20620500Y-7309500D01*
X20620500Y-7289500D02*
X20600500Y-7309500D01*
X20600500Y-7416500D02*
X20620500Y-7436500D01*
X20620500Y-7416500D02*
X20600500Y-7436500D01*
X20600500Y-14862500D02*
X20620500Y-14882500D01*
X20620500Y-14862500D02*
X20600500Y-14882500D01*
X20600500Y-14989500D02*
X20620500Y-15009500D01*
X20620500Y-14989500D02*
X20600500Y-15009500D01*
X21616500Y-8940500D02*
X21636500Y-8960500D01*
X21636500Y-8940500D02*
X21616500Y-8960500D01*
X21616500Y-9067500D02*
X21636500Y-9087500D01*
X21636500Y-9067500D02*
X21616500Y-9087500D01*
D12*
X10576428Y-19375714D02*
X10576428Y-19075714D01*
X10647857Y-19075714D01*
X10690714Y-19090000D01*
X10719286Y-19118572D01*
X10733571Y-19147143D01*
X10747857Y-19204286D01*
X10747857Y-19247143D01*
X10733571Y-19304286D01*
X10719286Y-19332857D01*
X10690714Y-19361429D01*
X10647857Y-19375714D01*
X10576428Y-19375714D01*
X10876428Y-19375714D02*
X10876428Y-19175714D01*
X10876428Y-19232857D02*
X10890714Y-19204286D01*
X10905000Y-19190000D01*
X10933571Y-19175714D01*
X10962143Y-19175714D01*
X11062143Y-19375714D02*
X11062143Y-19175714D01*
X11062143Y-19075714D02*
X11047857Y-19090000D01*
X11062143Y-19104286D01*
X11076428Y-19090000D01*
X11062143Y-19075714D01*
X11062143Y-19104286D01*
X11247857Y-19375714D02*
X11219286Y-19361429D01*
X11205000Y-19332857D01*
X11205000Y-19075714D01*
X11405000Y-19375714D02*
X11376428Y-19361429D01*
X11362143Y-19332857D01*
X11362143Y-19075714D01*
X11747857Y-19375714D02*
X11747857Y-19075714D01*
X11847857Y-19290000D01*
X11947857Y-19075714D01*
X11947857Y-19375714D01*
X12219286Y-19375714D02*
X12219286Y-19218572D01*
X12205000Y-19190000D01*
X12176428Y-19175714D01*
X12119286Y-19175714D01*
X12090714Y-19190000D01*
X12219286Y-19361429D02*
X12190714Y-19375714D01*
X12119286Y-19375714D01*
X12090714Y-19361429D01*
X12076428Y-19332857D01*
X12076428Y-19304286D01*
X12090714Y-19275714D01*
X12119286Y-19261429D01*
X12190714Y-19261429D01*
X12219286Y-19247143D01*
X12362143Y-19175714D02*
X12362143Y-19475714D01*
X12362143Y-19190000D02*
X12390714Y-19175714D01*
X12447857Y-19175714D01*
X12476428Y-19190000D01*
X12490714Y-19204286D01*
X12505000Y-19232857D01*
X12505000Y-19318572D01*
X12490714Y-19347143D01*
X12476428Y-19361429D01*
X12447857Y-19375714D01*
X12390714Y-19375714D01*
X12362143Y-19361429D01*
X12633571Y-19347143D02*
X12647857Y-19361429D01*
X12633571Y-19375714D01*
X12619286Y-19361429D01*
X12633571Y-19347143D01*
X12633571Y-19375714D01*
X12633571Y-19190000D02*
X12647857Y-19204286D01*
X12633571Y-19218572D01*
X12619286Y-19204286D01*
X12633571Y-19190000D01*
X12633571Y-19218572D01*
X10270000Y-19860000D02*
X10290000Y-19880000D01*
X10290000Y-19860000D02*
X10270000Y-19880000D01*
X10633571Y-19705714D02*
X10662143Y-19705714D01*
X10690714Y-19720000D01*
X10705000Y-19734286D01*
X10719286Y-19762857D01*
X10733571Y-19820000D01*
X10733571Y-19891429D01*
X10719286Y-19948572D01*
X10705000Y-19977143D01*
X10690714Y-19991429D01*
X10662143Y-20005714D01*
X10633571Y-20005714D01*
X10605000Y-19991429D01*
X10590714Y-19977143D01*
X10576428Y-19948572D01*
X10562143Y-19891429D01*
X10562143Y-19820000D01*
X10576428Y-19762857D01*
X10590714Y-19734286D01*
X10605000Y-19720000D01*
X10633571Y-19705714D01*
X10862143Y-19977143D02*
X10876428Y-19991429D01*
X10862143Y-20005714D01*
X10847857Y-19991429D01*
X10862143Y-19977143D01*
X10862143Y-20005714D01*
X10990714Y-19734286D02*
X11005000Y-19720000D01*
X11033571Y-19705714D01*
X11105000Y-19705714D01*
X11133571Y-19720000D01*
X11147857Y-19734286D01*
X11162143Y-19762857D01*
X11162143Y-19791429D01*
X11147857Y-19834286D01*
X10976428Y-20005714D01*
X11162143Y-20005714D01*
X11347857Y-19705714D02*
X11376428Y-19705714D01*
X11405000Y-19720000D01*
X11419286Y-19734286D01*
X11433571Y-19762857D01*
X11447857Y-19820000D01*
X11447857Y-19891429D01*
X11433571Y-19948572D01*
X11419286Y-19977143D01*
X11405000Y-19991429D01*
X11376428Y-20005714D01*
X11347857Y-20005714D01*
X11319286Y-19991429D01*
X11305000Y-19977143D01*
X11290714Y-19948572D01*
X11276428Y-19891429D01*
X11276428Y-19820000D01*
X11290714Y-19762857D01*
X11305000Y-19734286D01*
X11319286Y-19720000D01*
X11347857Y-19705714D01*
X11633571Y-19705714D02*
X11662143Y-19705714D01*
X11690714Y-19720000D01*
X11705000Y-19734286D01*
X11719286Y-19762857D01*
X11733571Y-19820000D01*
X11733571Y-19891429D01*
X11719286Y-19948572D01*
X11705000Y-19977143D01*
X11690714Y-19991429D01*
X11662143Y-20005714D01*
X11633571Y-20005714D01*
X11605000Y-19991429D01*
X11590714Y-19977143D01*
X11576428Y-19948572D01*
X11562143Y-19891429D01*
X11562143Y-19820000D01*
X11576428Y-19762857D01*
X11590714Y-19734286D01*
X11605000Y-19720000D01*
X11633571Y-19705714D01*
X11862143Y-20005714D02*
X11862143Y-19805714D01*
X11862143Y-19834286D02*
X11876428Y-19820000D01*
X11905000Y-19805714D01*
X11947857Y-19805714D01*
X11976428Y-19820000D01*
X11990714Y-19848572D01*
X11990714Y-20005714D01*
X11990714Y-19848572D02*
X12005000Y-19820000D01*
X12033571Y-19805714D01*
X12076428Y-19805714D01*
X12105000Y-19820000D01*
X12119286Y-19848572D01*
X12119286Y-20005714D01*
X12262143Y-20005714D02*
X12262143Y-19805714D01*
X12262143Y-19834286D02*
X12276428Y-19820000D01*
X12305000Y-19805714D01*
X12347857Y-19805714D01*
X12376428Y-19820000D01*
X12390714Y-19848572D01*
X12390714Y-20005714D01*
X12390714Y-19848572D02*
X12405000Y-19820000D01*
X12433571Y-19805714D01*
X12476428Y-19805714D01*
X12505000Y-19820000D01*
X12519286Y-19848572D01*
X12519286Y-20005714D01*
X13105000Y-19691429D02*
X12847857Y-20077143D01*
X13490714Y-19705714D02*
X13519286Y-19705714D01*
X13547857Y-19720000D01*
X13562143Y-19734286D01*
X13576428Y-19762857D01*
X13590714Y-19820000D01*
X13590714Y-19891429D01*
X13576428Y-19948572D01*
X13562143Y-19977143D01*
X13547857Y-19991429D01*
X13519286Y-20005714D01*
X13490714Y-20005714D01*
X13462143Y-19991429D01*
X13447857Y-19977143D01*
X13433571Y-19948572D01*
X13419286Y-19891429D01*
X13419286Y-19820000D01*
X13433571Y-19762857D01*
X13447857Y-19734286D01*
X13462143Y-19720000D01*
X13490714Y-19705714D01*
X13719286Y-19977143D02*
X13733571Y-19991429D01*
X13719286Y-20005714D01*
X13705000Y-19991429D01*
X13719286Y-19977143D01*
X13719286Y-20005714D01*
X13919286Y-19705714D02*
X13947857Y-19705714D01*
X13976428Y-19720000D01*
X13990714Y-19734286D01*
X14005000Y-19762857D01*
X14019286Y-19820000D01*
X14019286Y-19891429D01*
X14005000Y-19948572D01*
X13990714Y-19977143D01*
X13976428Y-19991429D01*
X13947857Y-20005714D01*
X13919286Y-20005714D01*
X13890714Y-19991429D01*
X13876428Y-19977143D01*
X13862143Y-19948572D01*
X13847857Y-19891429D01*
X13847857Y-19820000D01*
X13862143Y-19762857D01*
X13876428Y-19734286D01*
X13890714Y-19720000D01*
X13919286Y-19705714D01*
X14205000Y-19705714D02*
X14233571Y-19705714D01*
X14262143Y-19720000D01*
X14276428Y-19734286D01*
X14290714Y-19762857D01*
X14305000Y-19820000D01*
X14305000Y-19891429D01*
X14290714Y-19948572D01*
X14276428Y-19977143D01*
X14262143Y-19991429D01*
X14233571Y-20005714D01*
X14205000Y-20005714D01*
X14176428Y-19991429D01*
X14162143Y-19977143D01*
X14147857Y-19948572D01*
X14133571Y-19891429D01*
X14133571Y-19820000D01*
X14147857Y-19762857D01*
X14162143Y-19734286D01*
X14176428Y-19720000D01*
X14205000Y-19705714D01*
X14405000Y-19705714D02*
X14605000Y-19705714D01*
X14476428Y-20005714D01*
X14733571Y-20005714D02*
X14790714Y-20005714D01*
X14819286Y-19991429D01*
X14833571Y-19977143D01*
X14862143Y-19934286D01*
X14876428Y-19877143D01*
X14876428Y-19762857D01*
X14862143Y-19734286D01*
X14847857Y-19720000D01*
X14819286Y-19705714D01*
X14762143Y-19705714D01*
X14733571Y-19720000D01*
X14719286Y-19734286D01*
X14705000Y-19762857D01*
X14705000Y-19834286D01*
X14719286Y-19862857D01*
X14733571Y-19877143D01*
X14762143Y-19891429D01*
X14819286Y-19891429D01*
X14847857Y-19877143D01*
X14862143Y-19862857D01*
X14876428Y-19834286D01*
X14990714Y-19705714D02*
X14990714Y-19762857D01*
X15105000Y-19705714D02*
X15105000Y-19762857D01*
X15547857Y-20120000D02*
X15533571Y-20105714D01*
X15505000Y-20062857D01*
X15490714Y-20034286D01*
X15476428Y-19991429D01*
X15462143Y-19920000D01*
X15462143Y-19862857D01*
X15476428Y-19791429D01*
X15490714Y-19748572D01*
X15505000Y-19720000D01*
X15533571Y-19677143D01*
X15547857Y-19662857D01*
X15790714Y-19705714D02*
X15733571Y-19705714D01*
X15705000Y-19720000D01*
X15690714Y-19734286D01*
X15662143Y-19777143D01*
X15647857Y-19834286D01*
X15647857Y-19948572D01*
X15662143Y-19977143D01*
X15676428Y-19991429D01*
X15705000Y-20005714D01*
X15762143Y-20005714D01*
X15790714Y-19991429D01*
X15805000Y-19977143D01*
X15819286Y-19948572D01*
X15819286Y-19877143D01*
X15805000Y-19848572D01*
X15790714Y-19834286D01*
X15762143Y-19820000D01*
X15705000Y-19820000D01*
X15676428Y-19834286D01*
X15662143Y-19848572D01*
X15647857Y-19877143D01*
X15933571Y-19734286D02*
X15947857Y-19720000D01*
X15976428Y-19705714D01*
X16047857Y-19705714D01*
X16076428Y-19720000D01*
X16090714Y-19734286D01*
X16105000Y-19762857D01*
X16105000Y-19791429D01*
X16090714Y-19834286D01*
X15919286Y-20005714D01*
X16105000Y-20005714D01*
X16462143Y-20005714D02*
X16462143Y-19705714D01*
X16590714Y-20005714D02*
X16590714Y-19848572D01*
X16576428Y-19820000D01*
X16547857Y-19805714D01*
X16505000Y-19805714D01*
X16476428Y-19820000D01*
X16462143Y-19834286D01*
X16776428Y-20005714D02*
X16747857Y-19991429D01*
X16733571Y-19977143D01*
X16719286Y-19948572D01*
X16719286Y-19862857D01*
X16733571Y-19834286D01*
X16747857Y-19820000D01*
X16776428Y-19805714D01*
X16819286Y-19805714D01*
X16847857Y-19820000D01*
X16862143Y-19834286D01*
X16876428Y-19862857D01*
X16876428Y-19948572D01*
X16862143Y-19977143D01*
X16847857Y-19991429D01*
X16819286Y-20005714D01*
X16776428Y-20005714D01*
X17047857Y-20005714D02*
X17019286Y-19991429D01*
X17005000Y-19962857D01*
X17005000Y-19705714D01*
X17276428Y-19991429D02*
X17247857Y-20005714D01*
X17190714Y-20005714D01*
X17162143Y-19991429D01*
X17147857Y-19962857D01*
X17147857Y-19848572D01*
X17162143Y-19820000D01*
X17190714Y-19805714D01*
X17247857Y-19805714D01*
X17276428Y-19820000D01*
X17290714Y-19848572D01*
X17290714Y-19877143D01*
X17147857Y-19905714D01*
X17405000Y-19991429D02*
X17433571Y-20005714D01*
X17490714Y-20005714D01*
X17519286Y-19991429D01*
X17533571Y-19962857D01*
X17533571Y-19948572D01*
X17519286Y-19920000D01*
X17490714Y-19905714D01*
X17447857Y-19905714D01*
X17419286Y-19891429D01*
X17405000Y-19862857D01*
X17405000Y-19848572D01*
X17419286Y-19820000D01*
X17447857Y-19805714D01*
X17490714Y-19805714D01*
X17519286Y-19820000D01*
X17633571Y-20120000D02*
X17647857Y-20105714D01*
X17676428Y-20062857D01*
X17690714Y-20034286D01*
X17705000Y-19991429D01*
X17719286Y-19920000D01*
X17719286Y-19862857D01*
X17705000Y-19791429D01*
X17690714Y-19748572D01*
X17676428Y-19720000D01*
X17647857Y-19677143D01*
X17633571Y-19662857D01*
M02*
