%FSLAX45Y45*%
G04 Gerber Fmt 4.5, Leading zero omitted, Abs format (unit mm)*
G04 Created by KiCad (PCBNEW 5.1.12-84ad8e8a86~92~ubuntu18.04.1) date 2022-04-26 16:25:03*
%MOMM*%
%LPD*%
G01*
G04 APERTURE LIST*
%TA.AperFunction,Profile*%
%ADD10C,0.200000*%
%TD*%
%ADD11C,0.200000*%
%ADD12C,0.300000*%
G04 APERTURE END LIST*
D10*
X18850000Y-10670000D02*
X16240000Y-10670000D01*
X16140000Y-10770000D02*
X16140000Y-11000000D01*
X13840000Y-11000000D02*
X11000000Y-11000000D01*
X16140000Y-10770000D02*
G75*
G02*
X16240000Y-10670000I100000J0D01*
G01*
X11000000Y-10150000D02*
X11000000Y-11000000D01*
X13840000Y-11000000D02*
X16140000Y-11000000D01*
X16720000Y-4360000D02*
X17700000Y-4360000D01*
X17800000Y-4570000D02*
X18850000Y-4570000D01*
X18850000Y-10670000D02*
X18850000Y-4570000D01*
X17800000Y-4570000D02*
G75*
G02*
X17700000Y-4470000I0J100000D01*
G01*
X16620000Y-4100000D02*
X16620000Y-4260000D01*
X16720000Y-4360000D02*
G75*
G02*
X16620000Y-4260000I0J100000D01*
G01*
X11000000Y-10150000D02*
X11000000Y-5200000D01*
X11000000Y-5200000D02*
X11000000Y-4100000D01*
X11000000Y-4100000D02*
X16620000Y-4100000D01*
X17700000Y-4360000D02*
X17700000Y-4470000D01*
D11*
X11192500Y-9702500D02*
X11212500Y-9722500D01*
X11212500Y-9702500D02*
X11192500Y-9722500D01*
X11192500Y-9829500D02*
X11212500Y-9849500D01*
X11212500Y-9829500D02*
X11192500Y-9849500D01*
X11446500Y-5130500D02*
X11466500Y-5150500D01*
X11466500Y-5130500D02*
X11446500Y-5150500D01*
X11446500Y-5257500D02*
X11466500Y-5277500D01*
X11466500Y-5257500D02*
X11446500Y-5277500D01*
X11446500Y-5638500D02*
X11466500Y-5658500D01*
X11466500Y-5638500D02*
X11446500Y-5658500D01*
X11446500Y-5765500D02*
X11466500Y-5785500D01*
X11466500Y-5765500D02*
X11446500Y-5785500D01*
X11446500Y-6146500D02*
X11466500Y-6166500D01*
X11466500Y-6146500D02*
X11446500Y-6166500D01*
X11446500Y-6273500D02*
X11466500Y-6293500D01*
X11466500Y-6273500D02*
X11446500Y-6293500D01*
X11700500Y-9702500D02*
X11720500Y-9722500D01*
X11720500Y-9702500D02*
X11700500Y-9722500D01*
X11700500Y-9829500D02*
X11720500Y-9849500D01*
X11720500Y-9829500D02*
X11700500Y-9849500D01*
X12843500Y-8178500D02*
X12863500Y-8198500D01*
X12863500Y-8178500D02*
X12843500Y-8198500D01*
X12843500Y-8305500D02*
X12863500Y-8325500D01*
X12863500Y-8305500D02*
X12843500Y-8325500D01*
X12843500Y-8686500D02*
X12863500Y-8706500D01*
X12863500Y-8686500D02*
X12843500Y-8706500D01*
X12843500Y-8813500D02*
X12863500Y-8833500D01*
X12863500Y-8813500D02*
X12843500Y-8833500D01*
X12843500Y-9194500D02*
X12863500Y-9214500D01*
X12863500Y-9194500D02*
X12843500Y-9214500D01*
X12843500Y-9321500D02*
X12863500Y-9341500D01*
X12863500Y-9321500D02*
X12843500Y-9341500D01*
X12843500Y-9702500D02*
X12863500Y-9722500D01*
X12863500Y-9702500D02*
X12843500Y-9722500D01*
X12843500Y-9829500D02*
X12863500Y-9849500D01*
X12863500Y-9829500D02*
X12843500Y-9849500D01*
D12*
X11276428Y-11475714D02*
X11276428Y-11175714D01*
X11347857Y-11175714D01*
X11390714Y-11190000D01*
X11419286Y-11218571D01*
X11433571Y-11247143D01*
X11447857Y-11304286D01*
X11447857Y-11347143D01*
X11433571Y-11404286D01*
X11419286Y-11432857D01*
X11390714Y-11461429D01*
X11347857Y-11475714D01*
X11276428Y-11475714D01*
X11576428Y-11475714D02*
X11576428Y-11275714D01*
X11576428Y-11332857D02*
X11590714Y-11304286D01*
X11605000Y-11290000D01*
X11633571Y-11275714D01*
X11662143Y-11275714D01*
X11762143Y-11475714D02*
X11762143Y-11275714D01*
X11762143Y-11175714D02*
X11747857Y-11190000D01*
X11762143Y-11204286D01*
X11776428Y-11190000D01*
X11762143Y-11175714D01*
X11762143Y-11204286D01*
X11947857Y-11475714D02*
X11919286Y-11461429D01*
X11905000Y-11432857D01*
X11905000Y-11175714D01*
X12105000Y-11475714D02*
X12076428Y-11461429D01*
X12062143Y-11432857D01*
X12062143Y-11175714D01*
X12447857Y-11475714D02*
X12447857Y-11175714D01*
X12547857Y-11390000D01*
X12647857Y-11175714D01*
X12647857Y-11475714D01*
X12919286Y-11475714D02*
X12919286Y-11318571D01*
X12905000Y-11290000D01*
X12876428Y-11275714D01*
X12819286Y-11275714D01*
X12790714Y-11290000D01*
X12919286Y-11461429D02*
X12890714Y-11475714D01*
X12819286Y-11475714D01*
X12790714Y-11461429D01*
X12776428Y-11432857D01*
X12776428Y-11404286D01*
X12790714Y-11375714D01*
X12819286Y-11361429D01*
X12890714Y-11361429D01*
X12919286Y-11347143D01*
X13062143Y-11275714D02*
X13062143Y-11575714D01*
X13062143Y-11290000D02*
X13090714Y-11275714D01*
X13147857Y-11275714D01*
X13176428Y-11290000D01*
X13190714Y-11304286D01*
X13205000Y-11332857D01*
X13205000Y-11418571D01*
X13190714Y-11447143D01*
X13176428Y-11461429D01*
X13147857Y-11475714D01*
X13090714Y-11475714D01*
X13062143Y-11461429D01*
X13333571Y-11447143D02*
X13347857Y-11461429D01*
X13333571Y-11475714D01*
X13319286Y-11461429D01*
X13333571Y-11447143D01*
X13333571Y-11475714D01*
X13333571Y-11290000D02*
X13347857Y-11304286D01*
X13333571Y-11318571D01*
X13319286Y-11304286D01*
X13333571Y-11290000D01*
X13333571Y-11318571D01*
X10970000Y-11960000D02*
X10990000Y-11980000D01*
X10990000Y-11960000D02*
X10970000Y-11980000D01*
X11333571Y-11805714D02*
X11362143Y-11805714D01*
X11390714Y-11820000D01*
X11405000Y-11834286D01*
X11419286Y-11862857D01*
X11433571Y-11920000D01*
X11433571Y-11991429D01*
X11419286Y-12048571D01*
X11405000Y-12077143D01*
X11390714Y-12091429D01*
X11362143Y-12105714D01*
X11333571Y-12105714D01*
X11305000Y-12091429D01*
X11290714Y-12077143D01*
X11276428Y-12048571D01*
X11262143Y-11991429D01*
X11262143Y-11920000D01*
X11276428Y-11862857D01*
X11290714Y-11834286D01*
X11305000Y-11820000D01*
X11333571Y-11805714D01*
X11562143Y-12077143D02*
X11576428Y-12091429D01*
X11562143Y-12105714D01*
X11547857Y-12091429D01*
X11562143Y-12077143D01*
X11562143Y-12105714D01*
X11690714Y-11834286D02*
X11705000Y-11820000D01*
X11733571Y-11805714D01*
X11805000Y-11805714D01*
X11833571Y-11820000D01*
X11847857Y-11834286D01*
X11862143Y-11862857D01*
X11862143Y-11891429D01*
X11847857Y-11934286D01*
X11676428Y-12105714D01*
X11862143Y-12105714D01*
X12047857Y-11805714D02*
X12076428Y-11805714D01*
X12105000Y-11820000D01*
X12119286Y-11834286D01*
X12133571Y-11862857D01*
X12147857Y-11920000D01*
X12147857Y-11991429D01*
X12133571Y-12048571D01*
X12119286Y-12077143D01*
X12105000Y-12091429D01*
X12076428Y-12105714D01*
X12047857Y-12105714D01*
X12019286Y-12091429D01*
X12005000Y-12077143D01*
X11990714Y-12048571D01*
X11976428Y-11991429D01*
X11976428Y-11920000D01*
X11990714Y-11862857D01*
X12005000Y-11834286D01*
X12019286Y-11820000D01*
X12047857Y-11805714D01*
X12333571Y-11805714D02*
X12362143Y-11805714D01*
X12390714Y-11820000D01*
X12405000Y-11834286D01*
X12419286Y-11862857D01*
X12433571Y-11920000D01*
X12433571Y-11991429D01*
X12419286Y-12048571D01*
X12405000Y-12077143D01*
X12390714Y-12091429D01*
X12362143Y-12105714D01*
X12333571Y-12105714D01*
X12305000Y-12091429D01*
X12290714Y-12077143D01*
X12276428Y-12048571D01*
X12262143Y-11991429D01*
X12262143Y-11920000D01*
X12276428Y-11862857D01*
X12290714Y-11834286D01*
X12305000Y-11820000D01*
X12333571Y-11805714D01*
X12562143Y-12105714D02*
X12562143Y-11905714D01*
X12562143Y-11934286D02*
X12576428Y-11920000D01*
X12605000Y-11905714D01*
X12647857Y-11905714D01*
X12676428Y-11920000D01*
X12690714Y-11948571D01*
X12690714Y-12105714D01*
X12690714Y-11948571D02*
X12705000Y-11920000D01*
X12733571Y-11905714D01*
X12776428Y-11905714D01*
X12805000Y-11920000D01*
X12819286Y-11948571D01*
X12819286Y-12105714D01*
X12962143Y-12105714D02*
X12962143Y-11905714D01*
X12962143Y-11934286D02*
X12976428Y-11920000D01*
X13005000Y-11905714D01*
X13047857Y-11905714D01*
X13076428Y-11920000D01*
X13090714Y-11948571D01*
X13090714Y-12105714D01*
X13090714Y-11948571D02*
X13105000Y-11920000D01*
X13133571Y-11905714D01*
X13176428Y-11905714D01*
X13205000Y-11920000D01*
X13219286Y-11948571D01*
X13219286Y-12105714D01*
X13805000Y-11791429D02*
X13547857Y-12177143D01*
X14190714Y-11805714D02*
X14219286Y-11805714D01*
X14247857Y-11820000D01*
X14262143Y-11834286D01*
X14276428Y-11862857D01*
X14290714Y-11920000D01*
X14290714Y-11991429D01*
X14276428Y-12048571D01*
X14262143Y-12077143D01*
X14247857Y-12091429D01*
X14219286Y-12105714D01*
X14190714Y-12105714D01*
X14162143Y-12091429D01*
X14147857Y-12077143D01*
X14133571Y-12048571D01*
X14119286Y-11991429D01*
X14119286Y-11920000D01*
X14133571Y-11862857D01*
X14147857Y-11834286D01*
X14162143Y-11820000D01*
X14190714Y-11805714D01*
X14419286Y-12077143D02*
X14433571Y-12091429D01*
X14419286Y-12105714D01*
X14405000Y-12091429D01*
X14419286Y-12077143D01*
X14419286Y-12105714D01*
X14619286Y-11805714D02*
X14647857Y-11805714D01*
X14676428Y-11820000D01*
X14690714Y-11834286D01*
X14705000Y-11862857D01*
X14719286Y-11920000D01*
X14719286Y-11991429D01*
X14705000Y-12048571D01*
X14690714Y-12077143D01*
X14676428Y-12091429D01*
X14647857Y-12105714D01*
X14619286Y-12105714D01*
X14590714Y-12091429D01*
X14576428Y-12077143D01*
X14562143Y-12048571D01*
X14547857Y-11991429D01*
X14547857Y-11920000D01*
X14562143Y-11862857D01*
X14576428Y-11834286D01*
X14590714Y-11820000D01*
X14619286Y-11805714D01*
X14905000Y-11805714D02*
X14933571Y-11805714D01*
X14962143Y-11820000D01*
X14976428Y-11834286D01*
X14990714Y-11862857D01*
X15005000Y-11920000D01*
X15005000Y-11991429D01*
X14990714Y-12048571D01*
X14976428Y-12077143D01*
X14962143Y-12091429D01*
X14933571Y-12105714D01*
X14905000Y-12105714D01*
X14876428Y-12091429D01*
X14862143Y-12077143D01*
X14847857Y-12048571D01*
X14833571Y-11991429D01*
X14833571Y-11920000D01*
X14847857Y-11862857D01*
X14862143Y-11834286D01*
X14876428Y-11820000D01*
X14905000Y-11805714D01*
X15105000Y-11805714D02*
X15305000Y-11805714D01*
X15176428Y-12105714D01*
X15433571Y-12105714D02*
X15490714Y-12105714D01*
X15519286Y-12091429D01*
X15533571Y-12077143D01*
X15562143Y-12034286D01*
X15576428Y-11977143D01*
X15576428Y-11862857D01*
X15562143Y-11834286D01*
X15547857Y-11820000D01*
X15519286Y-11805714D01*
X15462143Y-11805714D01*
X15433571Y-11820000D01*
X15419286Y-11834286D01*
X15405000Y-11862857D01*
X15405000Y-11934286D01*
X15419286Y-11962857D01*
X15433571Y-11977143D01*
X15462143Y-11991429D01*
X15519286Y-11991429D01*
X15547857Y-11977143D01*
X15562143Y-11962857D01*
X15576428Y-11934286D01*
X15690714Y-11805714D02*
X15690714Y-11862857D01*
X15805000Y-11805714D02*
X15805000Y-11862857D01*
X16247857Y-12220000D02*
X16233571Y-12205714D01*
X16205000Y-12162857D01*
X16190714Y-12134286D01*
X16176428Y-12091429D01*
X16162143Y-12020000D01*
X16162143Y-11962857D01*
X16176428Y-11891429D01*
X16190714Y-11848571D01*
X16205000Y-11820000D01*
X16233571Y-11777143D01*
X16247857Y-11762857D01*
X16519286Y-12105714D02*
X16347857Y-12105714D01*
X16433571Y-12105714D02*
X16433571Y-11805714D01*
X16405000Y-11848571D01*
X16376428Y-11877143D01*
X16347857Y-11891429D01*
X16690714Y-11934286D02*
X16662143Y-11920000D01*
X16647857Y-11905714D01*
X16633571Y-11877143D01*
X16633571Y-11862857D01*
X16647857Y-11834286D01*
X16662143Y-11820000D01*
X16690714Y-11805714D01*
X16747857Y-11805714D01*
X16776428Y-11820000D01*
X16790714Y-11834286D01*
X16805000Y-11862857D01*
X16805000Y-11877143D01*
X16790714Y-11905714D01*
X16776428Y-11920000D01*
X16747857Y-11934286D01*
X16690714Y-11934286D01*
X16662143Y-11948571D01*
X16647857Y-11962857D01*
X16633571Y-11991429D01*
X16633571Y-12048571D01*
X16647857Y-12077143D01*
X16662143Y-12091429D01*
X16690714Y-12105714D01*
X16747857Y-12105714D01*
X16776428Y-12091429D01*
X16790714Y-12077143D01*
X16805000Y-12048571D01*
X16805000Y-11991429D01*
X16790714Y-11962857D01*
X16776428Y-11948571D01*
X16747857Y-11934286D01*
X17162143Y-12105714D02*
X17162143Y-11805714D01*
X17290714Y-12105714D02*
X17290714Y-11948571D01*
X17276428Y-11920000D01*
X17247857Y-11905714D01*
X17205000Y-11905714D01*
X17176428Y-11920000D01*
X17162143Y-11934286D01*
X17476428Y-12105714D02*
X17447857Y-12091429D01*
X17433571Y-12077143D01*
X17419286Y-12048571D01*
X17419286Y-11962857D01*
X17433571Y-11934286D01*
X17447857Y-11920000D01*
X17476428Y-11905714D01*
X17519286Y-11905714D01*
X17547857Y-11920000D01*
X17562143Y-11934286D01*
X17576428Y-11962857D01*
X17576428Y-12048571D01*
X17562143Y-12077143D01*
X17547857Y-12091429D01*
X17519286Y-12105714D01*
X17476428Y-12105714D01*
X17747857Y-12105714D02*
X17719286Y-12091429D01*
X17705000Y-12062857D01*
X17705000Y-11805714D01*
X17976428Y-12091429D02*
X17947857Y-12105714D01*
X17890714Y-12105714D01*
X17862143Y-12091429D01*
X17847857Y-12062857D01*
X17847857Y-11948571D01*
X17862143Y-11920000D01*
X17890714Y-11905714D01*
X17947857Y-11905714D01*
X17976428Y-11920000D01*
X17990714Y-11948571D01*
X17990714Y-11977143D01*
X17847857Y-12005714D01*
X18105000Y-12091429D02*
X18133571Y-12105714D01*
X18190714Y-12105714D01*
X18219286Y-12091429D01*
X18233571Y-12062857D01*
X18233571Y-12048571D01*
X18219286Y-12020000D01*
X18190714Y-12005714D01*
X18147857Y-12005714D01*
X18119286Y-11991429D01*
X18105000Y-11962857D01*
X18105000Y-11948571D01*
X18119286Y-11920000D01*
X18147857Y-11905714D01*
X18190714Y-11905714D01*
X18219286Y-11920000D01*
X18333571Y-12220000D02*
X18347857Y-12205714D01*
X18376428Y-12162857D01*
X18390714Y-12134286D01*
X18405000Y-12091429D01*
X18419286Y-12020000D01*
X18419286Y-11962857D01*
X18405000Y-11891429D01*
X18390714Y-11848571D01*
X18376428Y-11820000D01*
X18347857Y-11777143D01*
X18333571Y-11762857D01*
M02*
