%TF.GenerationSoftware,KiCad,Pcbnew,5.1.12-84ad8e8a86~92~ubuntu18.04.1*%
%TF.CreationDate,2022-04-26T16:25:05+02:00*%
%TF.ProjectId,QSFP-DD_FMCP,51534650-2d44-4445-9f46-4d43502e6b69,1.0*%
%TF.SameCoordinates,Original*%
%TF.FileFunction,Paste,Top*%
%TF.FilePolarity,Positive*%
%FSLAX46Y46*%
G04 Gerber Fmt 4.6, Leading zero omitted, Abs format (unit mm)*
G04 Created by KiCad (PCBNEW 5.1.12-84ad8e8a86~92~ubuntu18.04.1) date 2022-04-26 16:25:05*
%MOMM*%
%LPD*%
G01*
G04 APERTURE LIST*
%ADD10C,0.050000*%
%ADD11C,0.150000*%
%ADD12C,0.300000*%
%ADD13C,0.400000*%
%ADD14O,1.600000X0.350000*%
G04 APERTURE END LIST*
D10*
D11*
X177002200Y-166007200D02*
X177002200Y-198007200D01*
X285002200Y-198007200D01*
X285002200Y-166007200D01*
X177002200Y-166007200D01*
D10*
D11*
X10000000Y-10000000D02*
X10000000Y-200007200D01*
X287002200Y-200007200D01*
X287002200Y-10000000D01*
X10000000Y-10000000D01*
D10*
D11*
X12000000Y-12000000D02*
X12000000Y-198007200D01*
X285002200Y-198007200D01*
X285002200Y-12000000D01*
X12000000Y-12000000D01*
D10*
D11*
X60000000Y-12000000D02*
X60000000Y-10000000D01*
D10*
D11*
X110000000Y-12000000D02*
X110000000Y-10000000D01*
D10*
D11*
X160000000Y-12000000D02*
X160000000Y-10000000D01*
D10*
D11*
X210000000Y-12000000D02*
X210000000Y-10000000D01*
D10*
D11*
X260000000Y-12000000D02*
X260000000Y-10000000D01*
D10*
D11*
X36065476Y-11588095D02*
X35322619Y-11588095D01*
X35694047Y-11588095D02*
X35694047Y-10288095D01*
X35570238Y-10473809D01*
X35446428Y-10597619D01*
X35322619Y-10659523D01*
D10*
D11*
X85322619Y-10411904D02*
X85384523Y-10350000D01*
X85508333Y-10288095D01*
X85817857Y-10288095D01*
X85941666Y-10350000D01*
X86003571Y-10411904D01*
X86065476Y-10535714D01*
X86065476Y-10659523D01*
X86003571Y-10845238D01*
X85260714Y-11588095D01*
X86065476Y-11588095D01*
D10*
D11*
X135260714Y-10288095D02*
X136065476Y-10288095D01*
X135632142Y-10783333D01*
X135817857Y-10783333D01*
X135941666Y-10845238D01*
X136003571Y-10907142D01*
X136065476Y-11030952D01*
X136065476Y-11340476D01*
X136003571Y-11464285D01*
X135941666Y-11526190D01*
X135817857Y-11588095D01*
X135446428Y-11588095D01*
X135322619Y-11526190D01*
X135260714Y-11464285D01*
D10*
D11*
X185941666Y-10721428D02*
X185941666Y-11588095D01*
X185632142Y-10226190D02*
X185322619Y-11154761D01*
X186127380Y-11154761D01*
D10*
D11*
X236003571Y-10288095D02*
X235384523Y-10288095D01*
X235322619Y-10907142D01*
X235384523Y-10845238D01*
X235508333Y-10783333D01*
X235817857Y-10783333D01*
X235941666Y-10845238D01*
X236003571Y-10907142D01*
X236065476Y-11030952D01*
X236065476Y-11340476D01*
X236003571Y-11464285D01*
X235941666Y-11526190D01*
X235817857Y-11588095D01*
X235508333Y-11588095D01*
X235384523Y-11526190D01*
X235322619Y-11464285D01*
D10*
D11*
X285941666Y-10288095D02*
X285694047Y-10288095D01*
X285570238Y-10350000D01*
X285508333Y-10411904D01*
X285384523Y-10597619D01*
X285322619Y-10845238D01*
X285322619Y-11340476D01*
X285384523Y-11464285D01*
X285446428Y-11526190D01*
X285570238Y-11588095D01*
X285817857Y-11588095D01*
X285941666Y-11526190D01*
X286003571Y-11464285D01*
X286065476Y-11340476D01*
X286065476Y-11030952D01*
X286003571Y-10907142D01*
X285941666Y-10845238D01*
X285817857Y-10783333D01*
X285570238Y-10783333D01*
X285446428Y-10845238D01*
X285384523Y-10907142D01*
X285322619Y-11030952D01*
D10*
D11*
X60000000Y-198007200D02*
X60000000Y-200007200D01*
D10*
D11*
X110000000Y-198007200D02*
X110000000Y-200007200D01*
D10*
D11*
X160000000Y-198007200D02*
X160000000Y-200007200D01*
D10*
D11*
X210000000Y-198007200D02*
X210000000Y-200007200D01*
D10*
D11*
X260000000Y-198007200D02*
X260000000Y-200007200D01*
D10*
D11*
X36065476Y-199595295D02*
X35322619Y-199595295D01*
X35694047Y-199595295D02*
X35694047Y-198295295D01*
X35570238Y-198481009D01*
X35446428Y-198604819D01*
X35322619Y-198666723D01*
D10*
D11*
X85322619Y-198419104D02*
X85384523Y-198357200D01*
X85508333Y-198295295D01*
X85817857Y-198295295D01*
X85941666Y-198357200D01*
X86003571Y-198419104D01*
X86065476Y-198542914D01*
X86065476Y-198666723D01*
X86003571Y-198852438D01*
X85260714Y-199595295D01*
X86065476Y-199595295D01*
D10*
D11*
X135260714Y-198295295D02*
X136065476Y-198295295D01*
X135632142Y-198790533D01*
X135817857Y-198790533D01*
X135941666Y-198852438D01*
X136003571Y-198914342D01*
X136065476Y-199038152D01*
X136065476Y-199347676D01*
X136003571Y-199471485D01*
X135941666Y-199533390D01*
X135817857Y-199595295D01*
X135446428Y-199595295D01*
X135322619Y-199533390D01*
X135260714Y-199471485D01*
D10*
D11*
X185941666Y-198728628D02*
X185941666Y-199595295D01*
X185632142Y-198233390D02*
X185322619Y-199161961D01*
X186127380Y-199161961D01*
D10*
D11*
X236003571Y-198295295D02*
X235384523Y-198295295D01*
X235322619Y-198914342D01*
X235384523Y-198852438D01*
X235508333Y-198790533D01*
X235817857Y-198790533D01*
X235941666Y-198852438D01*
X236003571Y-198914342D01*
X236065476Y-199038152D01*
X236065476Y-199347676D01*
X236003571Y-199471485D01*
X235941666Y-199533390D01*
X235817857Y-199595295D01*
X235508333Y-199595295D01*
X235384523Y-199533390D01*
X235322619Y-199471485D01*
D10*
D11*
X285941666Y-198295295D02*
X285694047Y-198295295D01*
X285570238Y-198357200D01*
X285508333Y-198419104D01*
X285384523Y-198604819D01*
X285322619Y-198852438D01*
X285322619Y-199347676D01*
X285384523Y-199471485D01*
X285446428Y-199533390D01*
X285570238Y-199595295D01*
X285817857Y-199595295D01*
X285941666Y-199533390D01*
X286003571Y-199471485D01*
X286065476Y-199347676D01*
X286065476Y-199038152D01*
X286003571Y-198914342D01*
X285941666Y-198852438D01*
X285817857Y-198790533D01*
X285570238Y-198790533D01*
X285446428Y-198852438D01*
X285384523Y-198914342D01*
X285322619Y-199038152D01*
D10*
D11*
X10000000Y-60000000D02*
X12000000Y-60000000D01*
D10*
D11*
X10000000Y-110000000D02*
X12000000Y-110000000D01*
D10*
D11*
X10000000Y-160000000D02*
X12000000Y-160000000D01*
D10*
D11*
X10690476Y-35216666D02*
X11309523Y-35216666D01*
X10566666Y-35588095D02*
X11000000Y-34288095D01*
X11433333Y-35588095D01*
D10*
D11*
X11092857Y-84907142D02*
X11278571Y-84969047D01*
X11340476Y-85030952D01*
X11402380Y-85154761D01*
X11402380Y-85340476D01*
X11340476Y-85464285D01*
X11278571Y-85526190D01*
X11154761Y-85588095D01*
X10659523Y-85588095D01*
X10659523Y-84288095D01*
X11092857Y-84288095D01*
X11216666Y-84350000D01*
X11278571Y-84411904D01*
X11340476Y-84535714D01*
X11340476Y-84659523D01*
X11278571Y-84783333D01*
X11216666Y-84845238D01*
X11092857Y-84907142D01*
X10659523Y-84907142D01*
D10*
D11*
X11402380Y-135464285D02*
X11340476Y-135526190D01*
X11154761Y-135588095D01*
X11030952Y-135588095D01*
X10845238Y-135526190D01*
X10721428Y-135402380D01*
X10659523Y-135278571D01*
X10597619Y-135030952D01*
X10597619Y-134845238D01*
X10659523Y-134597619D01*
X10721428Y-134473809D01*
X10845238Y-134350000D01*
X11030952Y-134288095D01*
X11154761Y-134288095D01*
X11340476Y-134350000D01*
X11402380Y-134411904D01*
D10*
D11*
X10659523Y-185588095D02*
X10659523Y-184288095D01*
X10969047Y-184288095D01*
X11154761Y-184350000D01*
X11278571Y-184473809D01*
X11340476Y-184597619D01*
X11402380Y-184845238D01*
X11402380Y-185030952D01*
X11340476Y-185278571D01*
X11278571Y-185402380D01*
X11154761Y-185526190D01*
X10969047Y-185588095D01*
X10659523Y-185588095D01*
D10*
D11*
X287002200Y-60000000D02*
X285002200Y-60000000D01*
D10*
D11*
X287002200Y-110000000D02*
X285002200Y-110000000D01*
D10*
D11*
X287002200Y-160000000D02*
X285002200Y-160000000D01*
D10*
D11*
X285692676Y-35216666D02*
X286311723Y-35216666D01*
X285568866Y-35588095D02*
X286002200Y-34288095D01*
X286435533Y-35588095D01*
D10*
D11*
X286095057Y-84907142D02*
X286280771Y-84969047D01*
X286342676Y-85030952D01*
X286404580Y-85154761D01*
X286404580Y-85340476D01*
X286342676Y-85464285D01*
X286280771Y-85526190D01*
X286156961Y-85588095D01*
X285661723Y-85588095D01*
X285661723Y-84288095D01*
X286095057Y-84288095D01*
X286218866Y-84350000D01*
X286280771Y-84411904D01*
X286342676Y-84535714D01*
X286342676Y-84659523D01*
X286280771Y-84783333D01*
X286218866Y-84845238D01*
X286095057Y-84907142D01*
X285661723Y-84907142D01*
D10*
D11*
X286404580Y-135464285D02*
X286342676Y-135526190D01*
X286156961Y-135588095D01*
X286033152Y-135588095D01*
X285847438Y-135526190D01*
X285723628Y-135402380D01*
X285661723Y-135278571D01*
X285599819Y-135030952D01*
X285599819Y-134845238D01*
X285661723Y-134597619D01*
X285723628Y-134473809D01*
X285847438Y-134350000D01*
X286033152Y-134288095D01*
X286156961Y-134288095D01*
X286342676Y-134350000D01*
X286404580Y-134411904D01*
D10*
D11*
X285661723Y-185588095D02*
X285661723Y-184288095D01*
X285971247Y-184288095D01*
X286156961Y-184350000D01*
X286280771Y-184473809D01*
X286342676Y-184597619D01*
X286404580Y-184845238D01*
X286404580Y-185030952D01*
X286342676Y-185278571D01*
X286280771Y-185402380D01*
X286156961Y-185526190D01*
X285971247Y-185588095D01*
X285661723Y-185588095D01*
D10*
D11*
X200434342Y-193785771D02*
X200434342Y-192285771D01*
X200791485Y-192285771D01*
X201005771Y-192357200D01*
X201148628Y-192500057D01*
X201220057Y-192642914D01*
X201291485Y-192928628D01*
X201291485Y-193142914D01*
X201220057Y-193428628D01*
X201148628Y-193571485D01*
X201005771Y-193714342D01*
X200791485Y-193785771D01*
X200434342Y-193785771D01*
X202577200Y-193785771D02*
X202577200Y-193000057D01*
X202505771Y-192857200D01*
X202362914Y-192785771D01*
X202077200Y-192785771D01*
X201934342Y-192857200D01*
X202577200Y-193714342D02*
X202434342Y-193785771D01*
X202077200Y-193785771D01*
X201934342Y-193714342D01*
X201862914Y-193571485D01*
X201862914Y-193428628D01*
X201934342Y-193285771D01*
X202077200Y-193214342D01*
X202434342Y-193214342D01*
X202577200Y-193142914D01*
X203077200Y-192785771D02*
X203648628Y-192785771D01*
X203291485Y-192285771D02*
X203291485Y-193571485D01*
X203362914Y-193714342D01*
X203505771Y-193785771D01*
X203648628Y-193785771D01*
X204720057Y-193714342D02*
X204577200Y-193785771D01*
X204291485Y-193785771D01*
X204148628Y-193714342D01*
X204077200Y-193571485D01*
X204077200Y-193000057D01*
X204148628Y-192857200D01*
X204291485Y-192785771D01*
X204577200Y-192785771D01*
X204720057Y-192857200D01*
X204791485Y-193000057D01*
X204791485Y-193142914D01*
X204077200Y-193285771D01*
X205434342Y-193642914D02*
X205505771Y-193714342D01*
X205434342Y-193785771D01*
X205362914Y-193714342D01*
X205434342Y-193642914D01*
X205434342Y-193785771D01*
X205434342Y-192857200D02*
X205505771Y-192928628D01*
X205434342Y-193000057D01*
X205362914Y-192928628D01*
X205434342Y-192857200D01*
X205434342Y-193000057D01*
X207220057Y-192428628D02*
X207291485Y-192357200D01*
X207434342Y-192285771D01*
X207791485Y-192285771D01*
X207934342Y-192357200D01*
X208005771Y-192428628D01*
X208077200Y-192571485D01*
X208077200Y-192714342D01*
X208005771Y-192928628D01*
X207148628Y-193785771D01*
X208077200Y-193785771D01*
X209005771Y-192285771D02*
X209148628Y-192285771D01*
X209291485Y-192357200D01*
X209362914Y-192428628D01*
X209434342Y-192571485D01*
X209505771Y-192857200D01*
X209505771Y-193214342D01*
X209434342Y-193500057D01*
X209362914Y-193642914D01*
X209291485Y-193714342D01*
X209148628Y-193785771D01*
X209005771Y-193785771D01*
X208862914Y-193714342D01*
X208791485Y-193642914D01*
X208720057Y-193500057D01*
X208648628Y-193214342D01*
X208648628Y-192857200D01*
X208720057Y-192571485D01*
X208791485Y-192428628D01*
X208862914Y-192357200D01*
X209005771Y-192285771D01*
X210077200Y-192428628D02*
X210148628Y-192357200D01*
X210291485Y-192285771D01*
X210648628Y-192285771D01*
X210791485Y-192357200D01*
X210862914Y-192428628D01*
X210934342Y-192571485D01*
X210934342Y-192714342D01*
X210862914Y-192928628D01*
X210005771Y-193785771D01*
X210934342Y-193785771D01*
X211505771Y-192428628D02*
X211577200Y-192357200D01*
X211720057Y-192285771D01*
X212077200Y-192285771D01*
X212220057Y-192357200D01*
X212291485Y-192428628D01*
X212362914Y-192571485D01*
X212362914Y-192714342D01*
X212291485Y-192928628D01*
X211434342Y-193785771D01*
X212362914Y-193785771D01*
X213005771Y-193214342D02*
X214148628Y-193214342D01*
X215148628Y-192285771D02*
X215291485Y-192285771D01*
X215434342Y-192357200D01*
X215505771Y-192428628D01*
X215577200Y-192571485D01*
X215648628Y-192857200D01*
X215648628Y-193214342D01*
X215577200Y-193500057D01*
X215505771Y-193642914D01*
X215434342Y-193714342D01*
X215291485Y-193785771D01*
X215148628Y-193785771D01*
X215005771Y-193714342D01*
X214934342Y-193642914D01*
X214862914Y-193500057D01*
X214791485Y-193214342D01*
X214791485Y-192857200D01*
X214862914Y-192571485D01*
X214934342Y-192428628D01*
X215005771Y-192357200D01*
X215148628Y-192285771D01*
X216934342Y-192785771D02*
X216934342Y-193785771D01*
X216577200Y-192214342D02*
X216220057Y-193285771D01*
X217148628Y-193285771D01*
X217720057Y-193214342D02*
X218862914Y-193214342D01*
X219505771Y-192428628D02*
X219577200Y-192357200D01*
X219720057Y-192285771D01*
X220077200Y-192285771D01*
X220220057Y-192357200D01*
X220291485Y-192428628D01*
X220362914Y-192571485D01*
X220362914Y-192714342D01*
X220291485Y-192928628D01*
X219434342Y-193785771D01*
X220362914Y-193785771D01*
X221648628Y-192285771D02*
X221362914Y-192285771D01*
X221220057Y-192357200D01*
X221148628Y-192428628D01*
X221005771Y-192642914D01*
X220934342Y-192928628D01*
X220934342Y-193500057D01*
X221005771Y-193642914D01*
X221077200Y-193714342D01*
X221220057Y-193785771D01*
X221505771Y-193785771D01*
X221648628Y-193714342D01*
X221720057Y-193642914D01*
X221791485Y-193500057D01*
X221791485Y-193142914D01*
X221720057Y-193000057D01*
X221648628Y-192928628D01*
X221505771Y-192857200D01*
X221220057Y-192857200D01*
X221077200Y-192928628D01*
X221005771Y-193000057D01*
X220934342Y-193142914D01*
D10*
D11*
X177002200Y-194507200D02*
X285002200Y-194507200D01*
D10*
D11*
X178434342Y-196585771D02*
X178434342Y-195085771D01*
X179291485Y-196585771D02*
X178648628Y-195728628D01*
X179291485Y-195085771D02*
X178434342Y-195942914D01*
X179934342Y-196585771D02*
X179934342Y-195585771D01*
X179934342Y-195085771D02*
X179862914Y-195157200D01*
X179934342Y-195228628D01*
X180005771Y-195157200D01*
X179934342Y-195085771D01*
X179934342Y-195228628D01*
X181505771Y-196442914D02*
X181434342Y-196514342D01*
X181220057Y-196585771D01*
X181077200Y-196585771D01*
X180862914Y-196514342D01*
X180720057Y-196371485D01*
X180648628Y-196228628D01*
X180577200Y-195942914D01*
X180577200Y-195728628D01*
X180648628Y-195442914D01*
X180720057Y-195300057D01*
X180862914Y-195157200D01*
X181077200Y-195085771D01*
X181220057Y-195085771D01*
X181434342Y-195157200D01*
X181505771Y-195228628D01*
X182791485Y-196585771D02*
X182791485Y-195800057D01*
X182720057Y-195657200D01*
X182577200Y-195585771D01*
X182291485Y-195585771D01*
X182148628Y-195657200D01*
X182791485Y-196514342D02*
X182648628Y-196585771D01*
X182291485Y-196585771D01*
X182148628Y-196514342D01*
X182077200Y-196371485D01*
X182077200Y-196228628D01*
X182148628Y-196085771D01*
X182291485Y-196014342D01*
X182648628Y-196014342D01*
X182791485Y-195942914D01*
X184148628Y-196585771D02*
X184148628Y-195085771D01*
X184148628Y-196514342D02*
X184005771Y-196585771D01*
X183720057Y-196585771D01*
X183577200Y-196514342D01*
X183505771Y-196442914D01*
X183434342Y-196300057D01*
X183434342Y-195871485D01*
X183505771Y-195728628D01*
X183577200Y-195657200D01*
X183720057Y-195585771D01*
X184005771Y-195585771D01*
X184148628Y-195657200D01*
X186005771Y-195800057D02*
X186505771Y-195800057D01*
X186720057Y-196585771D02*
X186005771Y-196585771D01*
X186005771Y-195085771D01*
X186720057Y-195085771D01*
X187362914Y-196442914D02*
X187434342Y-196514342D01*
X187362914Y-196585771D01*
X187291485Y-196514342D01*
X187362914Y-196442914D01*
X187362914Y-196585771D01*
X188077200Y-196585771D02*
X188077200Y-195085771D01*
X188434342Y-195085771D01*
X188648628Y-195157200D01*
X188791485Y-195300057D01*
X188862914Y-195442914D01*
X188934342Y-195728628D01*
X188934342Y-195942914D01*
X188862914Y-196228628D01*
X188791485Y-196371485D01*
X188648628Y-196514342D01*
X188434342Y-196585771D01*
X188077200Y-196585771D01*
X189577200Y-196442914D02*
X189648628Y-196514342D01*
X189577200Y-196585771D01*
X189505771Y-196514342D01*
X189577200Y-196442914D01*
X189577200Y-196585771D01*
X190220057Y-196157200D02*
X190934342Y-196157200D01*
X190077200Y-196585771D02*
X190577200Y-195085771D01*
X191077200Y-196585771D01*
X191577200Y-196442914D02*
X191648628Y-196514342D01*
X191577200Y-196585771D01*
X191505771Y-196514342D01*
X191577200Y-196442914D01*
X191577200Y-196585771D01*
X194577200Y-196585771D02*
X194577200Y-195085771D01*
X194720057Y-196014342D02*
X195148628Y-196585771D01*
X195148628Y-195585771D02*
X194577200Y-196157200D01*
X195791485Y-196585771D02*
X195791485Y-195585771D01*
X195791485Y-195085771D02*
X195720057Y-195157200D01*
X195791485Y-195228628D01*
X195862914Y-195157200D01*
X195791485Y-195085771D01*
X195791485Y-195228628D01*
X197148628Y-196514342D02*
X197005771Y-196585771D01*
X196720057Y-196585771D01*
X196577200Y-196514342D01*
X196505771Y-196442914D01*
X196434342Y-196300057D01*
X196434342Y-195871485D01*
X196505771Y-195728628D01*
X196577200Y-195657200D01*
X196720057Y-195585771D01*
X197005771Y-195585771D01*
X197148628Y-195657200D01*
X198434342Y-196585771D02*
X198434342Y-195800057D01*
X198362914Y-195657200D01*
X198220057Y-195585771D01*
X197934342Y-195585771D01*
X197791485Y-195657200D01*
X198434342Y-196514342D02*
X198291485Y-196585771D01*
X197934342Y-196585771D01*
X197791485Y-196514342D01*
X197720057Y-196371485D01*
X197720057Y-196228628D01*
X197791485Y-196085771D01*
X197934342Y-196014342D01*
X198291485Y-196014342D01*
X198434342Y-195942914D01*
X199791485Y-196585771D02*
X199791485Y-195085771D01*
X199791485Y-196514342D02*
X199648628Y-196585771D01*
X199362914Y-196585771D01*
X199220057Y-196514342D01*
X199148628Y-196442914D01*
X199077200Y-196300057D01*
X199077200Y-195871485D01*
X199148628Y-195728628D01*
X199220057Y-195657200D01*
X199362914Y-195585771D01*
X199648628Y-195585771D01*
X199791485Y-195657200D01*
X202362914Y-195085771D02*
X201648628Y-195085771D01*
X201577200Y-195800057D01*
X201648628Y-195728628D01*
X201791485Y-195657200D01*
X202148628Y-195657200D01*
X202291485Y-195728628D01*
X202362914Y-195800057D01*
X202434342Y-195942914D01*
X202434342Y-196300057D01*
X202362914Y-196442914D01*
X202291485Y-196514342D01*
X202148628Y-196585771D01*
X201791485Y-196585771D01*
X201648628Y-196514342D01*
X201577200Y-196442914D01*
X203077200Y-196442914D02*
X203148628Y-196514342D01*
X203077200Y-196585771D01*
X203005771Y-196514342D01*
X203077200Y-196442914D01*
X203077200Y-196585771D01*
X204577200Y-196585771D02*
X203720057Y-196585771D01*
X204148628Y-196585771D02*
X204148628Y-195085771D01*
X204005771Y-195300057D01*
X203862914Y-195442914D01*
X203720057Y-195514342D01*
X205220057Y-196442914D02*
X205291485Y-196514342D01*
X205220057Y-196585771D01*
X205148628Y-196514342D01*
X205220057Y-196442914D01*
X205220057Y-196585771D01*
X206720057Y-196585771D02*
X205862914Y-196585771D01*
X206291485Y-196585771D02*
X206291485Y-195085771D01*
X206148628Y-195300057D01*
X206005771Y-195442914D01*
X205862914Y-195514342D01*
X207291485Y-195228628D02*
X207362914Y-195157200D01*
X207505771Y-195085771D01*
X207862914Y-195085771D01*
X208005771Y-195157200D01*
X208077200Y-195228628D01*
X208148628Y-195371485D01*
X208148628Y-195514342D01*
X208077200Y-195728628D01*
X207220057Y-196585771D01*
X208148628Y-196585771D01*
X208791485Y-196014342D02*
X209934342Y-196014342D01*
X210862914Y-195728628D02*
X210720057Y-195657200D01*
X210648628Y-195585771D01*
X210577200Y-195442914D01*
X210577200Y-195371485D01*
X210648628Y-195228628D01*
X210720057Y-195157200D01*
X210862914Y-195085771D01*
X211148628Y-195085771D01*
X211291485Y-195157200D01*
X211362914Y-195228628D01*
X211434342Y-195371485D01*
X211434342Y-195442914D01*
X211362914Y-195585771D01*
X211291485Y-195657200D01*
X211148628Y-195728628D01*
X210862914Y-195728628D01*
X210720057Y-195800057D01*
X210648628Y-195871485D01*
X210577200Y-196014342D01*
X210577200Y-196300057D01*
X210648628Y-196442914D01*
X210720057Y-196514342D01*
X210862914Y-196585771D01*
X211148628Y-196585771D01*
X211291485Y-196514342D01*
X211362914Y-196442914D01*
X211434342Y-196300057D01*
X211434342Y-196014342D01*
X211362914Y-195871485D01*
X211291485Y-195800057D01*
X211148628Y-195728628D01*
X212720057Y-195585771D02*
X212720057Y-196585771D01*
X212362914Y-195014342D02*
X212005771Y-196085771D01*
X212934342Y-196085771D01*
X214148628Y-196585771D02*
X214148628Y-195800057D01*
X214077200Y-195657200D01*
X213934342Y-195585771D01*
X213648628Y-195585771D01*
X213505771Y-195657200D01*
X214148628Y-196514342D02*
X214005771Y-196585771D01*
X213648628Y-196585771D01*
X213505771Y-196514342D01*
X213434342Y-196371485D01*
X213434342Y-196228628D01*
X213505771Y-196085771D01*
X213648628Y-196014342D01*
X214005771Y-196014342D01*
X214148628Y-195942914D01*
X215505771Y-196585771D02*
X215505771Y-195085771D01*
X215505771Y-196514342D02*
X215362914Y-196585771D01*
X215077200Y-196585771D01*
X214934342Y-196514342D01*
X214862914Y-196442914D01*
X214791485Y-196300057D01*
X214791485Y-195871485D01*
X214862914Y-195728628D01*
X214934342Y-195657200D01*
X215077200Y-195585771D01*
X215362914Y-195585771D01*
X215505771Y-195657200D01*
X216434342Y-195728628D02*
X216291485Y-195657200D01*
X216220057Y-195585771D01*
X216148628Y-195442914D01*
X216148628Y-195371485D01*
X216220057Y-195228628D01*
X216291485Y-195157200D01*
X216434342Y-195085771D01*
X216720057Y-195085771D01*
X216862914Y-195157200D01*
X216934342Y-195228628D01*
X217005771Y-195371485D01*
X217005771Y-195442914D01*
X216934342Y-195585771D01*
X216862914Y-195657200D01*
X216720057Y-195728628D01*
X216434342Y-195728628D01*
X216291485Y-195800057D01*
X216220057Y-195871485D01*
X216148628Y-196014342D01*
X216148628Y-196300057D01*
X216220057Y-196442914D01*
X216291485Y-196514342D01*
X216434342Y-196585771D01*
X216720057Y-196585771D01*
X216862914Y-196514342D01*
X216934342Y-196442914D01*
X217005771Y-196300057D01*
X217005771Y-196014342D01*
X216934342Y-195871485D01*
X216862914Y-195800057D01*
X216720057Y-195728628D01*
X218220057Y-196514342D02*
X218077200Y-196585771D01*
X217791485Y-196585771D01*
X217648628Y-196514342D01*
X217577200Y-196371485D01*
X217577200Y-195800057D01*
X217648628Y-195657200D01*
X217791485Y-195585771D01*
X218077200Y-195585771D01*
X218220057Y-195657200D01*
X218291485Y-195800057D01*
X218291485Y-195942914D01*
X217577200Y-196085771D01*
X219148628Y-195728628D02*
X219005771Y-195657200D01*
X218934342Y-195585771D01*
X218862914Y-195442914D01*
X218862914Y-195371485D01*
X218934342Y-195228628D01*
X219005771Y-195157200D01*
X219148628Y-195085771D01*
X219434342Y-195085771D01*
X219577200Y-195157200D01*
X219648628Y-195228628D01*
X219720057Y-195371485D01*
X219720057Y-195442914D01*
X219648628Y-195585771D01*
X219577200Y-195657200D01*
X219434342Y-195728628D01*
X219148628Y-195728628D01*
X219005771Y-195800057D01*
X218934342Y-195871485D01*
X218862914Y-196014342D01*
X218862914Y-196300057D01*
X218934342Y-196442914D01*
X219005771Y-196514342D01*
X219148628Y-196585771D01*
X219434342Y-196585771D01*
X219577200Y-196514342D01*
X219648628Y-196442914D01*
X219720057Y-196300057D01*
X219720057Y-196014342D01*
X219648628Y-195871485D01*
X219577200Y-195800057D01*
X219434342Y-195728628D01*
X221005771Y-196585771D02*
X221005771Y-195800057D01*
X220934342Y-195657200D01*
X220791485Y-195585771D01*
X220505771Y-195585771D01*
X220362914Y-195657200D01*
X221005771Y-196514342D02*
X220862914Y-196585771D01*
X220505771Y-196585771D01*
X220362914Y-196514342D01*
X220291485Y-196371485D01*
X220291485Y-196228628D01*
X220362914Y-196085771D01*
X220505771Y-196014342D01*
X220862914Y-196014342D01*
X221005771Y-195942914D01*
X221934342Y-195728628D02*
X221791485Y-195657200D01*
X221720057Y-195585771D01*
X221648628Y-195442914D01*
X221648628Y-195371485D01*
X221720057Y-195228628D01*
X221791485Y-195157200D01*
X221934342Y-195085771D01*
X222220057Y-195085771D01*
X222362914Y-195157200D01*
X222434342Y-195228628D01*
X222505771Y-195371485D01*
X222505771Y-195442914D01*
X222434342Y-195585771D01*
X222362914Y-195657200D01*
X222220057Y-195728628D01*
X221934342Y-195728628D01*
X221791485Y-195800057D01*
X221720057Y-195871485D01*
X221648628Y-196014342D01*
X221648628Y-196300057D01*
X221720057Y-196442914D01*
X221791485Y-196514342D01*
X221934342Y-196585771D01*
X222220057Y-196585771D01*
X222362914Y-196514342D01*
X222434342Y-196442914D01*
X222505771Y-196300057D01*
X222505771Y-196014342D01*
X222434342Y-195871485D01*
X222362914Y-195800057D01*
X222220057Y-195728628D01*
X223791485Y-195085771D02*
X223505771Y-195085771D01*
X223362914Y-195157200D01*
X223291485Y-195228628D01*
X223148628Y-195442914D01*
X223077200Y-195728628D01*
X223077200Y-196300057D01*
X223148628Y-196442914D01*
X223220057Y-196514342D01*
X223362914Y-196585771D01*
X223648628Y-196585771D01*
X223791485Y-196514342D01*
X223862914Y-196442914D01*
X223934342Y-196300057D01*
X223934342Y-195942914D01*
X223862914Y-195800057D01*
X223791485Y-195728628D01*
X223648628Y-195657200D01*
X223362914Y-195657200D01*
X223220057Y-195728628D01*
X223148628Y-195800057D01*
X223077200Y-195942914D01*
X224220057Y-194677200D02*
X225648628Y-194677200D01*
X224648628Y-196585771D02*
X224934342Y-196585771D01*
X225077200Y-196514342D01*
X225148628Y-196442914D01*
X225291485Y-196228628D01*
X225362914Y-195942914D01*
X225362914Y-195371485D01*
X225291485Y-195228628D01*
X225220057Y-195157200D01*
X225077200Y-195085771D01*
X224791485Y-195085771D01*
X224648628Y-195157200D01*
X224577200Y-195228628D01*
X224505771Y-195371485D01*
X224505771Y-195728628D01*
X224577200Y-195871485D01*
X224648628Y-195942914D01*
X224791485Y-196014342D01*
X225077200Y-196014342D01*
X225220057Y-195942914D01*
X225291485Y-195871485D01*
X225362914Y-195728628D01*
X225648628Y-194677200D02*
X227077199Y-194677200D01*
X225934342Y-195228628D02*
X226005771Y-195157200D01*
X226148628Y-195085771D01*
X226505771Y-195085771D01*
X226648628Y-195157200D01*
X226720057Y-195228628D01*
X226791485Y-195371485D01*
X226791485Y-195514342D01*
X226720057Y-195728628D01*
X225862914Y-196585771D01*
X226791485Y-196585771D01*
X228077199Y-195585771D02*
X228077199Y-196585771D01*
X227434342Y-195585771D02*
X227434342Y-196371485D01*
X227505771Y-196514342D01*
X227648628Y-196585771D01*
X227862914Y-196585771D01*
X228005771Y-196514342D01*
X228077199Y-196442914D01*
X228791485Y-196585771D02*
X228791485Y-195085771D01*
X228791485Y-195657200D02*
X228934342Y-195585771D01*
X229220057Y-195585771D01*
X229362914Y-195657200D01*
X229434342Y-195728628D01*
X229505771Y-195871485D01*
X229505771Y-196300057D01*
X229434342Y-196442914D01*
X229362914Y-196514342D01*
X229220057Y-196585771D01*
X228934342Y-196585771D01*
X228791485Y-196514342D01*
X230791485Y-195585771D02*
X230791485Y-196585771D01*
X230148628Y-195585771D02*
X230148628Y-196371485D01*
X230220057Y-196514342D01*
X230362914Y-196585771D01*
X230577199Y-196585771D01*
X230720057Y-196514342D01*
X230791485Y-196442914D01*
X231505771Y-195585771D02*
X231505771Y-196585771D01*
X231505771Y-195728628D02*
X231577199Y-195657200D01*
X231720057Y-195585771D01*
X231934342Y-195585771D01*
X232077199Y-195657200D01*
X232148628Y-195800057D01*
X232148628Y-196585771D01*
X232648628Y-195585771D02*
X233220057Y-195585771D01*
X232862914Y-195085771D02*
X232862914Y-196371485D01*
X232934342Y-196514342D01*
X233077200Y-196585771D01*
X233220057Y-196585771D01*
X234362914Y-195585771D02*
X234362914Y-196585771D01*
X233720057Y-195585771D02*
X233720057Y-196371485D01*
X233791485Y-196514342D01*
X233934342Y-196585771D01*
X234148628Y-196585771D01*
X234291485Y-196514342D01*
X234362914Y-196442914D01*
X235862914Y-196585771D02*
X235005771Y-196585771D01*
X235434342Y-196585771D02*
X235434342Y-195085771D01*
X235291485Y-195300057D01*
X235148628Y-195442914D01*
X235005771Y-195514342D01*
X236720057Y-195728628D02*
X236577199Y-195657200D01*
X236505771Y-195585771D01*
X236434342Y-195442914D01*
X236434342Y-195371485D01*
X236505771Y-195228628D01*
X236577199Y-195157200D01*
X236720057Y-195085771D01*
X237005771Y-195085771D01*
X237148628Y-195157200D01*
X237220057Y-195228628D01*
X237291485Y-195371485D01*
X237291485Y-195442914D01*
X237220057Y-195585771D01*
X237148628Y-195657200D01*
X237005771Y-195728628D01*
X236720057Y-195728628D01*
X236577199Y-195800057D01*
X236505771Y-195871485D01*
X236434342Y-196014342D01*
X236434342Y-196300057D01*
X236505771Y-196442914D01*
X236577199Y-196514342D01*
X236720057Y-196585771D01*
X237005771Y-196585771D01*
X237148628Y-196514342D01*
X237220057Y-196442914D01*
X237291485Y-196300057D01*
X237291485Y-196014342D01*
X237220057Y-195871485D01*
X237148628Y-195800057D01*
X237005771Y-195728628D01*
X237934342Y-196442914D02*
X238005771Y-196514342D01*
X237934342Y-196585771D01*
X237862914Y-196514342D01*
X237934342Y-196442914D01*
X237934342Y-196585771D01*
X238934342Y-195085771D02*
X239077199Y-195085771D01*
X239220057Y-195157200D01*
X239291485Y-195228628D01*
X239362914Y-195371485D01*
X239434342Y-195657200D01*
X239434342Y-196014342D01*
X239362914Y-196300057D01*
X239291485Y-196442914D01*
X239220057Y-196514342D01*
X239077199Y-196585771D01*
X238934342Y-196585771D01*
X238791485Y-196514342D01*
X238720057Y-196442914D01*
X238648628Y-196300057D01*
X238577199Y-196014342D01*
X238577199Y-195657200D01*
X238648628Y-195371485D01*
X238720057Y-195228628D01*
X238791485Y-195157200D01*
X238934342Y-195085771D01*
X240720057Y-195585771D02*
X240720057Y-196585771D01*
X240362914Y-195014342D02*
X240005771Y-196085771D01*
X240934342Y-196085771D01*
X241505771Y-196442914D02*
X241577199Y-196514342D01*
X241505771Y-196585771D01*
X241434342Y-196514342D01*
X241505771Y-196442914D01*
X241505771Y-196585771D01*
X243005771Y-196585771D02*
X242148628Y-196585771D01*
X242577199Y-196585771D02*
X242577199Y-195085771D01*
X242434342Y-195300057D01*
X242291485Y-195442914D01*
X242148628Y-195514342D01*
D10*
D11*
X177002200Y-191507200D02*
X285002200Y-191507200D01*
D10*
D12*
X264411485Y-193785771D02*
X263911485Y-193071485D01*
X263554342Y-193785771D02*
X263554342Y-192285771D01*
X264125771Y-192285771D01*
X264268628Y-192357200D01*
X264340057Y-192428628D01*
X264411485Y-192571485D01*
X264411485Y-192785771D01*
X264340057Y-192928628D01*
X264268628Y-193000057D01*
X264125771Y-193071485D01*
X263554342Y-193071485D01*
X265625771Y-193714342D02*
X265482914Y-193785771D01*
X265197200Y-193785771D01*
X265054342Y-193714342D01*
X264982914Y-193571485D01*
X264982914Y-193000057D01*
X265054342Y-192857200D01*
X265197200Y-192785771D01*
X265482914Y-192785771D01*
X265625771Y-192857200D01*
X265697200Y-193000057D01*
X265697200Y-193142914D01*
X264982914Y-193285771D01*
X266197200Y-192785771D02*
X266554342Y-193785771D01*
X266911485Y-192785771D01*
X267482914Y-193642914D02*
X267554342Y-193714342D01*
X267482914Y-193785771D01*
X267411485Y-193714342D01*
X267482914Y-193642914D01*
X267482914Y-193785771D01*
X267482914Y-192857200D02*
X267554342Y-192928628D01*
X267482914Y-193000057D01*
X267411485Y-192928628D01*
X267482914Y-192857200D01*
X267482914Y-193000057D01*
X270125771Y-193785771D02*
X269268628Y-193785771D01*
X269697200Y-193785771D02*
X269697200Y-192285771D01*
X269554342Y-192500057D01*
X269411485Y-192642914D01*
X269268628Y-192714342D01*
X270768628Y-193642914D02*
X270840057Y-193714342D01*
X270768628Y-193785771D01*
X270697200Y-193714342D01*
X270768628Y-193642914D01*
X270768628Y-193785771D01*
X271768628Y-192285771D02*
X271911485Y-192285771D01*
X272054342Y-192357200D01*
X272125771Y-192428628D01*
X272197200Y-192571485D01*
X272268628Y-192857200D01*
X272268628Y-193214342D01*
X272197200Y-193500057D01*
X272125771Y-193642914D01*
X272054342Y-193714342D01*
X271911485Y-193785771D01*
X271768628Y-193785771D01*
X271625771Y-193714342D01*
X271554342Y-193642914D01*
X271482914Y-193500057D01*
X271411485Y-193214342D01*
X271411485Y-192857200D01*
X271482914Y-192571485D01*
X271554342Y-192428628D01*
X271625771Y-192357200D01*
X271768628Y-192285771D01*
D10*
D11*
X178362914Y-193714342D02*
X178577200Y-193785771D01*
X178934342Y-193785771D01*
X179077200Y-193714342D01*
X179148628Y-193642914D01*
X179220057Y-193500057D01*
X179220057Y-193357200D01*
X179148628Y-193214342D01*
X179077200Y-193142914D01*
X178934342Y-193071485D01*
X178648628Y-193000057D01*
X178505771Y-192928628D01*
X178434342Y-192857200D01*
X178362914Y-192714342D01*
X178362914Y-192571485D01*
X178434342Y-192428628D01*
X178505771Y-192357200D01*
X178648628Y-192285771D01*
X179005771Y-192285771D01*
X179220057Y-192357200D01*
X179862914Y-193785771D02*
X179862914Y-192785771D01*
X179862914Y-192285771D02*
X179791485Y-192357200D01*
X179862914Y-192428628D01*
X179934342Y-192357200D01*
X179862914Y-192285771D01*
X179862914Y-192428628D01*
X180434342Y-192785771D02*
X181220057Y-192785771D01*
X180434342Y-193785771D01*
X181220057Y-193785771D01*
X182362914Y-193714342D02*
X182220057Y-193785771D01*
X181934342Y-193785771D01*
X181791485Y-193714342D01*
X181720057Y-193571485D01*
X181720057Y-193000057D01*
X181791485Y-192857200D01*
X181934342Y-192785771D01*
X182220057Y-192785771D01*
X182362914Y-192857200D01*
X182434342Y-193000057D01*
X182434342Y-193142914D01*
X181720057Y-193285771D01*
X183077200Y-193642914D02*
X183148628Y-193714342D01*
X183077200Y-193785771D01*
X183005771Y-193714342D01*
X183077200Y-193642914D01*
X183077200Y-193785771D01*
X183077200Y-192857200D02*
X183148628Y-192928628D01*
X183077200Y-193000057D01*
X183005771Y-192928628D01*
X183077200Y-192857200D01*
X183077200Y-193000057D01*
X184862914Y-193357200D02*
X185577200Y-193357200D01*
X184720057Y-193785771D02*
X185220057Y-192285771D01*
X185720057Y-193785771D01*
X186862914Y-192785771D02*
X186862914Y-193785771D01*
X186505771Y-192214342D02*
X186148628Y-193285771D01*
X187077200Y-193285771D01*
D10*
D11*
X263434342Y-196585771D02*
X263434342Y-195085771D01*
X264791485Y-196585771D02*
X264791485Y-195085771D01*
X264791485Y-196514342D02*
X264648628Y-196585771D01*
X264362914Y-196585771D01*
X264220057Y-196514342D01*
X264148628Y-196442914D01*
X264077200Y-196300057D01*
X264077200Y-195871485D01*
X264148628Y-195728628D01*
X264220057Y-195657200D01*
X264362914Y-195585771D01*
X264648628Y-195585771D01*
X264791485Y-195657200D01*
X265505771Y-196442914D02*
X265577200Y-196514342D01*
X265505771Y-196585771D01*
X265434342Y-196514342D01*
X265505771Y-196442914D01*
X265505771Y-196585771D01*
X265505771Y-195657200D02*
X265577200Y-195728628D01*
X265505771Y-195800057D01*
X265434342Y-195728628D01*
X265505771Y-195657200D01*
X265505771Y-195800057D01*
X268148628Y-196585771D02*
X267291485Y-196585771D01*
X267720057Y-196585771D02*
X267720057Y-195085771D01*
X267577200Y-195300057D01*
X267434342Y-195442914D01*
X267291485Y-195514342D01*
X269862914Y-195014342D02*
X268577200Y-196942914D01*
X271148628Y-196585771D02*
X270291485Y-196585771D01*
X270720057Y-196585771D02*
X270720057Y-195085771D01*
X270577200Y-195300057D01*
X270434342Y-195442914D01*
X270291485Y-195514342D01*
D10*
D11*
X177002200Y-187507200D02*
X285002200Y-187507200D01*
D10*
D13*
X178714580Y-188211961D02*
X179857438Y-188211961D01*
X179036009Y-190211961D02*
X179286009Y-188211961D01*
X180274104Y-190211961D02*
X180440771Y-188878628D01*
X180524104Y-188211961D02*
X180416961Y-188307200D01*
X180500295Y-188402438D01*
X180607438Y-188307200D01*
X180524104Y-188211961D01*
X180500295Y-188402438D01*
X181107438Y-188878628D02*
X181869342Y-188878628D01*
X181476485Y-188211961D02*
X181262200Y-189926247D01*
X181333628Y-190116723D01*
X181512200Y-190211961D01*
X181702676Y-190211961D01*
X182655057Y-190211961D02*
X182476485Y-190116723D01*
X182405057Y-189926247D01*
X182619342Y-188211961D01*
X184190771Y-190116723D02*
X183988390Y-190211961D01*
X183607438Y-190211961D01*
X183428866Y-190116723D01*
X183357438Y-189926247D01*
X183452676Y-189164342D01*
X183571723Y-188973866D01*
X183774104Y-188878628D01*
X184155057Y-188878628D01*
X184333628Y-188973866D01*
X184405057Y-189164342D01*
X184381247Y-189354819D01*
X183405057Y-189545295D01*
X185155057Y-190021485D02*
X185238390Y-190116723D01*
X185131247Y-190211961D01*
X185047914Y-190116723D01*
X185155057Y-190021485D01*
X185131247Y-190211961D01*
X185286009Y-188973866D02*
X185369342Y-189069104D01*
X185262200Y-189164342D01*
X185178866Y-189069104D01*
X185286009Y-188973866D01*
X185262200Y-189164342D01*
X188238390Y-188211961D02*
X188619342Y-188211961D01*
X188797914Y-188307200D01*
X188964580Y-188497676D01*
X189012200Y-188878628D01*
X188928866Y-189545295D01*
X188786009Y-189926247D01*
X188571723Y-190116723D01*
X188369342Y-190211961D01*
X187988390Y-190211961D01*
X187809819Y-190116723D01*
X187643152Y-189926247D01*
X187595533Y-189545295D01*
X187678866Y-188878628D01*
X187821723Y-188497676D01*
X188036009Y-188307200D01*
X188238390Y-188211961D01*
X189869342Y-188878628D02*
X189619342Y-190878628D01*
X189857438Y-188973866D02*
X190059819Y-188878628D01*
X190440771Y-188878628D01*
X190619342Y-188973866D01*
X190702676Y-189069104D01*
X190774104Y-189259580D01*
X190702676Y-189831009D01*
X190583628Y-190021485D01*
X190476485Y-190116723D01*
X190274104Y-190211961D01*
X189893152Y-190211961D01*
X189714580Y-190116723D01*
X191393152Y-188878628D02*
X192155057Y-188878628D01*
X191762200Y-188211961D02*
X191547914Y-189926247D01*
X191619342Y-190116723D01*
X191797914Y-190211961D01*
X191988390Y-190211961D01*
X192655057Y-190211961D02*
X192821723Y-188878628D01*
X192905057Y-188211961D02*
X192797914Y-188307200D01*
X192881247Y-188402438D01*
X192988390Y-188307200D01*
X192905057Y-188211961D01*
X192881247Y-188402438D01*
X194476485Y-190116723D02*
X194274104Y-190211961D01*
X193893152Y-190211961D01*
X193714580Y-190116723D01*
X193631247Y-190021485D01*
X193559819Y-189831009D01*
X193631247Y-189259580D01*
X193750295Y-189069104D01*
X193857438Y-188973866D01*
X194059819Y-188878628D01*
X194440771Y-188878628D01*
X194619342Y-188973866D01*
X196178866Y-190211961D02*
X196309819Y-189164342D01*
X196238390Y-188973866D01*
X196059819Y-188878628D01*
X195678866Y-188878628D01*
X195476485Y-188973866D01*
X196190771Y-190116723D02*
X195988390Y-190211961D01*
X195512200Y-190211961D01*
X195333628Y-190116723D01*
X195262200Y-189926247D01*
X195286009Y-189735771D01*
X195405057Y-189545295D01*
X195607438Y-189450057D01*
X196083628Y-189450057D01*
X196286009Y-189354819D01*
X197416961Y-190211961D02*
X197238390Y-190116723D01*
X197166961Y-189926247D01*
X197381247Y-188211961D01*
X198309819Y-189164342D02*
X198976485Y-189164342D01*
X199131247Y-190211961D02*
X198178866Y-190211961D01*
X198428866Y-188211961D01*
X199381247Y-188211961D01*
X199952676Y-188211961D02*
X200369342Y-190211961D01*
X201286009Y-188211961D01*
X201678866Y-189640533D02*
X202631247Y-189640533D01*
X201416961Y-190211961D02*
X202333628Y-188211961D01*
X202750295Y-190211961D01*
X206250295Y-190402438D02*
X206071723Y-190307200D01*
X205905057Y-190116723D01*
X205655057Y-189831009D01*
X205476485Y-189735771D01*
X205286009Y-189735771D01*
X205321723Y-190211961D02*
X205143152Y-190116723D01*
X204976485Y-189926247D01*
X204928866Y-189545295D01*
X205012200Y-188878628D01*
X205155057Y-188497676D01*
X205369342Y-188307200D01*
X205571723Y-188211961D01*
X205952676Y-188211961D01*
X206131247Y-188307200D01*
X206297914Y-188497676D01*
X206345533Y-188878628D01*
X206262200Y-189545295D01*
X206119342Y-189926247D01*
X205905057Y-190116723D01*
X205702676Y-190211961D01*
X205321723Y-190211961D01*
X206952676Y-190116723D02*
X207226485Y-190211961D01*
X207702676Y-190211961D01*
X207905057Y-190116723D01*
X208012200Y-190021485D01*
X208131247Y-189831009D01*
X208155057Y-189640533D01*
X208083628Y-189450057D01*
X208000295Y-189354819D01*
X207821723Y-189259580D01*
X207452676Y-189164342D01*
X207274104Y-189069104D01*
X207190771Y-188973866D01*
X207119342Y-188783390D01*
X207143152Y-188592914D01*
X207262200Y-188402438D01*
X207369342Y-188307200D01*
X207571723Y-188211961D01*
X208047914Y-188211961D01*
X208321723Y-188307200D01*
X209738390Y-189164342D02*
X209071723Y-189164342D01*
X208940771Y-190211961D02*
X209190771Y-188211961D01*
X210143152Y-188211961D01*
X210655057Y-190211961D02*
X210905057Y-188211961D01*
X211666961Y-188211961D01*
X211845533Y-188307200D01*
X211928866Y-188402438D01*
X212000295Y-188592914D01*
X211964580Y-188878628D01*
X211845533Y-189069104D01*
X211738390Y-189164342D01*
X211536009Y-189259580D01*
X210774104Y-189259580D01*
X212750295Y-189450057D02*
X214274104Y-189450057D01*
X215131247Y-190211961D02*
X215381247Y-188211961D01*
X215857438Y-188211961D01*
X216131247Y-188307200D01*
X216297914Y-188497676D01*
X216369342Y-188688152D01*
X216416961Y-189069104D01*
X216381247Y-189354819D01*
X216238390Y-189735771D01*
X216119342Y-189926247D01*
X215905057Y-190116723D01*
X215607438Y-190211961D01*
X215131247Y-190211961D01*
X217131247Y-190211961D02*
X217381247Y-188211961D01*
X217857438Y-188211961D01*
X218131247Y-188307200D01*
X218297914Y-188497676D01*
X218369342Y-188688152D01*
X218416961Y-189069104D01*
X218381247Y-189354819D01*
X218238390Y-189735771D01*
X218119342Y-189926247D01*
X217905057Y-190116723D01*
X217607438Y-190211961D01*
X217131247Y-190211961D01*
X221452676Y-189164342D02*
X220786009Y-189164342D01*
X220655057Y-190211961D02*
X220905057Y-188211961D01*
X221857438Y-188211961D01*
X222369342Y-190211961D02*
X222619342Y-188211961D01*
X223107438Y-189640533D01*
X223952676Y-188211961D01*
X223702676Y-190211961D01*
X225821723Y-190021485D02*
X225714580Y-190116723D01*
X225416961Y-190211961D01*
X225226485Y-190211961D01*
X224952676Y-190116723D01*
X224786009Y-189926247D01*
X224714580Y-189735771D01*
X224666961Y-189354819D01*
X224702676Y-189069104D01*
X224845533Y-188688152D01*
X224964580Y-188497676D01*
X225178866Y-188307200D01*
X225476485Y-188211961D01*
X225666961Y-188211961D01*
X225940771Y-188307200D01*
X226024104Y-188402438D01*
X226655057Y-190211961D02*
X226905057Y-188211961D01*
X227666961Y-188211961D01*
X227845533Y-188307200D01*
X227928866Y-188402438D01*
X228000295Y-188592914D01*
X227964580Y-188878628D01*
X227845533Y-189069104D01*
X227738390Y-189164342D01*
X227536009Y-189259580D01*
X226774104Y-189259580D01*
D10*
D11*
X178934342Y-185600057D02*
X178434342Y-185600057D01*
X178434342Y-186385771D02*
X178434342Y-184885771D01*
X179148628Y-184885771D01*
X179720057Y-186385771D02*
X179720057Y-185385771D01*
X179720057Y-184885771D02*
X179648628Y-184957200D01*
X179720057Y-185028628D01*
X179791485Y-184957200D01*
X179720057Y-184885771D01*
X179720057Y-185028628D01*
X180648628Y-186385771D02*
X180505771Y-186314342D01*
X180434342Y-186171485D01*
X180434342Y-184885771D01*
X181791485Y-186314342D02*
X181648628Y-186385771D01*
X181362914Y-186385771D01*
X181220057Y-186314342D01*
X181148628Y-186171485D01*
X181148628Y-185600057D01*
X181220057Y-185457200D01*
X181362914Y-185385771D01*
X181648628Y-185385771D01*
X181791485Y-185457200D01*
X181862914Y-185600057D01*
X181862914Y-185742914D01*
X181148628Y-185885771D01*
X182505771Y-186242914D02*
X182577200Y-186314342D01*
X182505771Y-186385771D01*
X182434342Y-186314342D01*
X182505771Y-186242914D01*
X182505771Y-186385771D01*
X182505771Y-185457200D02*
X182577200Y-185528628D01*
X182505771Y-185600057D01*
X182434342Y-185528628D01*
X182505771Y-185457200D01*
X182505771Y-185600057D01*
X185362914Y-186528628D02*
X185220057Y-186457200D01*
X185077200Y-186314342D01*
X184862914Y-186100057D01*
X184720057Y-186028628D01*
X184577200Y-186028628D01*
X184648628Y-186385771D02*
X184505771Y-186314342D01*
X184362914Y-186171485D01*
X184291485Y-185885771D01*
X184291485Y-185385771D01*
X184362914Y-185100057D01*
X184505771Y-184957200D01*
X184648628Y-184885771D01*
X184934342Y-184885771D01*
X185077200Y-184957200D01*
X185220057Y-185100057D01*
X185291485Y-185385771D01*
X185291485Y-185885771D01*
X185220057Y-186171485D01*
X185077200Y-186314342D01*
X184934342Y-186385771D01*
X184648628Y-186385771D01*
X185862914Y-186314342D02*
X186077200Y-186385771D01*
X186434342Y-186385771D01*
X186577200Y-186314342D01*
X186648628Y-186242914D01*
X186720057Y-186100057D01*
X186720057Y-185957200D01*
X186648628Y-185814342D01*
X186577200Y-185742914D01*
X186434342Y-185671485D01*
X186148628Y-185600057D01*
X186005771Y-185528628D01*
X185934342Y-185457200D01*
X185862914Y-185314342D01*
X185862914Y-185171485D01*
X185934342Y-185028628D01*
X186005771Y-184957200D01*
X186148628Y-184885771D01*
X186505771Y-184885771D01*
X186720057Y-184957200D01*
X187862914Y-185600057D02*
X187362914Y-185600057D01*
X187362914Y-186385771D02*
X187362914Y-184885771D01*
X188077200Y-184885771D01*
X188648628Y-186385771D02*
X188648628Y-184885771D01*
X189220057Y-184885771D01*
X189362914Y-184957200D01*
X189434342Y-185028628D01*
X189505771Y-185171485D01*
X189505771Y-185385771D01*
X189434342Y-185528628D01*
X189362914Y-185600057D01*
X189220057Y-185671485D01*
X188648628Y-185671485D01*
X190148628Y-185814342D02*
X191291485Y-185814342D01*
X192005771Y-186385771D02*
X192005771Y-184885771D01*
X192362914Y-184885771D01*
X192577200Y-184957200D01*
X192720057Y-185100057D01*
X192791485Y-185242914D01*
X192862914Y-185528628D01*
X192862914Y-185742914D01*
X192791485Y-186028628D01*
X192720057Y-186171485D01*
X192577200Y-186314342D01*
X192362914Y-186385771D01*
X192005771Y-186385771D01*
X193505771Y-186385771D02*
X193505771Y-184885771D01*
X193862914Y-184885771D01*
X194077200Y-184957200D01*
X194220057Y-185100057D01*
X194291485Y-185242914D01*
X194362914Y-185528628D01*
X194362914Y-185742914D01*
X194291485Y-186028628D01*
X194220057Y-186171485D01*
X194077200Y-186314342D01*
X193862914Y-186385771D01*
X193505771Y-186385771D01*
X194648628Y-186528628D02*
X195791485Y-186528628D01*
X196648628Y-185600057D02*
X196148628Y-185600057D01*
X196148628Y-186385771D02*
X196148628Y-184885771D01*
X196862914Y-184885771D01*
X197434342Y-186385771D02*
X197434342Y-184885771D01*
X197934342Y-185957200D01*
X198434342Y-184885771D01*
X198434342Y-186385771D01*
X200005771Y-186242914D02*
X199934342Y-186314342D01*
X199720057Y-186385771D01*
X199577200Y-186385771D01*
X199362914Y-186314342D01*
X199220057Y-186171485D01*
X199148628Y-186028628D01*
X199077200Y-185742914D01*
X199077200Y-185528628D01*
X199148628Y-185242914D01*
X199220057Y-185100057D01*
X199362914Y-184957200D01*
X199577200Y-184885771D01*
X199720057Y-184885771D01*
X199934342Y-184957200D01*
X200005771Y-185028628D01*
X200648628Y-186385771D02*
X200648628Y-184885771D01*
X201220057Y-184885771D01*
X201362914Y-184957200D01*
X201434342Y-185028628D01*
X201505771Y-185171485D01*
X201505771Y-185385771D01*
X201434342Y-185528628D01*
X201362914Y-185600057D01*
X201220057Y-185671485D01*
X200648628Y-185671485D01*
X202148628Y-186242914D02*
X202220057Y-186314342D01*
X202148628Y-186385771D01*
X202077200Y-186314342D01*
X202148628Y-186242914D01*
X202148628Y-186385771D01*
X202862914Y-186385771D02*
X202862914Y-184885771D01*
X203005771Y-185814342D02*
X203434342Y-186385771D01*
X203434342Y-185385771D02*
X202862914Y-185957200D01*
X204077200Y-186385771D02*
X204077200Y-185385771D01*
X204077200Y-184885771D02*
X204005771Y-184957200D01*
X204077200Y-185028628D01*
X204148628Y-184957200D01*
X204077200Y-184885771D01*
X204077200Y-185028628D01*
X205434342Y-186314342D02*
X205291485Y-186385771D01*
X205005771Y-186385771D01*
X204862914Y-186314342D01*
X204791485Y-186242914D01*
X204720057Y-186100057D01*
X204720057Y-185671485D01*
X204791485Y-185528628D01*
X204862914Y-185457200D01*
X205005771Y-185385771D01*
X205291485Y-185385771D01*
X205434342Y-185457200D01*
X206720057Y-186385771D02*
X206720057Y-185600057D01*
X206648628Y-185457200D01*
X206505771Y-185385771D01*
X206220057Y-185385771D01*
X206077200Y-185457200D01*
X206720057Y-186314342D02*
X206577200Y-186385771D01*
X206220057Y-186385771D01*
X206077200Y-186314342D01*
X206005771Y-186171485D01*
X206005771Y-186028628D01*
X206077200Y-185885771D01*
X206220057Y-185814342D01*
X206577200Y-185814342D01*
X206720057Y-185742914D01*
X208077200Y-186385771D02*
X208077200Y-184885771D01*
X208077200Y-186314342D02*
X207934342Y-186385771D01*
X207648628Y-186385771D01*
X207505771Y-186314342D01*
X207434342Y-186242914D01*
X207362914Y-186100057D01*
X207362914Y-185671485D01*
X207434342Y-185528628D01*
X207505771Y-185457200D01*
X207648628Y-185385771D01*
X207934342Y-185385771D01*
X208077200Y-185457200D01*
X208434342Y-186528628D02*
X209577200Y-186528628D01*
X209934342Y-185385771D02*
X209934342Y-186885771D01*
X209934342Y-185457200D02*
X210077200Y-185385771D01*
X210362914Y-185385771D01*
X210505771Y-185457200D01*
X210577200Y-185528628D01*
X210648628Y-185671485D01*
X210648628Y-186100057D01*
X210577200Y-186242914D01*
X210505771Y-186314342D01*
X210362914Y-186385771D01*
X210077200Y-186385771D01*
X209934342Y-186314342D01*
X211934342Y-186314342D02*
X211791485Y-186385771D01*
X211505771Y-186385771D01*
X211362914Y-186314342D01*
X211291485Y-186242914D01*
X211220057Y-186100057D01*
X211220057Y-185671485D01*
X211291485Y-185528628D01*
X211362914Y-185457200D01*
X211505771Y-185385771D01*
X211791485Y-185385771D01*
X211934342Y-185457200D01*
X212577200Y-186385771D02*
X212577200Y-184885771D01*
X212577200Y-185457200D02*
X212720057Y-185385771D01*
X213005771Y-185385771D01*
X213148628Y-185457200D01*
X213220057Y-185528628D01*
X213291485Y-185671485D01*
X213291485Y-186100057D01*
X213220057Y-186242914D01*
X213148628Y-186314342D01*
X213005771Y-186385771D01*
X212720057Y-186385771D01*
X212577200Y-186314342D01*
D10*
D11*
X177002200Y-181507200D02*
X285002200Y-181507200D01*
D10*
D11*
X178362914Y-183614342D02*
X178577200Y-183685771D01*
X178934342Y-183685771D01*
X179077200Y-183614342D01*
X179148628Y-183542914D01*
X179220057Y-183400057D01*
X179220057Y-183257200D01*
X179148628Y-183114342D01*
X179077200Y-183042914D01*
X178934342Y-182971485D01*
X178648628Y-182900057D01*
X178505771Y-182828628D01*
X178434342Y-182757200D01*
X178362914Y-182614342D01*
X178362914Y-182471485D01*
X178434342Y-182328628D01*
X178505771Y-182257200D01*
X178648628Y-182185771D01*
X179005771Y-182185771D01*
X179220057Y-182257200D01*
X179862914Y-183685771D02*
X179862914Y-182185771D01*
X180505771Y-183685771D02*
X180505771Y-182900057D01*
X180434342Y-182757200D01*
X180291485Y-182685771D01*
X180077200Y-182685771D01*
X179934342Y-182757200D01*
X179862914Y-182828628D01*
X181791485Y-183614342D02*
X181648628Y-183685771D01*
X181362914Y-183685771D01*
X181220057Y-183614342D01*
X181148628Y-183471485D01*
X181148628Y-182900057D01*
X181220057Y-182757200D01*
X181362914Y-182685771D01*
X181648628Y-182685771D01*
X181791485Y-182757200D01*
X181862914Y-182900057D01*
X181862914Y-183042914D01*
X181148628Y-183185771D01*
X183077200Y-183614342D02*
X182934342Y-183685771D01*
X182648628Y-183685771D01*
X182505771Y-183614342D01*
X182434342Y-183471485D01*
X182434342Y-182900057D01*
X182505771Y-182757200D01*
X182648628Y-182685771D01*
X182934342Y-182685771D01*
X183077200Y-182757200D01*
X183148628Y-182900057D01*
X183148628Y-183042914D01*
X182434342Y-183185771D01*
X183577200Y-182685771D02*
X184148628Y-182685771D01*
X183791485Y-182185771D02*
X183791485Y-183471485D01*
X183862914Y-183614342D01*
X184005771Y-183685771D01*
X184148628Y-183685771D01*
X184648628Y-183542914D02*
X184720057Y-183614342D01*
X184648628Y-183685771D01*
X184577200Y-183614342D01*
X184648628Y-183542914D01*
X184648628Y-183685771D01*
X184648628Y-182757200D02*
X184720057Y-182828628D01*
X184648628Y-182900057D01*
X184577200Y-182828628D01*
X184648628Y-182757200D01*
X184648628Y-182900057D01*
D10*
D12*
X178554342Y-180685771D02*
X178554342Y-179185771D01*
X179411485Y-180685771D02*
X178768628Y-179828628D01*
X179411485Y-179185771D02*
X178554342Y-180042914D01*
X180697200Y-180685771D02*
X180697200Y-179900057D01*
X180625771Y-179757200D01*
X180482914Y-179685771D01*
X180197200Y-179685771D01*
X180054342Y-179757200D01*
X180697200Y-180614342D02*
X180554342Y-180685771D01*
X180197200Y-180685771D01*
X180054342Y-180614342D01*
X179982914Y-180471485D01*
X179982914Y-180328628D01*
X180054342Y-180185771D01*
X180197200Y-180114342D01*
X180554342Y-180114342D01*
X180697200Y-180042914D01*
X181411485Y-180685771D02*
X181411485Y-179685771D01*
X181411485Y-179971485D02*
X181482914Y-179828628D01*
X181554342Y-179757200D01*
X181697200Y-179685771D01*
X181840057Y-179685771D01*
X182554342Y-180685771D02*
X182411485Y-180614342D01*
X182340057Y-180471485D01*
X182340057Y-179185771D01*
X183054342Y-180614342D02*
X183197200Y-180685771D01*
X183482914Y-180685771D01*
X183625771Y-180614342D01*
X183697200Y-180471485D01*
X183697200Y-180400057D01*
X183625771Y-180257200D01*
X183482914Y-180185771D01*
X183268628Y-180185771D01*
X183125771Y-180114342D01*
X183054342Y-179971485D01*
X183054342Y-179900057D01*
X183125771Y-179757200D01*
X183268628Y-179685771D01*
X183482914Y-179685771D01*
X183625771Y-179757200D01*
X184340057Y-180685771D02*
X184340057Y-179685771D01*
X184340057Y-179971485D02*
X184411485Y-179828628D01*
X184482914Y-179757200D01*
X184625771Y-179685771D01*
X184768628Y-179685771D01*
X185911485Y-179685771D02*
X185911485Y-180685771D01*
X185268628Y-179685771D02*
X185268628Y-180471485D01*
X185340057Y-180614342D01*
X185482914Y-180685771D01*
X185697200Y-180685771D01*
X185840057Y-180614342D01*
X185911485Y-180542914D01*
X186625771Y-180685771D02*
X186625771Y-179185771D01*
X187268628Y-180685771D02*
X187268628Y-179900057D01*
X187197200Y-179757200D01*
X187054342Y-179685771D01*
X186840057Y-179685771D01*
X186697200Y-179757200D01*
X186625771Y-179828628D01*
X188554342Y-180614342D02*
X188411485Y-180685771D01*
X188125771Y-180685771D01*
X187982914Y-180614342D01*
X187911485Y-180471485D01*
X187911485Y-179900057D01*
X187982914Y-179757200D01*
X188125771Y-179685771D01*
X188411485Y-179685771D01*
X188554342Y-179757200D01*
X188625771Y-179900057D01*
X188625771Y-180042914D01*
X187911485Y-180185771D01*
X190411485Y-180685771D02*
X190411485Y-179185771D01*
X191125771Y-179685771D02*
X191125771Y-180685771D01*
X191125771Y-179828628D02*
X191197200Y-179757200D01*
X191340057Y-179685771D01*
X191554342Y-179685771D01*
X191697200Y-179757200D01*
X191768628Y-179900057D01*
X191768628Y-180685771D01*
X192411485Y-180614342D02*
X192554342Y-180685771D01*
X192840057Y-180685771D01*
X192982914Y-180614342D01*
X193054342Y-180471485D01*
X193054342Y-180400057D01*
X192982914Y-180257200D01*
X192840057Y-180185771D01*
X192625771Y-180185771D01*
X192482914Y-180114342D01*
X192411485Y-179971485D01*
X192411485Y-179900057D01*
X192482914Y-179757200D01*
X192625771Y-179685771D01*
X192840057Y-179685771D01*
X192982914Y-179757200D01*
X193482914Y-179685771D02*
X194054342Y-179685771D01*
X193697200Y-179185771D02*
X193697200Y-180471485D01*
X193768628Y-180614342D01*
X193911485Y-180685771D01*
X194054342Y-180685771D01*
X194554342Y-180685771D02*
X194554342Y-179685771D01*
X194554342Y-179185771D02*
X194482914Y-179257200D01*
X194554342Y-179328628D01*
X194625771Y-179257200D01*
X194554342Y-179185771D01*
X194554342Y-179328628D01*
X195054342Y-179685771D02*
X195625771Y-179685771D01*
X195268628Y-179185771D02*
X195268628Y-180471485D01*
X195340057Y-180614342D01*
X195482914Y-180685771D01*
X195625771Y-180685771D01*
X196768628Y-179685771D02*
X196768628Y-180685771D01*
X196125771Y-179685771D02*
X196125771Y-180471485D01*
X196197200Y-180614342D01*
X196340057Y-180685771D01*
X196554342Y-180685771D01*
X196697200Y-180614342D01*
X196768628Y-180542914D01*
X197268628Y-179685771D02*
X197840057Y-179685771D01*
X197482914Y-179185771D02*
X197482914Y-180471485D01*
X197554342Y-180614342D01*
X197697200Y-180685771D01*
X197840057Y-180685771D01*
X198911485Y-180614342D02*
X198768628Y-180685771D01*
X198482914Y-180685771D01*
X198340057Y-180614342D01*
X198268628Y-180471485D01*
X198268628Y-179900057D01*
X198340057Y-179757200D01*
X198482914Y-179685771D01*
X198768628Y-179685771D01*
X198911485Y-179757200D01*
X198982914Y-179900057D01*
X198982914Y-180042914D01*
X198268628Y-180185771D01*
X200982914Y-180685771D02*
X200840057Y-180614342D01*
X200768628Y-180542914D01*
X200697200Y-180400057D01*
X200697200Y-179971485D01*
X200768628Y-179828628D01*
X200840057Y-179757200D01*
X200982914Y-179685771D01*
X201197200Y-179685771D01*
X201340057Y-179757200D01*
X201411485Y-179828628D01*
X201482914Y-179971485D01*
X201482914Y-180400057D01*
X201411485Y-180542914D01*
X201340057Y-180614342D01*
X201197200Y-180685771D01*
X200982914Y-180685771D01*
X201911485Y-179685771D02*
X202482914Y-179685771D01*
X202125771Y-180685771D02*
X202125771Y-179400057D01*
X202197200Y-179257200D01*
X202340057Y-179185771D01*
X202482914Y-179185771D01*
X203911485Y-179185771D02*
X204768628Y-179185771D01*
X204340057Y-180685771D02*
X204340057Y-179185771D01*
X205840057Y-180614342D02*
X205697200Y-180685771D01*
X205411485Y-180685771D01*
X205268628Y-180614342D01*
X205197200Y-180471485D01*
X205197200Y-179900057D01*
X205268628Y-179757200D01*
X205411485Y-179685771D01*
X205697200Y-179685771D01*
X205840057Y-179757200D01*
X205911485Y-179900057D01*
X205911485Y-180042914D01*
X205197200Y-180185771D01*
X207197200Y-180614342D02*
X207054342Y-180685771D01*
X206768628Y-180685771D01*
X206625771Y-180614342D01*
X206554342Y-180542914D01*
X206482914Y-180400057D01*
X206482914Y-179971485D01*
X206554342Y-179828628D01*
X206625771Y-179757200D01*
X206768628Y-179685771D01*
X207054342Y-179685771D01*
X207197200Y-179757200D01*
X207840057Y-180685771D02*
X207840057Y-179185771D01*
X208482914Y-180685771D02*
X208482914Y-179900057D01*
X208411485Y-179757200D01*
X208268628Y-179685771D01*
X208054342Y-179685771D01*
X207911485Y-179757200D01*
X207840057Y-179828628D01*
X209197200Y-179685771D02*
X209197200Y-180685771D01*
X209197200Y-179828628D02*
X209268628Y-179757200D01*
X209411485Y-179685771D01*
X209625771Y-179685771D01*
X209768628Y-179757200D01*
X209840057Y-179900057D01*
X209840057Y-180685771D01*
X210768628Y-180685771D02*
X210625771Y-180614342D01*
X210554342Y-180542914D01*
X210482914Y-180400057D01*
X210482914Y-179971485D01*
X210554342Y-179828628D01*
X210625771Y-179757200D01*
X210768628Y-179685771D01*
X210982914Y-179685771D01*
X211125771Y-179757200D01*
X211197200Y-179828628D01*
X211268628Y-179971485D01*
X211268628Y-180400057D01*
X211197200Y-180542914D01*
X211125771Y-180614342D01*
X210982914Y-180685771D01*
X210768628Y-180685771D01*
X212125771Y-180685771D02*
X211982914Y-180614342D01*
X211911485Y-180471485D01*
X211911485Y-179185771D01*
X212911485Y-180685771D02*
X212768628Y-180614342D01*
X212697200Y-180542914D01*
X212625771Y-180400057D01*
X212625771Y-179971485D01*
X212697200Y-179828628D01*
X212768628Y-179757200D01*
X212911485Y-179685771D01*
X213125771Y-179685771D01*
X213268628Y-179757200D01*
X213340057Y-179828628D01*
X213411485Y-179971485D01*
X213411485Y-180400057D01*
X213340057Y-180542914D01*
X213268628Y-180614342D01*
X213125771Y-180685771D01*
X212911485Y-180685771D01*
X214697200Y-179685771D02*
X214697200Y-180900057D01*
X214625771Y-181042914D01*
X214554342Y-181114342D01*
X214411485Y-181185771D01*
X214197200Y-181185771D01*
X214054342Y-181114342D01*
X214697200Y-180614342D02*
X214554342Y-180685771D01*
X214268628Y-180685771D01*
X214125771Y-180614342D01*
X214054342Y-180542914D01*
X213982914Y-180400057D01*
X213982914Y-179971485D01*
X214054342Y-179828628D01*
X214125771Y-179757200D01*
X214268628Y-179685771D01*
X214554342Y-179685771D01*
X214697200Y-179757200D01*
X215268628Y-179685771D02*
X215625771Y-180685771D01*
X215982914Y-179685771D02*
X215625771Y-180685771D01*
X215482914Y-181042914D01*
X215411485Y-181114342D01*
X215268628Y-181185771D01*
X218125771Y-181257200D02*
X218054342Y-181185771D01*
X217911485Y-180971485D01*
X217840057Y-180828628D01*
X217768628Y-180614342D01*
X217697200Y-180257200D01*
X217697200Y-179971485D01*
X217768628Y-179614342D01*
X217840057Y-179400057D01*
X217911485Y-179257200D01*
X218054342Y-179042914D01*
X218125771Y-178971485D01*
X218697200Y-180685771D02*
X218697200Y-179185771D01*
X219554342Y-180685771D02*
X218911485Y-179828628D01*
X219554342Y-179185771D02*
X218697200Y-180042914D01*
X220197200Y-180685771D02*
X220197200Y-179185771D01*
X220697200Y-179185771D02*
X221554342Y-179185771D01*
X221125771Y-180685771D02*
X221125771Y-179185771D01*
X221911485Y-181257200D02*
X221982914Y-181185771D01*
X222125771Y-180971485D01*
X222197200Y-180828628D01*
X222268628Y-180614342D01*
X222340057Y-180257200D01*
X222340057Y-179971485D01*
X222268628Y-179614342D01*
X222197200Y-179400057D01*
X222125771Y-179257200D01*
X221982914Y-179042914D01*
X221911485Y-178971485D01*
D10*
D11*
X178434342Y-177685771D02*
X178434342Y-176185771D01*
X179148628Y-176685771D02*
X179148628Y-177685771D01*
X179148628Y-176828628D02*
X179220057Y-176757200D01*
X179362914Y-176685771D01*
X179577200Y-176685771D01*
X179720057Y-176757200D01*
X179791485Y-176900057D01*
X179791485Y-177685771D01*
X180434342Y-177614342D02*
X180577200Y-177685771D01*
X180862914Y-177685771D01*
X181005771Y-177614342D01*
X181077200Y-177471485D01*
X181077200Y-177400057D01*
X181005771Y-177257200D01*
X180862914Y-177185771D01*
X180648628Y-177185771D01*
X180505771Y-177114342D01*
X180434342Y-176971485D01*
X180434342Y-176900057D01*
X180505771Y-176757200D01*
X180648628Y-176685771D01*
X180862914Y-176685771D01*
X181005771Y-176757200D01*
X181505771Y-176685771D02*
X182077200Y-176685771D01*
X181720057Y-176185771D02*
X181720057Y-177471485D01*
X181791485Y-177614342D01*
X181934342Y-177685771D01*
X182077200Y-177685771D01*
X182577200Y-177685771D02*
X182577200Y-176685771D01*
X182577200Y-176185771D02*
X182505771Y-176257200D01*
X182577200Y-176328628D01*
X182648628Y-176257200D01*
X182577200Y-176185771D01*
X182577200Y-176328628D01*
X183077200Y-176685771D02*
X183648628Y-176685771D01*
X183291485Y-176185771D02*
X183291485Y-177471485D01*
X183362914Y-177614342D01*
X183505771Y-177685771D01*
X183648628Y-177685771D01*
X184791485Y-176685771D02*
X184791485Y-177685771D01*
X184148628Y-176685771D02*
X184148628Y-177471485D01*
X184220057Y-177614342D01*
X184362914Y-177685771D01*
X184577200Y-177685771D01*
X184720057Y-177614342D01*
X184791485Y-177542914D01*
X185291485Y-176685771D02*
X185862914Y-176685771D01*
X185505771Y-176185771D02*
X185505771Y-177471485D01*
X185577200Y-177614342D01*
X185720057Y-177685771D01*
X185862914Y-177685771D01*
X186934342Y-177614342D02*
X186791485Y-177685771D01*
X186505771Y-177685771D01*
X186362914Y-177614342D01*
X186291485Y-177471485D01*
X186291485Y-176900057D01*
X186362914Y-176757200D01*
X186505771Y-176685771D01*
X186791485Y-176685771D01*
X186934342Y-176757200D01*
X187005771Y-176900057D01*
X187005771Y-177042914D01*
X186291485Y-177185771D01*
X188577200Y-176685771D02*
X189148628Y-176685771D01*
X188791485Y-177685771D02*
X188791485Y-176400057D01*
X188862914Y-176257200D01*
X189005771Y-176185771D01*
X189148628Y-176185771D01*
X189862914Y-177685771D02*
X189720057Y-177614342D01*
X189648628Y-177542914D01*
X189577200Y-177400057D01*
X189577200Y-176971485D01*
X189648628Y-176828628D01*
X189720057Y-176757200D01*
X189862914Y-176685771D01*
X190077200Y-176685771D01*
X190220057Y-176757200D01*
X190291485Y-176828628D01*
X190362914Y-176971485D01*
X190362914Y-177400057D01*
X190291485Y-177542914D01*
X190220057Y-177614342D01*
X190077200Y-177685771D01*
X189862914Y-177685771D01*
X191005771Y-177685771D02*
X191005771Y-176685771D01*
X191005771Y-176971485D02*
X191077200Y-176828628D01*
X191148628Y-176757200D01*
X191291485Y-176685771D01*
X191434342Y-176685771D01*
X193077200Y-177685771D02*
X193077200Y-176185771D01*
X193434342Y-176185771D01*
X193648628Y-176257200D01*
X193791485Y-176400057D01*
X193862914Y-176542914D01*
X193934342Y-176828628D01*
X193934342Y-177042914D01*
X193862914Y-177328628D01*
X193791485Y-177471485D01*
X193648628Y-177614342D01*
X193434342Y-177685771D01*
X193077200Y-177685771D01*
X195220057Y-177685771D02*
X195220057Y-176900057D01*
X195148628Y-176757200D01*
X195005771Y-176685771D01*
X194720057Y-176685771D01*
X194577200Y-176757200D01*
X195220057Y-177614342D02*
X195077200Y-177685771D01*
X194720057Y-177685771D01*
X194577200Y-177614342D01*
X194505771Y-177471485D01*
X194505771Y-177328628D01*
X194577200Y-177185771D01*
X194720057Y-177114342D01*
X195077200Y-177114342D01*
X195220057Y-177042914D01*
X195720057Y-176685771D02*
X196291485Y-176685771D01*
X195934342Y-176185771D02*
X195934342Y-177471485D01*
X196005771Y-177614342D01*
X196148628Y-177685771D01*
X196291485Y-177685771D01*
X197434342Y-177685771D02*
X197434342Y-176900057D01*
X197362914Y-176757200D01*
X197220057Y-176685771D01*
X196934342Y-176685771D01*
X196791485Y-176757200D01*
X197434342Y-177614342D02*
X197291485Y-177685771D01*
X196934342Y-177685771D01*
X196791485Y-177614342D01*
X196720057Y-177471485D01*
X196720057Y-177328628D01*
X196791485Y-177185771D01*
X196934342Y-177114342D01*
X197291485Y-177114342D01*
X197434342Y-177042914D01*
X199291485Y-177685771D02*
X199291485Y-176185771D01*
X199862914Y-176185771D01*
X200005771Y-176257200D01*
X200077200Y-176328628D01*
X200148628Y-176471485D01*
X200148628Y-176685771D01*
X200077200Y-176828628D01*
X200005771Y-176900057D01*
X199862914Y-176971485D01*
X199291485Y-176971485D01*
X200791485Y-177685771D02*
X200791485Y-176685771D01*
X200791485Y-176971485D02*
X200862914Y-176828628D01*
X200934342Y-176757200D01*
X201077200Y-176685771D01*
X201220057Y-176685771D01*
X201934342Y-177685771D02*
X201791485Y-177614342D01*
X201720057Y-177542914D01*
X201648628Y-177400057D01*
X201648628Y-176971485D01*
X201720057Y-176828628D01*
X201791485Y-176757200D01*
X201934342Y-176685771D01*
X202148628Y-176685771D01*
X202291485Y-176757200D01*
X202362914Y-176828628D01*
X202434342Y-176971485D01*
X202434342Y-177400057D01*
X202362914Y-177542914D01*
X202291485Y-177614342D01*
X202148628Y-177685771D01*
X201934342Y-177685771D01*
X203720057Y-177614342D02*
X203577200Y-177685771D01*
X203291485Y-177685771D01*
X203148628Y-177614342D01*
X203077200Y-177542914D01*
X203005771Y-177400057D01*
X203005771Y-176971485D01*
X203077200Y-176828628D01*
X203148628Y-176757200D01*
X203291485Y-176685771D01*
X203577200Y-176685771D01*
X203720057Y-176757200D01*
X204934342Y-177614342D02*
X204791485Y-177685771D01*
X204505771Y-177685771D01*
X204362914Y-177614342D01*
X204291485Y-177471485D01*
X204291485Y-176900057D01*
X204362914Y-176757200D01*
X204505771Y-176685771D01*
X204791485Y-176685771D01*
X204934342Y-176757200D01*
X205005771Y-176900057D01*
X205005771Y-177042914D01*
X204291485Y-177185771D01*
X205577200Y-177614342D02*
X205720057Y-177685771D01*
X206005771Y-177685771D01*
X206148628Y-177614342D01*
X206220057Y-177471485D01*
X206220057Y-177400057D01*
X206148628Y-177257200D01*
X206005771Y-177185771D01*
X205791485Y-177185771D01*
X205648628Y-177114342D01*
X205577200Y-176971485D01*
X205577200Y-176900057D01*
X205648628Y-176757200D01*
X205791485Y-176685771D01*
X206005771Y-176685771D01*
X206148628Y-176757200D01*
X206791485Y-177614342D02*
X206934342Y-177685771D01*
X207220057Y-177685771D01*
X207362914Y-177614342D01*
X207434342Y-177471485D01*
X207434342Y-177400057D01*
X207362914Y-177257200D01*
X207220057Y-177185771D01*
X207005771Y-177185771D01*
X206862914Y-177114342D01*
X206791485Y-176971485D01*
X206791485Y-176900057D01*
X206862914Y-176757200D01*
X207005771Y-176685771D01*
X207220057Y-176685771D01*
X207362914Y-176757200D01*
X208077200Y-177685771D02*
X208077200Y-176685771D01*
X208077200Y-176185771D02*
X208005771Y-176257200D01*
X208077200Y-176328628D01*
X208148628Y-176257200D01*
X208077200Y-176185771D01*
X208077200Y-176328628D01*
X208791485Y-176685771D02*
X208791485Y-177685771D01*
X208791485Y-176828628D02*
X208862914Y-176757200D01*
X209005771Y-176685771D01*
X209220057Y-176685771D01*
X209362914Y-176757200D01*
X209434342Y-176900057D01*
X209434342Y-177685771D01*
X210791485Y-176685771D02*
X210791485Y-177900057D01*
X210720057Y-178042914D01*
X210648628Y-178114342D01*
X210505771Y-178185771D01*
X210291485Y-178185771D01*
X210148628Y-178114342D01*
X210791485Y-177614342D02*
X210648628Y-177685771D01*
X210362914Y-177685771D01*
X210220057Y-177614342D01*
X210148628Y-177542914D01*
X210077200Y-177400057D01*
X210077200Y-176971485D01*
X210148628Y-176828628D01*
X210220057Y-176757200D01*
X210362914Y-176685771D01*
X210648628Y-176685771D01*
X210791485Y-176757200D01*
X213291485Y-177685771D02*
X213291485Y-176900057D01*
X213220057Y-176757200D01*
X213077200Y-176685771D01*
X212791485Y-176685771D01*
X212648628Y-176757200D01*
X213291485Y-177614342D02*
X213148628Y-177685771D01*
X212791485Y-177685771D01*
X212648628Y-177614342D01*
X212577200Y-177471485D01*
X212577200Y-177328628D01*
X212648628Y-177185771D01*
X212791485Y-177114342D01*
X213148628Y-177114342D01*
X213291485Y-177042914D01*
X214005771Y-176685771D02*
X214005771Y-177685771D01*
X214005771Y-176828628D02*
X214077200Y-176757200D01*
X214220057Y-176685771D01*
X214434342Y-176685771D01*
X214577200Y-176757200D01*
X214648628Y-176900057D01*
X214648628Y-177685771D01*
X216005771Y-177685771D02*
X216005771Y-176185771D01*
X216005771Y-177614342D02*
X215862914Y-177685771D01*
X215577200Y-177685771D01*
X215434342Y-177614342D01*
X215362914Y-177542914D01*
X215291485Y-177400057D01*
X215291485Y-176971485D01*
X215362914Y-176828628D01*
X215434342Y-176757200D01*
X215577200Y-176685771D01*
X215862914Y-176685771D01*
X216005771Y-176757200D01*
X217862914Y-176900057D02*
X218362914Y-176900057D01*
X218577200Y-177685771D02*
X217862914Y-177685771D01*
X217862914Y-176185771D01*
X218577200Y-176185771D01*
X219434342Y-177685771D02*
X219291485Y-177614342D01*
X219220057Y-177471485D01*
X219220057Y-176185771D01*
X220577200Y-177614342D02*
X220434342Y-177685771D01*
X220148628Y-177685771D01*
X220005771Y-177614342D01*
X219934342Y-177471485D01*
X219934342Y-176900057D01*
X220005771Y-176757200D01*
X220148628Y-176685771D01*
X220434342Y-176685771D01*
X220577200Y-176757200D01*
X220648628Y-176900057D01*
X220648628Y-177042914D01*
X219934342Y-177185771D01*
X221934342Y-177614342D02*
X221791485Y-177685771D01*
X221505771Y-177685771D01*
X221362914Y-177614342D01*
X221291485Y-177542914D01*
X221220057Y-177400057D01*
X221220057Y-176971485D01*
X221291485Y-176828628D01*
X221362914Y-176757200D01*
X221505771Y-176685771D01*
X221791485Y-176685771D01*
X221934342Y-176757200D01*
X222362914Y-176685771D02*
X222934342Y-176685771D01*
X222577200Y-176185771D02*
X222577200Y-177471485D01*
X222648628Y-177614342D01*
X222791485Y-177685771D01*
X222934342Y-177685771D01*
X223434342Y-177685771D02*
X223434342Y-176685771D01*
X223434342Y-176971485D02*
X223505771Y-176828628D01*
X223577200Y-176757200D01*
X223720057Y-176685771D01*
X223862914Y-176685771D01*
X224577200Y-177685771D02*
X224434342Y-177614342D01*
X224362914Y-177542914D01*
X224291485Y-177400057D01*
X224291485Y-176971485D01*
X224362914Y-176828628D01*
X224434342Y-176757200D01*
X224577200Y-176685771D01*
X224791485Y-176685771D01*
X224934342Y-176757200D01*
X225005771Y-176828628D01*
X225077200Y-176971485D01*
X225077200Y-177400057D01*
X225005771Y-177542914D01*
X224934342Y-177614342D01*
X224791485Y-177685771D01*
X224577200Y-177685771D01*
X225720057Y-176685771D02*
X225720057Y-177685771D01*
X225720057Y-176828628D02*
X225791485Y-176757200D01*
X225934342Y-176685771D01*
X226148628Y-176685771D01*
X226291485Y-176757200D01*
X226362914Y-176900057D01*
X226362914Y-177685771D01*
X227077200Y-177685771D02*
X227077200Y-176685771D01*
X227077200Y-176185771D02*
X227005771Y-176257200D01*
X227077200Y-176328628D01*
X227148628Y-176257200D01*
X227077200Y-176185771D01*
X227077200Y-176328628D01*
X228434342Y-177614342D02*
X228291485Y-177685771D01*
X228005771Y-177685771D01*
X227862914Y-177614342D01*
X227791485Y-177542914D01*
X227720057Y-177400057D01*
X227720057Y-176971485D01*
X227791485Y-176828628D01*
X227862914Y-176757200D01*
X228005771Y-176685771D01*
X228291485Y-176685771D01*
X228434342Y-176757200D01*
X229005771Y-177614342D02*
X229148628Y-177685771D01*
X229434342Y-177685771D01*
X229577200Y-177614342D01*
X229648628Y-177471485D01*
X229648628Y-177400057D01*
X229577200Y-177257200D01*
X229434342Y-177185771D01*
X229220057Y-177185771D01*
X229077200Y-177114342D01*
X229005771Y-176971485D01*
X229005771Y-176900057D01*
X229077200Y-176757200D01*
X229220057Y-176685771D01*
X229434342Y-176685771D01*
X229577200Y-176757200D01*
X231862914Y-178257200D02*
X231791485Y-178185771D01*
X231648628Y-177971485D01*
X231577200Y-177828628D01*
X231505771Y-177614342D01*
X231434342Y-177257200D01*
X231434342Y-176971485D01*
X231505771Y-176614342D01*
X231577200Y-176400057D01*
X231648628Y-176257200D01*
X231791485Y-176042914D01*
X231862914Y-175971485D01*
X232434342Y-177685771D02*
X232434342Y-176185771D01*
X233148628Y-177685771D02*
X233148628Y-176185771D01*
X233720057Y-176185771D01*
X233862914Y-176257200D01*
X233934342Y-176328628D01*
X234005771Y-176471485D01*
X234005771Y-176685771D01*
X233934342Y-176828628D01*
X233862914Y-176900057D01*
X233720057Y-176971485D01*
X233148628Y-176971485D01*
X234648628Y-176900057D02*
X235148628Y-176900057D01*
X235362914Y-177685771D02*
X234648628Y-177685771D01*
X234648628Y-176185771D01*
X235362914Y-176185771D01*
X235862914Y-178257200D02*
X235934342Y-178185771D01*
X236077200Y-177971485D01*
X236148628Y-177828628D01*
X236220057Y-177614342D01*
X236291485Y-177257200D01*
X236291485Y-176971485D01*
X236220057Y-176614342D01*
X236148628Y-176400057D01*
X236077200Y-176257200D01*
X235934342Y-176042914D01*
X235862914Y-175971485D01*
D10*
D11*
X179148628Y-174685771D02*
X178434342Y-174685771D01*
X178434342Y-173185771D01*
X180291485Y-173685771D02*
X180291485Y-174685771D01*
X179648628Y-173685771D02*
X179648628Y-174471485D01*
X179720057Y-174614342D01*
X179862914Y-174685771D01*
X180077200Y-174685771D01*
X180220057Y-174614342D01*
X180291485Y-174542914D01*
X181005771Y-174685771D02*
X181005771Y-173685771D01*
X181005771Y-173185771D02*
X180934342Y-173257200D01*
X181005771Y-173328628D01*
X181077200Y-173257200D01*
X181005771Y-173185771D01*
X181005771Y-173328628D01*
X181648628Y-174614342D02*
X181791485Y-174685771D01*
X182077200Y-174685771D01*
X182220057Y-174614342D01*
X182291485Y-174471485D01*
X182291485Y-174400057D01*
X182220057Y-174257200D01*
X182077200Y-174185771D01*
X181862914Y-174185771D01*
X181720057Y-174114342D01*
X181648628Y-173971485D01*
X181648628Y-173900057D01*
X181720057Y-173757200D01*
X181862914Y-173685771D01*
X182077200Y-173685771D01*
X182220057Y-173757200D01*
X184005771Y-174257200D02*
X184720057Y-174257200D01*
X183862914Y-174685771D02*
X184362914Y-173185771D01*
X184862914Y-174685771D01*
X185362914Y-174685771D02*
X185362914Y-173685771D01*
X185362914Y-173971485D02*
X185434342Y-173828628D01*
X185505771Y-173757200D01*
X185648628Y-173685771D01*
X185791485Y-173685771D01*
X186934342Y-174685771D02*
X186934342Y-173185771D01*
X186934342Y-174614342D02*
X186791485Y-174685771D01*
X186505771Y-174685771D01*
X186362914Y-174614342D01*
X186291485Y-174542914D01*
X186220057Y-174400057D01*
X186220057Y-173971485D01*
X186291485Y-173828628D01*
X186362914Y-173757200D01*
X186505771Y-173685771D01*
X186791485Y-173685771D01*
X186934342Y-173757200D01*
X187648628Y-174685771D02*
X187648628Y-173685771D01*
X187648628Y-173185771D02*
X187577200Y-173257200D01*
X187648628Y-173328628D01*
X187720057Y-173257200D01*
X187648628Y-173185771D01*
X187648628Y-173328628D01*
X188577200Y-174685771D02*
X188434342Y-174614342D01*
X188362914Y-174471485D01*
X188362914Y-173185771D01*
X189791485Y-174685771D02*
X189791485Y-173900057D01*
X189720057Y-173757200D01*
X189577200Y-173685771D01*
X189291485Y-173685771D01*
X189148628Y-173757200D01*
X189791485Y-174614342D02*
X189648628Y-174685771D01*
X189291485Y-174685771D01*
X189148628Y-174614342D01*
X189077200Y-174471485D01*
X189077200Y-174328628D01*
X189148628Y-174185771D01*
X189291485Y-174114342D01*
X189648628Y-174114342D01*
X189791485Y-174042914D01*
D10*
D11*
X197002200Y-191507200D02*
X197002200Y-194507200D01*
D10*
D11*
X261002200Y-191507200D02*
X261002200Y-198007200D01*
%TO.C,C602*%
G36*
G01*
X150700000Y-48170000D02*
X150700000Y-47830000D01*
G75*
G02*
X150840000Y-47690000I140000J0D01*
G01*
X151120000Y-47690000D01*
G75*
G02*
X151260000Y-47830000I0J-140000D01*
G01*
X151260000Y-48170000D01*
G75*
G02*
X151120000Y-48310000I-140000J0D01*
G01*
X150840000Y-48310000D01*
G75*
G02*
X150700000Y-48170000I0J140000D01*
G01*
G37*
G36*
G01*
X149740000Y-48170000D02*
X149740000Y-47830000D01*
G75*
G02*
X149880000Y-47690000I140000J0D01*
G01*
X150160000Y-47690000D01*
G75*
G02*
X150300000Y-47830000I0J-140000D01*
G01*
X150300000Y-48170000D01*
G75*
G02*
X150160000Y-48310000I-140000J0D01*
G01*
X149880000Y-48310000D01*
G75*
G02*
X149740000Y-48170000I0J140000D01*
G01*
G37*
%TD*%
%TO.C,C601*%
G36*
G01*
X152830000Y-47700000D02*
X153170000Y-47700000D01*
G75*
G02*
X153310000Y-47840000I0J-140000D01*
G01*
X153310000Y-48120000D01*
G75*
G02*
X153170000Y-48260000I-140000J0D01*
G01*
X152830000Y-48260000D01*
G75*
G02*
X152690000Y-48120000I0J140000D01*
G01*
X152690000Y-47840000D01*
G75*
G02*
X152830000Y-47700000I140000J0D01*
G01*
G37*
G36*
G01*
X152830000Y-46740000D02*
X153170000Y-46740000D01*
G75*
G02*
X153310000Y-46880000I0J-140000D01*
G01*
X153310000Y-47160000D01*
G75*
G02*
X153170000Y-47300000I-140000J0D01*
G01*
X152830000Y-47300000D01*
G75*
G02*
X152690000Y-47160000I0J140000D01*
G01*
X152690000Y-46880000D01*
G75*
G02*
X152830000Y-46740000I140000J0D01*
G01*
G37*
%TD*%
%TO.C,R210*%
G36*
G01*
X142100000Y-41924997D02*
X142100000Y-44075003D01*
G75*
G02*
X141850003Y-44325000I-249997J0D01*
G01*
X141224997Y-44325000D01*
G75*
G02*
X140975000Y-44075003I0J249997D01*
G01*
X140975000Y-41924997D01*
G75*
G02*
X141224997Y-41675000I249997J0D01*
G01*
X141850003Y-41675000D01*
G75*
G02*
X142100000Y-41924997I0J-249997D01*
G01*
G37*
G36*
G01*
X145025000Y-41924997D02*
X145025000Y-44075003D01*
G75*
G02*
X144775003Y-44325000I-249997J0D01*
G01*
X144149997Y-44325000D01*
G75*
G02*
X143900000Y-44075003I0J249997D01*
G01*
X143900000Y-41924997D01*
G75*
G02*
X144149997Y-41675000I249997J0D01*
G01*
X144775003Y-41675000D01*
G75*
G02*
X145025000Y-41924997I0J-249997D01*
G01*
G37*
%TD*%
%TO.C,R207*%
G36*
G01*
X133100000Y-45924997D02*
X133100000Y-48075003D01*
G75*
G02*
X132850003Y-48325000I-249997J0D01*
G01*
X132224997Y-48325000D01*
G75*
G02*
X131975000Y-48075003I0J249997D01*
G01*
X131975000Y-45924997D01*
G75*
G02*
X132224997Y-45675000I249997J0D01*
G01*
X132850003Y-45675000D01*
G75*
G02*
X133100000Y-45924997I0J-249997D01*
G01*
G37*
G36*
G01*
X136025000Y-45924997D02*
X136025000Y-48075003D01*
G75*
G02*
X135775003Y-48325000I-249997J0D01*
G01*
X135149997Y-48325000D01*
G75*
G02*
X134900000Y-48075003I0J249997D01*
G01*
X134900000Y-45924997D01*
G75*
G02*
X135149997Y-45675000I249997J0D01*
G01*
X135775003Y-45675000D01*
G75*
G02*
X136025000Y-45924997I0J-249997D01*
G01*
G37*
%TD*%
%TO.C,R204*%
G36*
G01*
X133100000Y-41924997D02*
X133100000Y-44075003D01*
G75*
G02*
X132850003Y-44325000I-249997J0D01*
G01*
X132224997Y-44325000D01*
G75*
G02*
X131975000Y-44075003I0J249997D01*
G01*
X131975000Y-41924997D01*
G75*
G02*
X132224997Y-41675000I249997J0D01*
G01*
X132850003Y-41675000D01*
G75*
G02*
X133100000Y-41924997I0J-249997D01*
G01*
G37*
G36*
G01*
X136025000Y-41924997D02*
X136025000Y-44075003D01*
G75*
G02*
X135775003Y-44325000I-249997J0D01*
G01*
X135149997Y-44325000D01*
G75*
G02*
X134900000Y-44075003I0J249997D01*
G01*
X134900000Y-41924997D01*
G75*
G02*
X135149997Y-41675000I249997J0D01*
G01*
X135775003Y-41675000D01*
G75*
G02*
X136025000Y-41924997I0J-249997D01*
G01*
G37*
%TD*%
D14*
%TO.C,X401*%
X154500000Y-77350000D03*
X154500000Y-76550000D03*
X154500000Y-75750000D03*
X154500000Y-74950000D03*
X154500000Y-74150000D03*
X154500000Y-73350000D03*
X154500000Y-72550000D03*
X154500000Y-71750000D03*
X154500000Y-70950000D03*
X154500000Y-70150000D03*
X154500000Y-69350000D03*
X154500000Y-68550000D03*
X154500000Y-67750000D03*
X154500000Y-66950000D03*
X154500000Y-66150000D03*
X154500000Y-65350000D03*
X154500000Y-64550000D03*
X154500000Y-63750000D03*
X154500000Y-62950000D03*
X145710000Y-63350000D03*
X145710000Y-64150000D03*
X145710000Y-64950000D03*
X145710000Y-65750000D03*
X145710000Y-66550000D03*
X145710000Y-67350000D03*
X145710000Y-68150000D03*
X145710000Y-68950000D03*
X145710000Y-69750000D03*
X145710000Y-70550000D03*
X145710000Y-71350000D03*
X145710000Y-72150000D03*
X145710000Y-72950000D03*
X145710000Y-73750000D03*
X145710000Y-74550000D03*
X145710000Y-75350000D03*
X145710000Y-76150000D03*
X145710000Y-76950000D03*
X145710000Y-77750000D03*
X151570000Y-77350000D03*
X151570000Y-76550000D03*
X151570000Y-75750000D03*
X151570000Y-74950000D03*
X151570000Y-74150000D03*
X151570000Y-73350000D03*
X151570000Y-72550000D03*
X151570000Y-71750000D03*
X151570000Y-70950000D03*
X151570000Y-70150000D03*
X151570000Y-69350000D03*
X151570000Y-68550000D03*
X151570000Y-67750000D03*
X151570000Y-66950000D03*
X151570000Y-66150000D03*
X151570000Y-65350000D03*
X151570000Y-64550000D03*
X151570000Y-63750000D03*
X151570000Y-62950000D03*
X148640000Y-63350000D03*
X148640000Y-64150000D03*
X148640000Y-64950000D03*
X148640000Y-65750000D03*
X148640000Y-66550000D03*
X148640000Y-67350000D03*
X148640000Y-68150000D03*
X148640000Y-68950000D03*
X148640000Y-69750000D03*
X148640000Y-70550000D03*
X148640000Y-71350000D03*
X148640000Y-72150000D03*
X148640000Y-72950000D03*
X148640000Y-73750000D03*
X148640000Y-74550000D03*
X148640000Y-75350000D03*
X148640000Y-76150000D03*
X148640000Y-76950000D03*
X148640000Y-77750000D03*
%TD*%
%TO.C,C202*%
G36*
G01*
X140550000Y-46975000D02*
X140550000Y-46025000D01*
G75*
G02*
X140800000Y-45775000I250000J0D01*
G01*
X141300000Y-45775000D01*
G75*
G02*
X141550000Y-46025000I0J-250000D01*
G01*
X141550000Y-46975000D01*
G75*
G02*
X141300000Y-47225000I-250000J0D01*
G01*
X140800000Y-47225000D01*
G75*
G02*
X140550000Y-46975000I0J250000D01*
G01*
G37*
G36*
G01*
X142450000Y-46975000D02*
X142450000Y-46025000D01*
G75*
G02*
X142700000Y-45775000I250000J0D01*
G01*
X143200000Y-45775000D01*
G75*
G02*
X143450000Y-46025000I0J-250000D01*
G01*
X143450000Y-46975000D01*
G75*
G02*
X143200000Y-47225000I-250000J0D01*
G01*
X142700000Y-47225000D01*
G75*
G02*
X142450000Y-46975000I0J250000D01*
G01*
G37*
%TD*%
%TO.C,R201*%
G36*
G01*
X118065000Y-58220000D02*
X118435000Y-58220000D01*
G75*
G02*
X118570000Y-58355000I0J-135000D01*
G01*
X118570000Y-58625000D01*
G75*
G02*
X118435000Y-58760000I-135000J0D01*
G01*
X118065000Y-58760000D01*
G75*
G02*
X117930000Y-58625000I0J135000D01*
G01*
X117930000Y-58355000D01*
G75*
G02*
X118065000Y-58220000I135000J0D01*
G01*
G37*
G36*
G01*
X118065000Y-59240000D02*
X118435000Y-59240000D01*
G75*
G02*
X118570000Y-59375000I0J-135000D01*
G01*
X118570000Y-59645000D01*
G75*
G02*
X118435000Y-59780000I-135000J0D01*
G01*
X118065000Y-59780000D01*
G75*
G02*
X117930000Y-59645000I0J135000D01*
G01*
X117930000Y-59375000D01*
G75*
G02*
X118065000Y-59240000I135000J0D01*
G01*
G37*
%TD*%
%TO.C,C205*%
G36*
G01*
X159450000Y-44350001D02*
X159450000Y-42149999D01*
G75*
G02*
X159699999Y-41900000I249999J0D01*
G01*
X160350001Y-41900000D01*
G75*
G02*
X160600000Y-42149999I0J-249999D01*
G01*
X160600000Y-44350001D01*
G75*
G02*
X160350001Y-44600000I-249999J0D01*
G01*
X159699999Y-44600000D01*
G75*
G02*
X159450000Y-44350001I0J249999D01*
G01*
G37*
G36*
G01*
X162400000Y-44350001D02*
X162400000Y-42149999D01*
G75*
G02*
X162649999Y-41900000I249999J0D01*
G01*
X163300001Y-41900000D01*
G75*
G02*
X163550000Y-42149999I0J-249999D01*
G01*
X163550000Y-44350001D01*
G75*
G02*
X163300001Y-44600000I-249999J0D01*
G01*
X162649999Y-44600000D01*
G75*
G02*
X162400000Y-44350001I0J249999D01*
G01*
G37*
%TD*%
%TO.C,C206*%
G36*
G01*
X157050000Y-42149999D02*
X157050000Y-44350001D01*
G75*
G02*
X156800001Y-44600000I-249999J0D01*
G01*
X156149999Y-44600000D01*
G75*
G02*
X155900000Y-44350001I0J249999D01*
G01*
X155900000Y-42149999D01*
G75*
G02*
X156149999Y-41900000I249999J0D01*
G01*
X156800001Y-41900000D01*
G75*
G02*
X157050000Y-42149999I0J-249999D01*
G01*
G37*
G36*
G01*
X154100000Y-42149999D02*
X154100000Y-44350001D01*
G75*
G02*
X153850001Y-44600000I-249999J0D01*
G01*
X153199999Y-44600000D01*
G75*
G02*
X152950000Y-44350001I0J249999D01*
G01*
X152950000Y-42149999D01*
G75*
G02*
X153199999Y-41900000I249999J0D01*
G01*
X153850001Y-41900000D01*
G75*
G02*
X154100000Y-42149999I0J-249999D01*
G01*
G37*
%TD*%
%TO.C,C204*%
G36*
G01*
X140550000Y-48975000D02*
X140550000Y-48025000D01*
G75*
G02*
X140800000Y-47775000I250000J0D01*
G01*
X141300000Y-47775000D01*
G75*
G02*
X141550000Y-48025000I0J-250000D01*
G01*
X141550000Y-48975000D01*
G75*
G02*
X141300000Y-49225000I-250000J0D01*
G01*
X140800000Y-49225000D01*
G75*
G02*
X140550000Y-48975000I0J250000D01*
G01*
G37*
G36*
G01*
X142450000Y-48975000D02*
X142450000Y-48025000D01*
G75*
G02*
X142700000Y-47775000I250000J0D01*
G01*
X143200000Y-47775000D01*
G75*
G02*
X143450000Y-48025000I0J-250000D01*
G01*
X143450000Y-48975000D01*
G75*
G02*
X143200000Y-49225000I-250000J0D01*
G01*
X142700000Y-49225000D01*
G75*
G02*
X142450000Y-48975000I0J250000D01*
G01*
G37*
%TD*%
%TO.C,C101*%
G36*
G01*
X182504000Y-49649500D02*
X182504000Y-49850500D01*
G75*
G02*
X182424500Y-49930000I-79500J0D01*
G01*
X182265500Y-49930000D01*
G75*
G02*
X182186000Y-49850500I0J79500D01*
G01*
X182186000Y-49649500D01*
G75*
G02*
X182265500Y-49570000I79500J0D01*
G01*
X182424500Y-49570000D01*
G75*
G02*
X182504000Y-49649500I0J-79500D01*
G01*
G37*
G36*
G01*
X181814000Y-49649500D02*
X181814000Y-49850500D01*
G75*
G02*
X181734500Y-49930000I-79500J0D01*
G01*
X181575500Y-49930000D01*
G75*
G02*
X181496000Y-49850500I0J79500D01*
G01*
X181496000Y-49649500D01*
G75*
G02*
X181575500Y-49570000I79500J0D01*
G01*
X181734500Y-49570000D01*
G75*
G02*
X181814000Y-49649500I0J-79500D01*
G01*
G37*
%TD*%
%TO.C,C102*%
G36*
G01*
X182504000Y-55649500D02*
X182504000Y-55850500D01*
G75*
G02*
X182424500Y-55930000I-79500J0D01*
G01*
X182265500Y-55930000D01*
G75*
G02*
X182186000Y-55850500I0J79500D01*
G01*
X182186000Y-55649500D01*
G75*
G02*
X182265500Y-55570000I79500J0D01*
G01*
X182424500Y-55570000D01*
G75*
G02*
X182504000Y-55649500I0J-79500D01*
G01*
G37*
G36*
G01*
X181814000Y-55649500D02*
X181814000Y-55850500D01*
G75*
G02*
X181734500Y-55930000I-79500J0D01*
G01*
X181575500Y-55930000D01*
G75*
G02*
X181496000Y-55850500I0J79500D01*
G01*
X181496000Y-55649500D01*
G75*
G02*
X181575500Y-55570000I79500J0D01*
G01*
X181734500Y-55570000D01*
G75*
G02*
X181814000Y-55649500I0J-79500D01*
G01*
G37*
%TD*%
%TO.C,C401*%
G36*
G01*
X151746000Y-107600500D02*
X151746000Y-107399500D01*
G75*
G02*
X151825500Y-107320000I79500J0D01*
G01*
X151984500Y-107320000D01*
G75*
G02*
X152064000Y-107399500I0J-79500D01*
G01*
X152064000Y-107600500D01*
G75*
G02*
X151984500Y-107680000I-79500J0D01*
G01*
X151825500Y-107680000D01*
G75*
G02*
X151746000Y-107600500I0J79500D01*
G01*
G37*
G36*
G01*
X152436000Y-107600500D02*
X152436000Y-107399500D01*
G75*
G02*
X152515500Y-107320000I79500J0D01*
G01*
X152674500Y-107320000D01*
G75*
G02*
X152754000Y-107399500I0J-79500D01*
G01*
X152754000Y-107600500D01*
G75*
G02*
X152674500Y-107680000I-79500J0D01*
G01*
X152515500Y-107680000D01*
G75*
G02*
X152436000Y-107600500I0J79500D01*
G01*
G37*
%TD*%
%TO.C,C402*%
G36*
G01*
X144746000Y-107600500D02*
X144746000Y-107399500D01*
G75*
G02*
X144825500Y-107320000I79500J0D01*
G01*
X144984500Y-107320000D01*
G75*
G02*
X145064000Y-107399500I0J-79500D01*
G01*
X145064000Y-107600500D01*
G75*
G02*
X144984500Y-107680000I-79500J0D01*
G01*
X144825500Y-107680000D01*
G75*
G02*
X144746000Y-107600500I0J79500D01*
G01*
G37*
G36*
G01*
X145436000Y-107600500D02*
X145436000Y-107399500D01*
G75*
G02*
X145515500Y-107320000I79500J0D01*
G01*
X145674500Y-107320000D01*
G75*
G02*
X145754000Y-107399500I0J-79500D01*
G01*
X145754000Y-107600500D01*
G75*
G02*
X145674500Y-107680000I-79500J0D01*
G01*
X145515500Y-107680000D01*
G75*
G02*
X145436000Y-107600500I0J79500D01*
G01*
G37*
%TD*%
%TO.C,C403*%
G36*
G01*
X133246000Y-107600500D02*
X133246000Y-107399500D01*
G75*
G02*
X133325500Y-107320000I79500J0D01*
G01*
X133484500Y-107320000D01*
G75*
G02*
X133564000Y-107399500I0J-79500D01*
G01*
X133564000Y-107600500D01*
G75*
G02*
X133484500Y-107680000I-79500J0D01*
G01*
X133325500Y-107680000D01*
G75*
G02*
X133246000Y-107600500I0J79500D01*
G01*
G37*
G36*
G01*
X133936000Y-107600500D02*
X133936000Y-107399500D01*
G75*
G02*
X134015500Y-107320000I79500J0D01*
G01*
X134174500Y-107320000D01*
G75*
G02*
X134254000Y-107399500I0J-79500D01*
G01*
X134254000Y-107600500D01*
G75*
G02*
X134174500Y-107680000I-79500J0D01*
G01*
X134015500Y-107680000D01*
G75*
G02*
X133936000Y-107600500I0J79500D01*
G01*
G37*
%TD*%
%TO.C,C404*%
G36*
G01*
X116496000Y-107600500D02*
X116496000Y-107399500D01*
G75*
G02*
X116575500Y-107320000I79500J0D01*
G01*
X116734500Y-107320000D01*
G75*
G02*
X116814000Y-107399500I0J-79500D01*
G01*
X116814000Y-107600500D01*
G75*
G02*
X116734500Y-107680000I-79500J0D01*
G01*
X116575500Y-107680000D01*
G75*
G02*
X116496000Y-107600500I0J79500D01*
G01*
G37*
G36*
G01*
X117186000Y-107600500D02*
X117186000Y-107399500D01*
G75*
G02*
X117265500Y-107320000I79500J0D01*
G01*
X117424500Y-107320000D01*
G75*
G02*
X117504000Y-107399500I0J-79500D01*
G01*
X117504000Y-107600500D01*
G75*
G02*
X117424500Y-107680000I-79500J0D01*
G01*
X117265500Y-107680000D01*
G75*
G02*
X117186000Y-107600500I0J79500D01*
G01*
G37*
%TD*%
%TO.C,C405*%
G36*
G01*
X151746000Y-108600500D02*
X151746000Y-108399500D01*
G75*
G02*
X151825500Y-108320000I79500J0D01*
G01*
X151984500Y-108320000D01*
G75*
G02*
X152064000Y-108399500I0J-79500D01*
G01*
X152064000Y-108600500D01*
G75*
G02*
X151984500Y-108680000I-79500J0D01*
G01*
X151825500Y-108680000D01*
G75*
G02*
X151746000Y-108600500I0J79500D01*
G01*
G37*
G36*
G01*
X152436000Y-108600500D02*
X152436000Y-108399500D01*
G75*
G02*
X152515500Y-108320000I79500J0D01*
G01*
X152674500Y-108320000D01*
G75*
G02*
X152754000Y-108399500I0J-79500D01*
G01*
X152754000Y-108600500D01*
G75*
G02*
X152674500Y-108680000I-79500J0D01*
G01*
X152515500Y-108680000D01*
G75*
G02*
X152436000Y-108600500I0J79500D01*
G01*
G37*
%TD*%
%TO.C,C406*%
G36*
G01*
X144746000Y-108600500D02*
X144746000Y-108399500D01*
G75*
G02*
X144825500Y-108320000I79500J0D01*
G01*
X144984500Y-108320000D01*
G75*
G02*
X145064000Y-108399500I0J-79500D01*
G01*
X145064000Y-108600500D01*
G75*
G02*
X144984500Y-108680000I-79500J0D01*
G01*
X144825500Y-108680000D01*
G75*
G02*
X144746000Y-108600500I0J79500D01*
G01*
G37*
G36*
G01*
X145436000Y-108600500D02*
X145436000Y-108399500D01*
G75*
G02*
X145515500Y-108320000I79500J0D01*
G01*
X145674500Y-108320000D01*
G75*
G02*
X145754000Y-108399500I0J-79500D01*
G01*
X145754000Y-108600500D01*
G75*
G02*
X145674500Y-108680000I-79500J0D01*
G01*
X145515500Y-108680000D01*
G75*
G02*
X145436000Y-108600500I0J79500D01*
G01*
G37*
%TD*%
%TO.C,C407*%
G36*
G01*
X133246000Y-108600500D02*
X133246000Y-108399500D01*
G75*
G02*
X133325500Y-108320000I79500J0D01*
G01*
X133484500Y-108320000D01*
G75*
G02*
X133564000Y-108399500I0J-79500D01*
G01*
X133564000Y-108600500D01*
G75*
G02*
X133484500Y-108680000I-79500J0D01*
G01*
X133325500Y-108680000D01*
G75*
G02*
X133246000Y-108600500I0J79500D01*
G01*
G37*
G36*
G01*
X133936000Y-108600500D02*
X133936000Y-108399500D01*
G75*
G02*
X134015500Y-108320000I79500J0D01*
G01*
X134174500Y-108320000D01*
G75*
G02*
X134254000Y-108399500I0J-79500D01*
G01*
X134254000Y-108600500D01*
G75*
G02*
X134174500Y-108680000I-79500J0D01*
G01*
X134015500Y-108680000D01*
G75*
G02*
X133936000Y-108600500I0J79500D01*
G01*
G37*
%TD*%
%TO.C,C408*%
G36*
G01*
X116496000Y-108600500D02*
X116496000Y-108399500D01*
G75*
G02*
X116575500Y-108320000I79500J0D01*
G01*
X116734500Y-108320000D01*
G75*
G02*
X116814000Y-108399500I0J-79500D01*
G01*
X116814000Y-108600500D01*
G75*
G02*
X116734500Y-108680000I-79500J0D01*
G01*
X116575500Y-108680000D01*
G75*
G02*
X116496000Y-108600500I0J79500D01*
G01*
G37*
G36*
G01*
X117186000Y-108600500D02*
X117186000Y-108399500D01*
G75*
G02*
X117265500Y-108320000I79500J0D01*
G01*
X117424500Y-108320000D01*
G75*
G02*
X117504000Y-108399500I0J-79500D01*
G01*
X117504000Y-108600500D01*
G75*
G02*
X117424500Y-108680000I-79500J0D01*
G01*
X117265500Y-108680000D01*
G75*
G02*
X117186000Y-108600500I0J79500D01*
G01*
G37*
%TD*%
M02*
