EESchema Schematic File Version 4
EELAYER 30 0
EELAYER END
$Descr A3 16535 11693
encoding utf-8
Sheet 4 5
Title "OpticalEVA QSFP-DD FMCP "
Date "2022-04-26"
Rev "1.0"
Comp "Karlsruhe Institute of Technology (KIT)"
Comment1 "IPE"
Comment2 "Luis Ardila"
Comment3 "Carsten Schmerbeck"
Comment4 ""
$EndDescr
Text HLabel 5600 6800 0    50   BiDi ~ 0
SDA
Text Label 8400 5800 2    50   ~ 0
TX_P1
Text Label 8400 5900 2    50   ~ 0
TX_N1
Wire Wire Line
	7650 5800 8400 5800
Wire Wire Line
	7650 5900 8400 5900
Text Label 14350 5900 2    50   ~ 0
TX_N3
Text Label 14350 5800 2    50   ~ 0
TX_P3
Wire Wire Line
	14350 5800 13500 5800
Wire Wire Line
	13500 5900 14350 5900
Text Label 5550 5900 0    50   ~ 0
TX_P0
Text Label 11350 5800 0    50   ~ 0
TX_P2
Text Label 14350 6100 2    50   ~ 0
TX_P4
Text Label 5550 6200 0    50   ~ 0
TX_P5
Text Label 8400 6100 2    50   ~ 0
TX_P6
Text Label 11350 6100 0    50   ~ 0
TX_P7
Text Label 5550 5800 0    50   ~ 0
TX_N0
Text Label 11350 5900 0    50   ~ 0
TX_N2
Text Label 14350 6200 2    50   ~ 0
TX_N4
Text Label 5550 6100 0    50   ~ 0
TX_N5
Text Label 8400 6200 2    50   ~ 0
TX_N6
Text Label 11350 6200 0    50   ~ 0
TX_N7
Text Label 8400 7000 2    50   ~ 0
RX_P0
Text Label 5550 7000 0    50   ~ 0
RX_P1
Text Label 11350 7000 0    50   ~ 0
RX_P2
Text Label 11350 7300 0    50   ~ 0
RX_P3
Text Label 14350 7300 2    50   ~ 0
RX_P4
Text Label 8400 7300 2    50   ~ 0
RX_P5
Text Label 5550 7300 0    50   ~ 0
RX_P6
Text Label 14350 7000 2    50   ~ 0
RX_P7
Text Label 8400 7100 2    50   ~ 0
RX_N0
Text Label 5550 7100 0    50   ~ 0
RX_N1
Text Label 11350 7100 0    50   ~ 0
RX_N2
Text Label 11350 7400 0    50   ~ 0
RX_N3
Text Label 14350 7400 2    50   ~ 0
RX_N4
Text Label 8400 7400 2    50   ~ 0
RX_N5
Text Label 5550 7400 0    50   ~ 0
RX_N6
Text Label 14350 7100 2    50   ~ 0
RX_N7
Wire Wire Line
	14350 7400 13500 7400
Wire Wire Line
	13500 7300 14350 7300
Wire Wire Line
	11350 7100 12150 7100
Wire Wire Line
	12150 7000 11350 7000
Wire Wire Line
	5550 6100 6300 6100
Wire Wire Line
	6300 6200 5550 6200
Wire Wire Line
	11350 6200 12150 6200
Wire Wire Line
	12150 6100 11350 6100
Wire Wire Line
	8400 7100 7650 7100
Wire Wire Line
	8400 7000 7650 7000
Wire Wire Line
	5550 7400 6300 7400
Wire Wire Line
	6300 7300 5550 7300
Wire Wire Line
	5550 7000 6300 7000
Wire Wire Line
	5550 7100 6300 7100
Wire Wire Line
	11350 7300 12150 7300
Wire Wire Line
	12150 7400 11350 7400
Wire Wire Line
	14350 6100 13500 6100
Wire Wire Line
	14350 6200 13500 6200
Wire Wire Line
	11350 5800 12150 5800
Wire Wire Line
	11350 5900 12150 5900
Wire Wire Line
	7650 7300 8400 7300
Wire Wire Line
	7650 7400 8400 7400
Wire Wire Line
	14350 7000 13500 7000
Wire Wire Line
	13500 7100 14350 7100
Wire Wire Line
	8400 6100 7650 6100
Wire Wire Line
	7650 6200 8400 6200
Wire Wire Line
	5550 5800 6300 5800
Wire Wire Line
	6300 5900 5550 5900
Wire Wire Line
	5600 6700 6300 6700
Wire Wire Line
	5600 6800 6300 6800
Wire Wire Line
	13500 6500 14350 6500
Wire Wire Line
	11350 6600 12150 6600
Wire Wire Line
	11350 6500 12150 6500
Wire Wire Line
	5550 6600 6300 6600
Wire Wire Line
	13650 5700 13500 5700
Wire Wire Line
	13650 6000 13500 6000
Wire Wire Line
	13650 6300 13500 6300
Wire Wire Line
	13650 6900 13500 6900
Wire Wire Line
	13650 7200 13500 7200
Wire Wire Line
	13650 7500 13500 7500
Wire Wire Line
	12000 5700 12150 5700
Wire Wire Line
	12000 6000 12150 6000
Wire Wire Line
	12000 6300 12150 6300
Wire Wire Line
	12000 6900 12150 6900
Wire Wire Line
	12000 7200 12150 7200
Wire Wire Line
	12000 7500 12150 7500
Wire Wire Line
	6150 7500 6300 7500
Wire Wire Line
	6150 7200 6300 7200
Wire Wire Line
	6150 6900 6300 6900
Wire Wire Line
	6150 6300 6300 6300
Wire Wire Line
	6150 6000 6300 6000
Wire Wire Line
	6150 5700 6300 5700
Wire Wire Line
	7800 7500 7650 7500
Wire Wire Line
	7800 7200 7650 7200
Wire Wire Line
	7800 6900 7650 6900
Wire Wire Line
	7800 6300 7650 6300
Wire Wire Line
	7800 6000 7650 6000
Wire Wire Line
	7800 5700 7650 5700
Text Label 14350 6600 2    50   ~ 0
VccTx
Text Label 11350 6600 0    50   ~ 0
VccTx
Wire Wire Line
	13500 6600 14350 6600
Text Label 5550 6600 0    50   ~ 0
VccRx
Text Label 8400 6600 2    50   ~ 0
VccRx
Text Label 11350 6500 0    50   ~ 0
Vcc
Text Label 14350 6500 2    50   ~ 0
Vcc
Text Label 14650 3500 2    50   ~ 0
Vcc
Text Label 14650 2000 2    50   ~ 0
VccTx
Text Label 14650 2750 2    50   ~ 0
VccRx
$Comp
L KIT_Connector:QSFP-DD X1
U 1 1 61F53B96
P 6300 5700
AR Path="/61F53B96" Ref="X1"  Part="1" 
AR Path="/61F42EEE/61F53B96" Ref="X401"  Part="1" 
F 0 "X401" H 6550 5925 50  0000 C CNN
F 1 "QSFP-DD" H 6550 5834 50  0000 C CNN
F 2 "KIT_Connector:QSFP-DD" H 5950 5800 50  0001 C CNN
F 3 "" H 6300 5700 50  0001 C CNN
	1    6300 5700
	1    0    0    -1  
$EndComp
$Comp
L KIT_Connector:QSFP-DD X1
U 2 1 61F55E44
P 12150 5700
AR Path="/61F55E44" Ref="X1"  Part="2" 
AR Path="/61F42EEE/61F55E44" Ref="X401"  Part="2" 
F 0 "X401" H 12400 5925 50  0000 C CNN
F 1 "QSFP-DD" H 12400 5834 50  0000 C CNN
F 2 "KIT_Connector:QSFP-DD" H 11800 5800 50  0001 C CNN
F 3 "" H 12150 5700 50  0001 C CNN
	2    12150 5700
	1    0    0    -1  
$EndComp
NoConn ~ 12150 6700
NoConn ~ 12150 6800
$Comp
L KIT_Mechanical:QSFP-DD-Cage-1 U402
U 1 1 61FB0390
P 14900 9250
F 0 "U402" H 15178 9246 50  0000 L CNN
F 1 "QSFP-DD-Cage-1" H 15178 9155 50  0000 L CNN
F 2 "KIT_Mechanical:QSFP-DD-Cage-1" H 14900 9250 50  0001 C CNN
F 3 "" H 14900 9250 50  0001 C CNN
	1    14900 9250
	1    0    0    -1  
$EndComp
Text Label 5550 6500 0    50   ~ 0
Reset_L_HS
$Comp
L Device:R R?
U 1 1 627CF013
P 8950 7050
AR Path="/619BA206/627CF013" Ref="R?"  Part="1" 
AR Path="/619269F2/627CF013" Ref="R?"  Part="1" 
AR Path="/627CF013" Ref="R?"  Part="1" 
AR Path="/61F42EEE/627CF013" Ref="R402"  Part="1" 
F 0 "R402" H 9020 7141 50  0000 L CNN
F 1 "10k" H 9020 7050 50  0000 L CNN
F 2 "Resistor_SMD:R_0402_1005Metric" V 8880 7050 50  0001 C CNN
F 3 "~" H 8950 7050 50  0001 C CNN
	1    8950 7050
	1    0    0    -1  
$EndComp
$Comp
L power:GND #PWR?
U 1 1 627CF019
P 8950 7250
AR Path="/5EF3A6E9/627CF019" Ref="#PWR?"  Part="1" 
AR Path="/619269F2/627CF019" Ref="#PWR?"  Part="1" 
AR Path="/627CF019" Ref="#PWR?"  Part="1" 
AR Path="/61F42EEE/627CF019" Ref="#PWR?"  Part="1" 
F 0 "#PWR?" H 8950 7000 50  0001 C CNN
F 1 "GND" H 8955 7077 50  0000 C CNN
F 2 "" H 8950 7250 50  0001 C CNN
F 3 "" H 8950 7250 50  0001 C CNN
	1    8950 7250
	1    0    0    -1  
$EndComp
$Comp
L Device:R R?
U 1 1 627CF01F
P 9300 7050
AR Path="/619BA206/627CF01F" Ref="R?"  Part="1" 
AR Path="/619269F2/627CF01F" Ref="R?"  Part="1" 
AR Path="/627CF01F" Ref="R?"  Part="1" 
AR Path="/61F42EEE/627CF01F" Ref="R403"  Part="1" 
F 0 "R403" H 9370 7141 50  0000 L CNN
F 1 "10k" H 9370 7050 50  0000 L CNN
F 2 "Resistor_SMD:R_0402_1005Metric" V 9230 7050 50  0001 C CNN
F 3 "~" H 9300 7050 50  0001 C CNN
	1    9300 7050
	1    0    0    -1  
$EndComp
$Comp
L power:GND #PWR?
U 1 1 627CF025
P 9300 7250
AR Path="/5EF3A6E9/627CF025" Ref="#PWR?"  Part="1" 
AR Path="/619269F2/627CF025" Ref="#PWR?"  Part="1" 
AR Path="/627CF025" Ref="#PWR?"  Part="1" 
AR Path="/61F42EEE/627CF025" Ref="#PWR?"  Part="1" 
F 0 "#PWR?" H 9300 7000 50  0001 C CNN
F 1 "GND" H 9305 7077 50  0000 C CNN
F 2 "" H 9300 7250 50  0001 C CNN
F 3 "" H 9300 7250 50  0001 C CNN
	1    9300 7250
	1    0    0    -1  
$EndComp
$Comp
L Device:R R?
U 1 1 627CF02B
P 9650 7050
AR Path="/619BA206/627CF02B" Ref="R?"  Part="1" 
AR Path="/619269F2/627CF02B" Ref="R?"  Part="1" 
AR Path="/627CF02B" Ref="R?"  Part="1" 
AR Path="/61F42EEE/627CF02B" Ref="R404"  Part="1" 
F 0 "R404" H 9720 7141 50  0000 L CNN
F 1 "10k" H 9720 7050 50  0000 L CNN
F 2 "Resistor_SMD:R_0402_1005Metric" V 9580 7050 50  0001 C CNN
F 3 "~" H 9650 7050 50  0001 C CNN
	1    9650 7050
	1    0    0    -1  
$EndComp
$Comp
L power:GND #PWR?
U 1 1 627CF031
P 9650 7250
AR Path="/5EF3A6E9/627CF031" Ref="#PWR?"  Part="1" 
AR Path="/619269F2/627CF031" Ref="#PWR?"  Part="1" 
AR Path="/627CF031" Ref="#PWR?"  Part="1" 
AR Path="/61F42EEE/627CF031" Ref="#PWR?"  Part="1" 
F 0 "#PWR?" H 9650 7000 50  0001 C CNN
F 1 "GND" H 9655 7077 50  0000 C CNN
F 2 "" H 9650 7250 50  0001 C CNN
F 3 "" H 9650 7250 50  0001 C CNN
	1    9650 7250
	1    0    0    -1  
$EndComp
$Comp
L Device:R R?
U 1 1 627CF037
P 10000 7050
AR Path="/619BA206/627CF037" Ref="R?"  Part="1" 
AR Path="/619269F2/627CF037" Ref="R?"  Part="1" 
AR Path="/627CF037" Ref="R?"  Part="1" 
AR Path="/61F42EEE/627CF037" Ref="R405"  Part="1" 
F 0 "R405" H 10070 7141 50  0000 L CNN
F 1 "10k" H 10070 7050 50  0000 L CNN
F 2 "Resistor_SMD:R_0402_1005Metric" V 9930 7050 50  0001 C CNN
F 3 "~" H 10000 7050 50  0001 C CNN
	1    10000 7050
	1    0    0    -1  
$EndComp
$Comp
L power:GND #PWR?
U 1 1 627CF03D
P 10000 7250
AR Path="/5EF3A6E9/627CF03D" Ref="#PWR?"  Part="1" 
AR Path="/619269F2/627CF03D" Ref="#PWR?"  Part="1" 
AR Path="/627CF03D" Ref="#PWR?"  Part="1" 
AR Path="/61F42EEE/627CF03D" Ref="#PWR?"  Part="1" 
F 0 "#PWR?" H 10000 7000 50  0001 C CNN
F 1 "GND" H 10005 7077 50  0000 C CNN
F 2 "" H 10000 7250 50  0001 C CNN
F 3 "" H 10000 7250 50  0001 C CNN
	1    10000 7250
	1    0    0    -1  
$EndComp
Wire Wire Line
	8950 7250 8950 7200
Wire Wire Line
	8950 6900 8950 6800
Wire Wire Line
	9300 6700 9300 6900
Wire Wire Line
	9300 7200 9300 7250
Wire Wire Line
	9650 6500 9650 6900
Wire Wire Line
	9650 7200 9650 7250
Wire Wire Line
	10000 6400 10000 6900
Wire Wire Line
	10000 7200 10000 7250
Text Label 8400 6500 2    50   ~ 0
PVS1
Text Label 8400 6700 2    50   ~ 0
PVS2
Text Label 8400 6800 2    50   ~ 0
PVS3
Wire Bus Line
	1300 1150 1450 1150
Wire Bus Line
	1300 1050 1450 1050
Wire Bus Line
	1300 850  1450 850 
Wire Bus Line
	1300 750  1450 750 
Text HLabel 1300 1150 0    50   Input ~ 0
TX_P[0..23]
Text HLabel 1300 1050 0    50   Input ~ 0
TX_N[0..23]
Text HLabel 1300 850  0    50   Output ~ 0
RX_P[0..23]
Text HLabel 1300 750  0    50   Output ~ 0
RX_N[0..23]
Text Notes 600  11100 0    100  ~ 0
NOTES:\n1) Phase match the different tial pairs to within 100um skew\n2) Maintain more than 0.3mm clearance between trace and \nadjunct pads as well as greater than 1.0mm clearance between adjacent high speed lines.\n3) Target 100 Ohm differeential impedance\n4) Use inductors with DC resistance of less than 0.1 Ohms.\n5) Power Consumption is 3V3 @ X A \n6) SN74AVC4T774RSV A high on DIR allows data transmission from An to Bn \nand a low on DIR allows data transmission from Bto A when OE is set to low.\n7) Reset_L, ModSel_L, pins have an internall pull-up, nonetheless place a DNP resistor \n8) Int_L pin is open collector output\n9) ModPrs_L shall be pulled up to Vcc Host on the host board
$Comp
L Device:L_Core_Ferrite L401
U 1 1 639757F0
P 12250 2000
F 0 "L401" V 12565 2000 50  0000 C CNN
F 1 "BLM18SG260TZ1D" V 12474 2000 50  0000 C CNN
F 2 "Inductor_SMD:L_0603_1608Metric" H 12250 2000 50  0001 C CNN
F 3 "https://www.murata.com/en-us/products/productdata/8796750610462/QNFA9122.pdf" V 12390 2000 50  0001 C CNN
F 4 "Murata Electronics" V 12250 2000 50  0001 C CNN "manf"
F 5 "BLM18SG260TZ1D" V 12250 2000 50  0001 C CNN "manf#"
F 6 "Ferrite Bead, 0603, 6A, 7mOhm, 26Ohm @ 100MHz" V 12383 2000 50  0000 C CNN "info"
F 7 "BLM18SG260TZ1D-ND" V 12250 2000 50  0001 C CNN "digikey#"
F 8 "223-4932" V 12250 2000 50  0001 C CNN "rs#"
	1    12250 2000
	0    1    -1   0   
$EndComp
$Comp
L Device:C C?
U 1 1 63C89729
P 12900 3700
AR Path="/5EF3A6E9/63C89729" Ref="C?"  Part="1" 
AR Path="/619269F2/63C89729" Ref="C?"  Part="1" 
AR Path="/619BA206/63C89729" Ref="C425"  Part="1" 
AR Path="/61F42EEE/63C89729" Ref="C425"  Part="1" 
F 0 "C425" H 12785 3791 50  0000 R CNN
F 1 "0.1uF" H 12785 3700 50  0000 R CNN
F 2 "Capacitor_SMD:C_0402_1005Metric" H 12938 3550 50  0001 C CNN
F 3 "~" H 12900 3700 50  0001 C CNN
F 4 "0402, 16V" H 12785 3609 50  0000 R CNN "info"
F 5 "AVT-IPE" H 12900 3700 50  0001 C CNN "stock"
	1    12900 3700
	1    0    0    -1  
$EndComp
$Comp
L power:GND #PWR?
U 1 1 63C8972F
P 12900 3850
F 0 "#PWR?" H 12900 3600 50  0001 C CNN
F 1 "GND" H 12905 3677 50  0000 C CNN
F 2 "" H 12900 3850 50  0001 C CNN
F 3 "" H 12900 3850 50  0001 C CNN
	1    12900 3850
	-1   0    0    -1  
$EndComp
Wire Wire Line
	12900 3550 12900 3500
$Comp
L Device:C C?
U 1 1 63C89738
P 14150 3700
AR Path="/5EF3A6E9/63C89738" Ref="C?"  Part="1" 
AR Path="/619269F2/63C89738" Ref="C?"  Part="1" 
AR Path="/619BA206/63C89738" Ref="C429"  Part="1" 
AR Path="/61F42EEE/63C89738" Ref="C429"  Part="1" 
F 0 "C429" H 14035 3791 50  0000 R CNN
F 1 "22uF" H 14035 3700 50  0000 R CNN
F 2 "Capacitor_SMD:C_0805_2012Metric" H 14188 3550 50  0001 C CNN
F 3 "~" H 14150 3700 50  0001 C CNN
F 4 "0805,10V" H 14035 3609 50  0000 R CNN "info"
F 5 "AVT-IPE" H 14150 3700 50  0001 C CNN "stock"
	1    14150 3700
	1    0    0    -1  
$EndComp
$Comp
L power:GND #PWR?
U 1 1 63C8973E
P 14150 3850
F 0 "#PWR?" H 14150 3600 50  0001 C CNN
F 1 "GND" H 14155 3677 50  0000 C CNN
F 2 "" H 14150 3850 50  0001 C CNN
F 3 "" H 14150 3850 50  0001 C CNN
	1    14150 3850
	-1   0    0    -1  
$EndComp
Wire Wire Line
	14150 3550 14150 3500
Wire Wire Line
	12400 3500 12900 3500
Connection ~ 12900 3500
Wire Wire Line
	12900 3500 13550 3500
$Comp
L Device:C C?
U 1 1 63CBB9FF
P 12900 2950
AR Path="/5EF3A6E9/63CBB9FF" Ref="C?"  Part="1" 
AR Path="/619269F2/63CBB9FF" Ref="C?"  Part="1" 
AR Path="/619BA206/63CBB9FF" Ref="C424"  Part="1" 
AR Path="/61F42EEE/63CBB9FF" Ref="C424"  Part="1" 
F 0 "C424" H 12785 3041 50  0000 R CNN
F 1 "0.1uF" H 12785 2950 50  0000 R CNN
F 2 "Capacitor_SMD:C_0402_1005Metric" H 12938 2800 50  0001 C CNN
F 3 "~" H 12900 2950 50  0001 C CNN
F 4 "0402, 16V" H 12785 2859 50  0000 R CNN "info"
F 5 "AVT-IPE" H 12900 2950 50  0001 C CNN "stock"
	1    12900 2950
	1    0    0    -1  
$EndComp
$Comp
L power:GND #PWR?
U 1 1 63CBBA05
P 12900 3100
F 0 "#PWR?" H 12900 2850 50  0001 C CNN
F 1 "GND" H 12905 2927 50  0000 C CNN
F 2 "" H 12900 3100 50  0001 C CNN
F 3 "" H 12900 3100 50  0001 C CNN
	1    12900 3100
	-1   0    0    -1  
$EndComp
Wire Wire Line
	12900 2800 12900 2750
$Comp
L Device:C C?
U 1 1 63CBBA0E
P 14150 2950
AR Path="/5EF3A6E9/63CBBA0E" Ref="C?"  Part="1" 
AR Path="/619269F2/63CBBA0E" Ref="C?"  Part="1" 
AR Path="/619BA206/63CBBA0E" Ref="C428"  Part="1" 
AR Path="/61F42EEE/63CBBA0E" Ref="C428"  Part="1" 
F 0 "C428" H 14035 3041 50  0000 R CNN
F 1 "22uF" H 14035 2950 50  0000 R CNN
F 2 "Capacitor_SMD:C_0805_2012Metric" H 14188 2800 50  0001 C CNN
F 3 "~" H 14150 2950 50  0001 C CNN
F 4 "0805,10V" H 14035 2859 50  0000 R CNN "info"
F 5 "AVT-IPE" H 14150 2950 50  0001 C CNN "stock"
	1    14150 2950
	1    0    0    -1  
$EndComp
$Comp
L power:GND #PWR?
U 1 1 63CBBA14
P 14150 3100
F 0 "#PWR?" H 14150 2850 50  0001 C CNN
F 1 "GND" H 14155 2927 50  0000 C CNN
F 2 "" H 14150 3100 50  0001 C CNN
F 3 "" H 14150 3100 50  0001 C CNN
	1    14150 3100
	-1   0    0    -1  
$EndComp
Wire Wire Line
	14150 2800 14150 2750
Wire Wire Line
	12400 2750 12900 2750
Connection ~ 14150 2750
Wire Wire Line
	14150 2750 14650 2750
Connection ~ 12900 2750
Wire Wire Line
	12900 2750 13550 2750
$Comp
L Device:C C?
U 1 1 63CEF00B
P 12900 2200
AR Path="/5EF3A6E9/63CEF00B" Ref="C?"  Part="1" 
AR Path="/619269F2/63CEF00B" Ref="C?"  Part="1" 
AR Path="/619BA206/63CEF00B" Ref="C423"  Part="1" 
AR Path="/61F42EEE/63CEF00B" Ref="C423"  Part="1" 
F 0 "C423" H 12785 2291 50  0000 R CNN
F 1 "0.1uF" H 12785 2200 50  0000 R CNN
F 2 "Capacitor_SMD:C_0402_1005Metric" H 12938 2050 50  0001 C CNN
F 3 "~" H 12900 2200 50  0001 C CNN
F 4 "0402, 16V" H 12785 2109 50  0000 R CNN "info"
F 5 "AVT-IPE" H 12900 2200 50  0001 C CNN "stock"
	1    12900 2200
	1    0    0    -1  
$EndComp
$Comp
L power:GND #PWR?
U 1 1 63CEF011
P 12900 2350
F 0 "#PWR?" H 12900 2100 50  0001 C CNN
F 1 "GND" H 12905 2177 50  0000 C CNN
F 2 "" H 12900 2350 50  0001 C CNN
F 3 "" H 12900 2350 50  0001 C CNN
	1    12900 2350
	-1   0    0    -1  
$EndComp
Wire Wire Line
	12900 2050 12900 2000
$Comp
L Device:C C?
U 1 1 63CEF01A
P 14150 2200
AR Path="/5EF3A6E9/63CEF01A" Ref="C?"  Part="1" 
AR Path="/619269F2/63CEF01A" Ref="C?"  Part="1" 
AR Path="/619BA206/63CEF01A" Ref="C427"  Part="1" 
AR Path="/61F42EEE/63CEF01A" Ref="C427"  Part="1" 
F 0 "C427" H 14035 2291 50  0000 R CNN
F 1 "22uF" H 14035 2200 50  0000 R CNN
F 2 "Capacitor_SMD:C_0805_2012Metric" H 14188 2050 50  0001 C CNN
F 3 "~" H 14150 2200 50  0001 C CNN
F 4 "0805,10V" H 14035 2109 50  0000 R CNN "info"
F 5 "AVT-IPE" H 14150 2200 50  0001 C CNN "stock"
	1    14150 2200
	1    0    0    -1  
$EndComp
$Comp
L power:GND #PWR?
U 1 1 63CEF020
P 14150 2350
F 0 "#PWR?" H 14150 2100 50  0001 C CNN
F 1 "GND" H 14155 2177 50  0000 C CNN
F 2 "" H 14150 2350 50  0001 C CNN
F 3 "" H 14150 2350 50  0001 C CNN
	1    14150 2350
	-1   0    0    -1  
$EndComp
Wire Wire Line
	14150 2050 14150 2000
Wire Wire Line
	12400 2000 12900 2000
Connection ~ 12900 2000
Wire Wire Line
	14150 3500 14650 3500
Wire Wire Line
	12900 2000 13550 2000
Wire Wire Line
	14150 2000 14650 2000
Connection ~ 14150 2000
Connection ~ 14150 3500
Wire Wire Line
	5250 3250 4900 3250
Wire Wire Line
	2050 3250 1700 3250
Wire Wire Line
	1600 1850 1600 1800
Wire Wire Line
	2450 2450 2450 1850
Wire Wire Line
	1600 1850 1800 1850
Wire Wire Line
	1800 1900 1800 1850
Connection ~ 1800 1850
Wire Wire Line
	1800 1850 2450 1850
Wire Wire Line
	3500 1850 3500 1800
Wire Wire Line
	2650 2450 2650 1850
Wire Wire Line
	3500 1850 3300 1850
Wire Wire Line
	3300 1900 3300 1850
Connection ~ 3300 1850
Wire Wire Line
	3300 1850 2650 1850
$Comp
L power:GND #PWR?
U 1 1 64FD70FF
P 3300 2200
F 0 "#PWR?" H 3300 1950 50  0001 C CNN
F 1 "GND" H 3305 2027 50  0000 C CNN
F 2 "" H 3300 2200 50  0001 C CNN
F 3 "" H 3300 2200 50  0001 C CNN
	1    3300 2200
	1    0    0    -1  
$EndComp
$Comp
L power:GND #PWR?
U 1 1 64FD7105
P 1800 2200
F 0 "#PWR?" H 1800 1950 50  0001 C CNN
F 1 "GND" H 1805 2027 50  0000 C CNN
F 2 "" H 1800 2200 50  0001 C CNN
F 3 "" H 1800 2200 50  0001 C CNN
	1    1800 2200
	1    0    0    -1  
$EndComp
$Comp
L power:+3V3 #PWR?
U 1 1 64FD710B
P 3500 1800
F 0 "#PWR?" H 3500 1650 50  0001 C CNN
F 1 "+3V3" H 3515 1973 50  0000 C CNN
F 2 "" H 3500 1800 50  0001 C CNN
F 3 "" H 3500 1800 50  0001 C CNN
	1    3500 1800
	1    0    0    -1  
$EndComp
$Comp
L KIT_Logic_LevelTranslator:SN74AVC4T774RSV U401
U 1 1 6267BD36
P 2550 3050
F 0 "U401" H 2700 3700 50  0000 L CNN
F 1 "SN74AVC4T774RSV" H 3050 3600 50  0000 C CNN
F 2 "KIT_Package_DFN_QFN:UQFN-16_1.8x2.6_Pitch0.4mm" H 2550 1950 50  0001 C CNN
F 3 "https://www.ti.com/lit/ds/symlink/sn74avc4t774.pdf?ts=1637743747763&ref_url=https%253A%252F%252Fwww.google.com%252F" H 2500 2800 50  0001 C CNN
	1    2550 3050
	1    0    0    -1  
$EndComp
$Comp
L power:GND #PWR?
U 1 1 6287CB2C
P 2550 3650
F 0 "#PWR?" H 2550 3400 50  0001 C CNN
F 1 "GND" H 2555 3477 50  0000 C CNN
F 2 "" H 2550 3650 50  0001 C CNN
F 3 "" H 2550 3650 50  0001 C CNN
	1    2550 3650
	1    0    0    -1  
$EndComp
$Comp
L power:GND #PWR?
U 1 1 62F5A91E
P 1950 3650
F 0 "#PWR?" H 1950 3400 50  0001 C CNN
F 1 "GND" H 1955 3477 50  0000 C CNN
F 2 "" H 1950 3650 50  0001 C CNN
F 3 "" H 1950 3650 50  0001 C CNN
	1    1950 3650
	1    0    0    -1  
$EndComp
Wire Wire Line
	1950 3650 1950 2950
Wire Wire Line
	1950 2950 2050 2950
Wire Wire Line
	2050 2750 1950 2750
Wire Wire Line
	1950 2750 1950 2850
Connection ~ 1950 2950
$Comp
L power:GND #PWR?
U 1 1 63031D06
P 3200 3650
F 0 "#PWR?" H 3200 3400 50  0001 C CNN
F 1 "GND" H 3205 3477 50  0000 C CNN
F 2 "" H 3200 3650 50  0001 C CNN
F 3 "" H 3200 3650 50  0001 C CNN
	1    3200 3650
	1    0    0    -1  
$EndComp
Wire Wire Line
	3200 3650 3200 2950
Wire Wire Line
	3200 2950 3050 2950
$Comp
L Device:L_Core_Ferrite L402
U 1 1 63489EE2
P 12250 2750
F 0 "L402" V 12475 2750 50  0000 C CNN
F 1 "BLM18SG260TZ1D" V 12384 2750 50  0000 C CNN
F 2 "Inductor_SMD:L_0603_1608Metric" H 12250 2750 50  0001 C CNN
F 3 "https://www.murata.com/en-us/products/productdata/8796750610462/QNFA9122.pdf" V 12390 2750 50  0001 C CNN
F 4 "Murata Electronics" V 12250 2750 50  0001 C CNN "manf"
F 5 "BLM18SG260TZ1D" V 12250 2750 50  0001 C CNN "manf#"
F 6 "Ferrite Bead, 0603, 6A, 7mOhm, 26Ohm @ 100MHz" V 12250 2750 50  0001 C CNN "info"
F 7 "BLM18SG260TZ1D-ND" V 12250 2750 50  0001 C CNN "digikey#"
F 8 "223-4932" V 12250 2750 50  0001 C CNN "rs#"
	1    12250 2750
	0    1    -1   0   
$EndComp
$Comp
L Device:L_Core_Ferrite L403
U 1 1 6348B73B
P 12250 3500
F 0 "L403" V 12475 3500 50  0000 C CNN
F 1 "BLM18SG260TZ1D" V 12384 3500 50  0000 C CNN
F 2 "Inductor_SMD:L_0603_1608Metric" H 12250 3500 50  0001 C CNN
F 3 "https://www.murata.com/en-us/products/productdata/8796750610462/QNFA9122.pdf" V 12390 3500 50  0001 C CNN
F 4 "Murata Electronics" V 12250 3500 50  0001 C CNN "manf"
F 5 "BLM18SG260TZ1D" V 12250 3500 50  0001 C CNN "manf#"
F 6 "Ferrite Bead, 0603, 6A, 7mOhm, 26Ohm @ 100MHz" V 12250 3500 50  0001 C CNN "info"
F 7 "BLM18SG260TZ1D-ND" V 12250 3500 50  0001 C CNN "digikey#"
F 8 "223-4932" V 12250 3500 50  0001 C CNN "rs#"
	1    12250 3500
	0    1    -1   0   
$EndComp
$Comp
L Device:C C?
U 1 1 64FD70E6
P 1800 2050
AR Path="/5EF3A6E9/64FD70E6" Ref="C?"  Part="1" 
AR Path="/619269F2/64FD70E6" Ref="C?"  Part="1" 
AR Path="/619BA206/64FD70E6" Ref="C409"  Part="1" 
AR Path="/61F42EEE/64FD70E6" Ref="C409"  Part="1" 
F 0 "C409" H 1685 2141 50  0000 R CNN
F 1 "0.1uF" H 1685 2050 50  0000 R CNN
F 2 "Capacitor_SMD:C_0402_1005Metric" H 1838 1900 50  0001 C CNN
F 3 "~" H 1800 2050 50  0001 C CNN
F 4 "0402, 16V" H 1685 1959 50  0000 R CNN "info"
F 5 "AVT-IPE" H 1800 2050 50  0001 C CNN "stock"
	1    1800 2050
	-1   0    0    -1  
$EndComp
$Comp
L Device:C C?
U 1 1 64FD70F4
P 3300 2050
AR Path="/5EF3A6E9/64FD70F4" Ref="C?"  Part="1" 
AR Path="/619269F2/64FD70F4" Ref="C?"  Part="1" 
AR Path="/619BA206/64FD70F4" Ref="C410"  Part="1" 
AR Path="/61F42EEE/64FD70F4" Ref="C410"  Part="1" 
F 0 "C410" H 3185 2141 50  0000 R CNN
F 1 "0.1uF" H 3185 2050 50  0000 R CNN
F 2 "Capacitor_SMD:C_0402_1005Metric" H 3338 1900 50  0001 C CNN
F 3 "~" H 3300 2050 50  0001 C CNN
F 4 "0402, 16V" H 3185 1959 50  0000 R CNN "info"
F 5 "AVT-IPE" H 3300 2050 50  0001 C CNN "stock"
	1    3300 2050
	1    0    0    -1  
$EndComp
Text Label 2000 6300 0    50   ~ 0
RX_P21
Text Label 2000 6600 0    50   ~ 0
RX_P22
Text Label 2000 6900 0    50   ~ 0
RX_P23
Text Label 4100 6300 2    50   ~ 0
TX_P21
Text Label 4100 6600 2    50   ~ 0
TX_P22
Text Label 4100 6900 2    50   ~ 0
TX_P23
Text Label 4100 6400 2    50   ~ 0
TX_N21
Text Label 4100 6700 2    50   ~ 0
TX_N22
Text Label 4100 7000 2    50   ~ 0
TX_N23
Wire Wire Line
	6250 3250 7050 3250
Text Label 7050 3250 2    50   ~ 0
Reset_L_HS
Wire Wire Line
	3050 3250 3850 3250
Text Label 3850 3250 2    50   ~ 0
Int_L_HS
Wire Wire Line
	2000 6300 3250 6300
Wire Wire Line
	2000 6400 2650 6400
$Comp
L Device:C C402
U 1 1 656D947D
P 2800 6400
F 0 "C402" V 2750 6500 50  0000 L CNN
F 1 "0.1uF" V 2750 6300 50  0000 R CNN
F 2 "Capacitor_SMD:C_0201_0603Metric" H 2838 6250 50  0001 C CNN
F 3 "~" H 2800 6400 50  0001 C CNN
F 4 "185-1596" H 2800 6400 50  0001 C CNN "rs#"
F 5 "0201, 25V, X5R, 10%" V 2640 6400 50  0001 C CNN "info"
F 6 "Luis" H 2800 6400 50  0001 C CNN "stock"
	1    2800 6400
	0    1    -1   0   
$EndComp
Wire Wire Line
	2950 6400 4100 6400
$Comp
L Device:C C406
U 1 1 656D9487
P 3400 6300
F 0 "C406" V 3350 6400 50  0000 L CNN
F 1 "0.1uF" V 3350 6200 50  0000 R CNN
F 2 "Capacitor_SMD:C_0201_0603Metric" H 3438 6150 50  0001 C CNN
F 3 "~" H 3400 6300 50  0001 C CNN
F 4 "185-1596" H 3400 6300 50  0001 C CNN "rs#"
F 5 "0201, 25V, X5R, 10%" V 3240 6300 50  0001 C CNN "info"
F 6 "Luis" H 3400 6300 50  0001 C CNN "stock"
	1    3400 6300
	0    1    -1   0   
$EndComp
Wire Wire Line
	3550 6300 4100 6300
Wire Wire Line
	2000 6600 3250 6600
Wire Wire Line
	2000 6700 2650 6700
$Comp
L Device:C C403
U 1 1 656F6E9F
P 2800 6700
F 0 "C403" V 2750 6800 50  0000 L CNN
F 1 "0.1uF" V 2750 6600 50  0000 R CNN
F 2 "Capacitor_SMD:C_0201_0603Metric" H 2838 6550 50  0001 C CNN
F 3 "~" H 2800 6700 50  0001 C CNN
F 4 "185-1596" H 2800 6700 50  0001 C CNN "rs#"
F 5 "0201, 25V, X5R, 10%" V 2640 6700 50  0001 C CNN "info"
F 6 "Luis" H 2800 6700 50  0001 C CNN "stock"
	1    2800 6700
	0    1    -1   0   
$EndComp
Wire Wire Line
	2950 6700 4100 6700
$Comp
L Device:C C407
U 1 1 656F6EA9
P 3400 6600
F 0 "C407" V 3350 6700 50  0000 L CNN
F 1 "0.1uF" V 3350 6500 50  0000 R CNN
F 2 "Capacitor_SMD:C_0201_0603Metric" H 3438 6450 50  0001 C CNN
F 3 "~" H 3400 6600 50  0001 C CNN
F 4 "185-1596" H 3400 6600 50  0001 C CNN "rs#"
F 5 "0201, 25V, X5R, 10%" V 3240 6600 50  0001 C CNN "info"
F 6 "Luis" H 3400 6600 50  0001 C CNN "stock"
	1    3400 6600
	0    1    -1   0   
$EndComp
Wire Wire Line
	3550 6600 4100 6600
Wire Wire Line
	2000 6900 3250 6900
Wire Wire Line
	2000 7000 2650 7000
$Comp
L Device:C C404
U 1 1 657154FC
P 2800 7000
F 0 "C404" V 2750 7100 50  0000 L CNN
F 1 "0.1uF" V 2750 6900 50  0000 R CNN
F 2 "Capacitor_SMD:C_0201_0603Metric" H 2838 6850 50  0001 C CNN
F 3 "~" H 2800 7000 50  0001 C CNN
F 4 "185-1596" H 2800 7000 50  0001 C CNN "rs#"
F 5 "0201, 25V, X5R, 10%" V 2640 7000 50  0001 C CNN "info"
F 6 "Luis" H 2800 7000 50  0001 C CNN "stock"
	1    2800 7000
	0    1    -1   0   
$EndComp
Wire Wire Line
	2950 7000 4100 7000
$Comp
L Device:C C408
U 1 1 65715506
P 3400 6900
F 0 "C408" V 3350 7000 50  0000 L CNN
F 1 "0.1uF" V 3350 6800 50  0000 R CNN
F 2 "Capacitor_SMD:C_0201_0603Metric" H 3438 6750 50  0001 C CNN
F 3 "~" H 3400 6900 50  0001 C CNN
F 4 "185-1596" H 3400 6900 50  0001 C CNN "rs#"
F 5 "0201, 25V, X5R, 10%" V 3240 6900 50  0001 C CNN "info"
F 6 "Luis" H 3400 6900 50  0001 C CNN "stock"
	1    3400 6900
	0    1    -1   0   
$EndComp
Wire Wire Line
	3550 6900 4100 6900
Wire Wire Line
	3550 6000 4100 6000
$Comp
L Device:C C405
U 1 1 65663299
P 3400 6000
F 0 "C405" V 3350 6100 50  0000 L CNN
F 1 "0.1uF" V 3350 5900 50  0000 R CNN
F 2 "Capacitor_SMD:C_0201_0603Metric" H 3438 5850 50  0001 C CNN
F 3 "~" H 3400 6000 50  0001 C CNN
F 4 "185-1596" H 3400 6000 50  0001 C CNN "rs#"
F 5 "0201, 25V, X5R, 10%" V 3550 6000 50  0000 C CNN "info"
F 6 "Luis" H 3400 6000 50  0001 C CNN "stock"
	1    3400 6000
	0    1    -1   0   
$EndComp
Wire Wire Line
	2950 6100 4100 6100
$Comp
L Device:C C401
U 1 1 6566328F
P 2800 6100
F 0 "C401" V 2750 6200 50  0000 L CNN
F 1 "0.1uF" V 2750 6000 50  0000 R CNN
F 2 "Capacitor_SMD:C_0201_0603Metric" H 2838 5950 50  0001 C CNN
F 3 "~" H 2800 6100 50  0001 C CNN
F 4 "185-1596" H 2800 6100 50  0001 C CNN "rs#"
F 5 "0201, 25V, X5R, 10%" V 2640 6100 50  0001 C CNN "info"
F 6 "Luis" H 2800 6100 50  0001 C CNN "stock"
	1    2800 6100
	0    1    -1   0   
$EndComp
Wire Wire Line
	2000 6100 2650 6100
Wire Wire Line
	2000 6000 3250 6000
Text Label 4100 6100 2    50   ~ 0
TX_N20
Text Label 4100 6000 2    50   ~ 0
TX_P20
Text Label 2000 6000 0    50   ~ 0
RX_P20
Text Label 2000 7000 0    50   ~ 0
RX_N23
Text Label 2000 6700 0    50   ~ 0
RX_N22
Text Label 2000 6400 0    50   ~ 0
RX_N21
Text Label 2000 6100 0    50   ~ 0
RX_N20
NoConn ~ 2050 3450
NoConn ~ 3050 3450
$Comp
L Device:C C?
U 1 1 61B1539E
P 9550 2200
AR Path="/5EF3A6E9/61B1539E" Ref="C?"  Part="1" 
AR Path="/619269F2/61B1539E" Ref="C?"  Part="1" 
AR Path="/619BA206/61B1539E" Ref="C415"  Part="1" 
AR Path="/61F42EEE/61B1539E" Ref="C415"  Part="1" 
F 0 "C415" H 9435 2291 50  0000 R CNN
F 1 "0.1uF" H 9435 2200 50  0000 R CNN
F 2 "Capacitor_SMD:C_0402_1005Metric" H 9588 2050 50  0001 C CNN
F 3 "~" H 9550 2200 50  0001 C CNN
F 4 "0402, 16V" H 9435 2109 50  0000 R CNN "info"
F 5 "AVT-IPE" H 9550 2200 50  0001 C CNN "stock"
	1    9550 2200
	1    0    0    -1  
$EndComp
$Comp
L power:GND #PWR?
U 1 1 61B153A4
P 9550 2350
F 0 "#PWR?" H 9550 2100 50  0001 C CNN
F 1 "GND" H 9555 2177 50  0000 C CNN
F 2 "" H 9550 2350 50  0001 C CNN
F 3 "" H 9550 2350 50  0001 C CNN
	1    9550 2350
	-1   0    0    -1  
$EndComp
Wire Wire Line
	9550 2050 9550 2000
Wire Wire Line
	12000 5700 12000 6000
Connection ~ 12000 6000
Wire Wire Line
	12000 6000 12000 6300
Connection ~ 12000 6300
Connection ~ 12000 6900
Wire Wire Line
	12000 6900 12000 7200
Connection ~ 12000 7200
Wire Wire Line
	12000 7200 12000 7500
Connection ~ 12000 7500
Wire Wire Line
	12000 7500 12000 7700
Wire Wire Line
	13650 5700 13650 6000
Connection ~ 13650 6000
Wire Wire Line
	13650 6000 13650 6300
Connection ~ 13650 6300
Connection ~ 13650 6900
Wire Wire Line
	13650 6900 13650 7200
Connection ~ 13650 7200
Wire Wire Line
	13650 7200 13650 7500
Connection ~ 13650 7500
Wire Wire Line
	13650 7500 13650 7700
$Comp
L power:GND #PWR?
U 1 1 62895779
P 13650 7700
F 0 "#PWR?" H 13650 7450 50  0001 C CNN
F 1 "GND" H 13655 7527 50  0000 C CNN
F 2 "" H 13650 7700 50  0001 C CNN
F 3 "" H 13650 7700 50  0001 C CNN
	1    13650 7700
	1    0    0    -1  
$EndComp
$Comp
L power:GND #PWR?
U 1 1 628957DE
P 12000 7700
F 0 "#PWR?" H 12000 7450 50  0001 C CNN
F 1 "GND" H 12005 7527 50  0000 C CNN
F 2 "" H 12000 7700 50  0001 C CNN
F 3 "" H 12000 7700 50  0001 C CNN
	1    12000 7700
	1    0    0    -1  
$EndComp
Wire Wire Line
	6150 5700 6150 6000
Connection ~ 6150 6000
Wire Wire Line
	6150 6000 6150 6300
Connection ~ 6150 6300
Wire Wire Line
	6150 6300 6150 6900
Connection ~ 6150 6900
Wire Wire Line
	6150 6900 6150 7200
Connection ~ 6150 7200
Wire Wire Line
	6150 7200 6150 7500
Connection ~ 6150 7500
Wire Wire Line
	6150 7500 6150 7700
Text Label 8400 6400 2    50   ~ 0
PVS4
Wire Wire Line
	7650 6800 8950 6800
Wire Wire Line
	7650 6700 9300 6700
Wire Wire Line
	7650 6500 9650 6500
Wire Wire Line
	7650 6400 10000 6400
Wire Wire Line
	7650 6600 8400 6600
Wire Wire Line
	7800 5700 7800 6000
Connection ~ 7800 6000
Wire Wire Line
	7800 6000 7800 6300
Connection ~ 7800 6300
Wire Wire Line
	7800 6300 7800 6900
Connection ~ 7800 6900
Wire Wire Line
	7800 6900 7800 7200
Connection ~ 7800 7200
Wire Wire Line
	7800 7200 7800 7500
Connection ~ 7800 7500
Wire Wire Line
	7800 7500 7800 7700
$Comp
L power:GND #PWR?
U 1 1 6290169C
P 7800 7700
F 0 "#PWR?" H 7800 7450 50  0001 C CNN
F 1 "GND" H 7805 7527 50  0000 C CNN
F 2 "" H 7800 7700 50  0001 C CNN
F 3 "" H 7800 7700 50  0001 C CNN
	1    7800 7700
	1    0    0    -1  
$EndComp
$Comp
L power:GND #PWR?
U 1 1 62901994
P 6150 7700
F 0 "#PWR?" H 6150 7450 50  0001 C CNN
F 1 "GND" H 6155 7527 50  0000 C CNN
F 2 "" H 6150 7700 50  0001 C CNN
F 3 "" H 6150 7700 50  0001 C CNN
	1    6150 7700
	1    0    0    -1  
$EndComp
Wire Wire Line
	14350 6400 13500 6400
Wire Wire Line
	13650 6300 13650 6900
Wire Wire Line
	12000 6300 12000 6900
Wire Wire Line
	11350 6400 12150 6400
Wire Wire Line
	10150 2050 10150 2000
$Comp
L power:GND #PWR?
U 1 1 63BCBAD6
P 10150 2350
F 0 "#PWR?" H 10150 2100 50  0001 C CNN
F 1 "GND" H 10155 2177 50  0000 C CNN
F 2 "" H 10150 2350 50  0001 C CNN
F 3 "" H 10150 2350 50  0001 C CNN
	1    10150 2350
	-1   0    0    -1  
$EndComp
$Comp
L Device:C C?
U 1 1 63BCBAD0
P 10150 2200
AR Path="/5EF3A6E9/63BCBAD0" Ref="C?"  Part="1" 
AR Path="/619269F2/63BCBAD0" Ref="C?"  Part="1" 
AR Path="/619BA206/63BCBAD0" Ref="C430"  Part="1" 
AR Path="/61F42EEE/63BCBAD0" Ref="C430"  Part="1" 
F 0 "C430" H 10035 2291 50  0000 R CNN
F 1 "22uF" H 10035 2200 50  0000 R CNN
F 2 "Capacitor_SMD:C_0805_2012Metric" H 10188 2050 50  0001 C CNN
F 3 "~" H 10150 2200 50  0001 C CNN
F 4 "0805,10V" H 10035 2109 50  0000 R CNN "info"
F 5 "AVT-IPE" H 10150 2200 50  0001 C CNN "stock"
	1    10150 2200
	1    0    0    -1  
$EndComp
Wire Wire Line
	9550 2000 10150 2000
Connection ~ 10150 2000
Wire Wire Line
	10150 2000 10750 2000
Wire Wire Line
	12100 2750 11750 2750
Wire Wire Line
	11750 2750 11750 2000
Connection ~ 11750 2000
Wire Wire Line
	11750 2000 12100 2000
Wire Wire Line
	12100 3500 11750 3500
Wire Wire Line
	11750 3500 11750 2750
Connection ~ 11750 2750
Wire Wire Line
	9250 2000 9250 1950
Wire Wire Line
	9550 2000 9250 2000
$Comp
L power:+3V3 #PWR?
U 1 1 62F536BB
P 9250 1950
F 0 "#PWR?" H 9250 1800 50  0001 C CNN
F 1 "+3V3" H 9265 2123 50  0000 C CNN
F 2 "" H 9250 1950 50  0001 C CNN
F 3 "" H 9250 1950 50  0001 C CNN
	1    9250 1950
	1    0    0    -1  
$EndComp
Connection ~ 9550 2000
Text Label 7050 3150 2    50   ~ 0
ModSel_L_HS
Text Label 7050 3350 2    50   ~ 0
ePPS\Clock_HS
Text Label 7050 3450 2    50   ~ 0
LPMode\TxDis_HS
Text Label 3850 3150 2    50   ~ 0
ModPrs_L_HS
Text HLabel 4900 3150 0    50   Input ~ 0
ModSel_L
Text HLabel 4900 3450 0    50   Input ~ 0
LPMode\TxDis
Text HLabel 4900 3350 0    50   Input ~ 0
ePPS\Clock
Text Label 11350 6400 0    50   ~ 0
ePPS\Clock_HS
Text Label 14350 6400 2    50   ~ 0
LPMode\TxDis_HS
Text Label 14350 6800 2    50   ~ 0
ModPrs_L_HS
Text Label 5550 6400 0    50   ~ 0
ModSel_L_HS
NoConn ~ 2050 3350
NoConn ~ 3050 3350
Wire Wire Line
	5250 3150 4900 3150
Wire Wire Line
	4800 1850 4800 1800
Wire Wire Line
	5650 2450 5650 1850
Wire Wire Line
	4800 1850 5000 1850
Wire Wire Line
	5000 1900 5000 1850
Connection ~ 5000 1850
Wire Wire Line
	5000 1850 5650 1850
Wire Wire Line
	6700 1850 6700 1800
Wire Wire Line
	5850 2450 5850 1850
Wire Wire Line
	6700 1850 6500 1850
Wire Wire Line
	6500 1900 6500 1850
Connection ~ 6500 1850
Wire Wire Line
	6500 1850 5850 1850
$Comp
L power:GND #PWR?
U 1 1 6277F35C
P 6500 2200
F 0 "#PWR?" H 6500 1950 50  0001 C CNN
F 1 "GND" H 6505 2027 50  0000 C CNN
F 2 "" H 6500 2200 50  0001 C CNN
F 3 "" H 6500 2200 50  0001 C CNN
	1    6500 2200
	1    0    0    -1  
$EndComp
$Comp
L power:GND #PWR?
U 1 1 6277F362
P 5000 2200
F 0 "#PWR?" H 5000 1950 50  0001 C CNN
F 1 "GND" H 5005 2027 50  0000 C CNN
F 2 "" H 5000 2200 50  0001 C CNN
F 3 "" H 5000 2200 50  0001 C CNN
	1    5000 2200
	1    0    0    -1  
$EndComp
$Comp
L power:+3V3 #PWR?
U 1 1 6277F368
P 6700 1800
F 0 "#PWR?" H 6700 1650 50  0001 C CNN
F 1 "+3V3" H 6715 1973 50  0000 C CNN
F 2 "" H 6700 1800 50  0001 C CNN
F 3 "" H 6700 1800 50  0001 C CNN
	1    6700 1800
	1    0    0    -1  
$EndComp
$Comp
L power:GND #PWR?
U 1 1 6277F374
P 5750 3650
F 0 "#PWR?" H 5750 3400 50  0001 C CNN
F 1 "GND" H 5755 3477 50  0000 C CNN
F 2 "" H 5750 3650 50  0001 C CNN
F 3 "" H 5750 3650 50  0001 C CNN
	1    5750 3650
	1    0    0    -1  
$EndComp
$Comp
L power:GND #PWR?
U 1 1 6277F37A
P 5150 3650
F 0 "#PWR?" H 5150 3400 50  0001 C CNN
F 1 "GND" H 5155 3477 50  0000 C CNN
F 2 "" H 5150 3650 50  0001 C CNN
F 3 "" H 5150 3650 50  0001 C CNN
	1    5150 3650
	1    0    0    -1  
$EndComp
Wire Wire Line
	5250 2750 5150 2750
Wire Wire Line
	4950 2800 4950 2850
Wire Wire Line
	4950 2850 5250 2850
Wire Wire Line
	6550 2800 6550 2850
Wire Wire Line
	6550 2850 6250 2850
$Comp
L Device:C C?
U 1 1 6277F39F
P 5000 2050
AR Path="/5EF3A6E9/6277F39F" Ref="C?"  Part="1" 
AR Path="/619269F2/6277F39F" Ref="C?"  Part="1" 
AR Path="/619BA206/6277F39F" Ref="C?"  Part="1" 
AR Path="/61F42EEE/6277F39F" Ref="C411"  Part="1" 
F 0 "C411" H 4885 2141 50  0000 R CNN
F 1 "0.1uF" H 4885 2050 50  0000 R CNN
F 2 "Capacitor_SMD:C_0402_1005Metric" H 5038 1900 50  0001 C CNN
F 3 "~" H 5000 2050 50  0001 C CNN
F 4 "0402, 16V" H 4885 1959 50  0000 R CNN "info"
F 5 "AVT-IPE" H 5000 2050 50  0001 C CNN "stock"
	1    5000 2050
	-1   0    0    -1  
$EndComp
$Comp
L Device:C C?
U 1 1 6277F3A7
P 6500 2050
AR Path="/5EF3A6E9/6277F3A7" Ref="C?"  Part="1" 
AR Path="/619269F2/6277F3A7" Ref="C?"  Part="1" 
AR Path="/619BA206/6277F3A7" Ref="C?"  Part="1" 
AR Path="/61F42EEE/6277F3A7" Ref="C412"  Part="1" 
F 0 "C412" H 6385 2141 50  0000 R CNN
F 1 "0.1uF" H 6385 2050 50  0000 R CNN
F 2 "Capacitor_SMD:C_0402_1005Metric" H 6538 1900 50  0001 C CNN
F 3 "~" H 6500 2050 50  0001 C CNN
F 4 "0402, 16V" H 6385 1959 50  0000 R CNN "info"
F 5 "AVT-IPE" H 6500 2050 50  0001 C CNN "stock"
	1    6500 2050
	1    0    0    -1  
$EndComp
Wire Wire Line
	6250 3150 7050 3150
Wire Wire Line
	3050 3150 3850 3150
$Comp
L KIT_Logic_LevelTranslator:SN74AVC4T774RSV U403
U 1 1 6277F36E
P 5750 3050
F 0 "U403" H 5900 3700 50  0000 L CNN
F 1 "SN74AVC4T774RSV" H 6250 3600 50  0000 C CNN
F 2 "KIT_Package_DFN_QFN:UQFN-16_1.8x2.6_Pitch0.4mm" H 5750 1950 50  0001 C CNN
F 3 "https://www.ti.com/lit/ds/symlink/sn74avc4t774.pdf?ts=1637743747763&ref_url=https%253A%252F%252Fwww.google.com%252F" H 5700 2800 50  0001 C CNN
	1    5750 3050
	1    0    0    -1  
$EndComp
Wire Wire Line
	5250 3350 4900 3350
Wire Wire Line
	4900 3450 5250 3450
Wire Wire Line
	6250 3350 7050 3350
Wire Wire Line
	6250 3450 7050 3450
Text HLabel 4900 3250 0    50   Input ~ 0
Reset_L
Text HLabel 1700 3250 0    50   Output ~ 0
Int_L
Wire Wire Line
	6550 2950 6550 2850
Wire Wire Line
	6250 2950 6550 2950
Connection ~ 6550 2850
Text HLabel 5600 6700 0    50   Input ~ 0
SCL
$Comp
L Device:C C?
U 1 1 63062836
P 13550 2200
AR Path="/5EF3A6E9/63062836" Ref="C?"  Part="1" 
AR Path="/619269F2/63062836" Ref="C?"  Part="1" 
AR Path="/619BA206/63062836" Ref="C?"  Part="1" 
AR Path="/61F42EEE/63062836" Ref="C413"  Part="1" 
F 0 "C413" H 13435 2291 50  0000 R CNN
F 1 "0.1uF" H 13435 2200 50  0000 R CNN
F 2 "Capacitor_SMD:C_0402_1005Metric" H 13588 2050 50  0001 C CNN
F 3 "~" H 13550 2200 50  0001 C CNN
F 4 "0402, 16V" H 13435 2109 50  0000 R CNN "info"
F 5 "AVT-IPE" H 13550 2200 50  0001 C CNN "stock"
	1    13550 2200
	1    0    0    -1  
$EndComp
$Comp
L power:GND #PWR?
U 1 1 6306283C
P 13550 2350
F 0 "#PWR?" H 13550 2100 50  0001 C CNN
F 1 "GND" H 13555 2177 50  0000 C CNN
F 2 "" H 13550 2350 50  0001 C CNN
F 3 "" H 13550 2350 50  0001 C CNN
	1    13550 2350
	-1   0    0    -1  
$EndComp
Wire Wire Line
	13550 2050 13550 2000
$Comp
L Device:C C?
U 1 1 63070071
P 13550 2950
AR Path="/5EF3A6E9/63070071" Ref="C?"  Part="1" 
AR Path="/619269F2/63070071" Ref="C?"  Part="1" 
AR Path="/619BA206/63070071" Ref="C?"  Part="1" 
AR Path="/61F42EEE/63070071" Ref="C414"  Part="1" 
F 0 "C414" H 13435 3041 50  0000 R CNN
F 1 "0.1uF" H 13435 2950 50  0000 R CNN
F 2 "Capacitor_SMD:C_0402_1005Metric" H 13588 2800 50  0001 C CNN
F 3 "~" H 13550 2950 50  0001 C CNN
F 4 "0402, 16V" H 13435 2859 50  0000 R CNN "info"
F 5 "AVT-IPE" H 13550 2950 50  0001 C CNN "stock"
	1    13550 2950
	1    0    0    -1  
$EndComp
$Comp
L power:GND #PWR?
U 1 1 63070077
P 13550 3100
F 0 "#PWR?" H 13550 2850 50  0001 C CNN
F 1 "GND" H 13555 2927 50  0000 C CNN
F 2 "" H 13550 3100 50  0001 C CNN
F 3 "" H 13550 3100 50  0001 C CNN
	1    13550 3100
	-1   0    0    -1  
$EndComp
Wire Wire Line
	13550 2800 13550 2750
$Comp
L Device:C C?
U 1 1 6307D8A0
P 13550 3700
AR Path="/5EF3A6E9/6307D8A0" Ref="C?"  Part="1" 
AR Path="/619269F2/6307D8A0" Ref="C?"  Part="1" 
AR Path="/619BA206/6307D8A0" Ref="C?"  Part="1" 
AR Path="/61F42EEE/6307D8A0" Ref="C416"  Part="1" 
F 0 "C416" H 13435 3791 50  0000 R CNN
F 1 "0.1uF" H 13435 3700 50  0000 R CNN
F 2 "Capacitor_SMD:C_0402_1005Metric" H 13588 3550 50  0001 C CNN
F 3 "~" H 13550 3700 50  0001 C CNN
F 4 "0402, 16V" H 13435 3609 50  0000 R CNN "info"
F 5 "AVT-IPE" H 13550 3700 50  0001 C CNN "stock"
	1    13550 3700
	1    0    0    -1  
$EndComp
$Comp
L power:GND #PWR?
U 1 1 6307D8A6
P 13550 3850
F 0 "#PWR?" H 13550 3600 50  0001 C CNN
F 1 "GND" H 13555 3677 50  0000 C CNN
F 2 "" H 13550 3850 50  0001 C CNN
F 3 "" H 13550 3850 50  0001 C CNN
	1    13550 3850
	-1   0    0    -1  
$EndComp
Wire Wire Line
	13550 3550 13550 3500
Connection ~ 13550 2000
Wire Wire Line
	13550 2000 14150 2000
Connection ~ 13550 2750
Wire Wire Line
	13550 2750 14150 2750
Connection ~ 13550 3500
Wire Wire Line
	13550 3500 14150 3500
$Comp
L Device:C C?
U 1 1 62869D71
P 10750 2200
AR Path="/5EF3A6E9/62869D71" Ref="C?"  Part="1" 
AR Path="/619269F2/62869D71" Ref="C?"  Part="1" 
AR Path="/619BA206/62869D71" Ref="C?"  Part="1" 
AR Path="/61F42EEE/62869D71" Ref="C417"  Part="1" 
F 0 "C417" H 10635 2291 50  0000 R CNN
F 1 "0.1uF" H 10635 2200 50  0000 R CNN
F 2 "Capacitor_SMD:C_0402_1005Metric" H 10788 2050 50  0001 C CNN
F 3 "~" H 10750 2200 50  0001 C CNN
F 4 "0402, 16V" H 10635 2109 50  0000 R CNN "info"
F 5 "AVT-IPE" H 10750 2200 50  0001 C CNN "stock"
	1    10750 2200
	1    0    0    -1  
$EndComp
$Comp
L power:GND #PWR?
U 1 1 62869D77
P 10750 2350
F 0 "#PWR?" H 10750 2100 50  0001 C CNN
F 1 "GND" H 10755 2177 50  0000 C CNN
F 2 "" H 10750 2350 50  0001 C CNN
F 3 "" H 10750 2350 50  0001 C CNN
	1    10750 2350
	-1   0    0    -1  
$EndComp
Wire Wire Line
	10750 2050 10750 2000
Wire Wire Line
	11350 2050 11350 2000
$Comp
L power:GND #PWR?
U 1 1 62869D7F
P 11350 2350
F 0 "#PWR?" H 11350 2100 50  0001 C CNN
F 1 "GND" H 11355 2177 50  0000 C CNN
F 2 "" H 11350 2350 50  0001 C CNN
F 3 "" H 11350 2350 50  0001 C CNN
	1    11350 2350
	-1   0    0    -1  
$EndComp
$Comp
L Device:C C?
U 1 1 62869D87
P 11350 2200
AR Path="/5EF3A6E9/62869D87" Ref="C?"  Part="1" 
AR Path="/619269F2/62869D87" Ref="C?"  Part="1" 
AR Path="/619BA206/62869D87" Ref="C?"  Part="1" 
AR Path="/61F42EEE/62869D87" Ref="C418"  Part="1" 
F 0 "C418" H 11235 2291 50  0000 R CNN
F 1 "22uF" H 11235 2200 50  0000 R CNN
F 2 "Capacitor_SMD:C_0805_2012Metric" H 11388 2050 50  0001 C CNN
F 3 "~" H 11350 2200 50  0001 C CNN
F 4 "0805,10V" H 11235 2109 50  0000 R CNN "info"
F 5 "AVT-IPE" H 11350 2200 50  0001 C CNN "stock"
	1    11350 2200
	1    0    0    -1  
$EndComp
Connection ~ 10750 2000
Wire Wire Line
	10750 2000 11350 2000
Connection ~ 11350 2000
Wire Wire Line
	11350 2000 11750 2000
Wire Wire Line
	2050 3150 1700 3150
Text HLabel 1700 3150 0    50   Output ~ 0
ModPrs_L
Wire Wire Line
	5150 2750 5150 3650
Wire Wire Line
	5250 2950 4950 2950
Wire Wire Line
	4950 2950 4950 2850
Connection ~ 4950 2850
Wire Wire Line
	2050 2850 1950 2850
Connection ~ 1950 2850
Wire Wire Line
	1950 2850 1950 2950
Wire Wire Line
	3200 2950 3200 2850
Wire Wire Line
	3200 2850 3050 2850
Connection ~ 3200 2950
Text Notes 1650 2900 0    100  ~ 0
6)
Wire Notes Line
	1850 2700 1850 3000
Wire Notes Line
	1850 3000 1550 3000
Wire Notes Line
	1550 3000 1550 2700
Wire Notes Line
	1550 2700 1850 2700
Text Notes 4600 2900 0    100  ~ 0
6)
Wire Notes Line
	4800 2700 4800 3000
Wire Notes Line
	4800 3000 4500 3000
Wire Notes Line
	4500 3000 4500 2700
Wire Notes Line
	4500 2700 4800 2700
Text Notes 8550 5900 0    100  ~ 0
Inverted
Text Notes 8550 6200 0    100  ~ 0
Inverted
Text Notes 10700 5900 0    100  ~ 0
Inverted
Text Notes 10700 6200 0    100  ~ 0
Inverted
Text Notes 14450 6200 0    100  ~ 0
Inverted
Text Notes 14450 5900 0    100  ~ 0
Inverted
Text Label 14350 6700 2    50   ~ 0
Int_L_HS
$Comp
L Device:R R?
U 1 1 631B2491
P 5100 6150
AR Path="/619BA206/631B2491" Ref="R?"  Part="1" 
AR Path="/619269F2/631B2491" Ref="R?"  Part="1" 
AR Path="/631B2491" Ref="R?"  Part="1" 
AR Path="/61F42EEE/631B2491" Ref="R406"  Part="1" 
F 0 "R406" H 5170 6241 50  0000 L CNN
F 1 "10k" H 5170 6150 50  0000 L CNN
F 2 "KIT_Resistor_SMD:R_0402_1005Metric_DNP" V 5030 6150 50  0001 C CNN
F 3 "~" H 5100 6150 50  0001 C CNN
F 4 "DNP" H 5170 6059 50  0000 L CNN "DNP"
	1    5100 6150
	1    0    0    -1  
$EndComp
Wire Wire Line
	5100 6400 5100 6300
Wire Wire Line
	5100 6400 6300 6400
$Comp
L Device:R R?
U 1 1 631FCE94
P 4750 6150
AR Path="/619BA206/631FCE94" Ref="R?"  Part="1" 
AR Path="/619269F2/631FCE94" Ref="R?"  Part="1" 
AR Path="/631FCE94" Ref="R?"  Part="1" 
AR Path="/61F42EEE/631FCE94" Ref="R401"  Part="1" 
F 0 "R401" H 4820 6241 50  0000 L CNN
F 1 "10k" H 4820 6150 50  0000 L CNN
F 2 "KIT_Resistor_SMD:R_0402_1005Metric_DNP" V 4680 6150 50  0001 C CNN
F 3 "~" H 4750 6150 50  0001 C CNN
F 4 "DNP" H 4820 6059 50  0000 L CNN "DNP"
	1    4750 6150
	1    0    0    -1  
$EndComp
Wire Wire Line
	4750 6500 6300 6500
Wire Wire Line
	4750 6300 4750 6500
$Comp
L Device:R R?
U 1 1 6323B53E
P 15300 6500
AR Path="/619BA206/6323B53E" Ref="R?"  Part="1" 
AR Path="/619269F2/6323B53E" Ref="R?"  Part="1" 
AR Path="/6323B53E" Ref="R?"  Part="1" 
AR Path="/61F42EEE/6323B53E" Ref="R407"  Part="1" 
F 0 "R407" H 15370 6591 50  0000 L CNN
F 1 "10k" H 15370 6500 50  0000 L CNN
F 2 "Resistor_SMD:R_0402_1005Metric" V 15230 6500 50  0001 C CNN
F 3 "~" H 15300 6500 50  0001 C CNN
	1    15300 6500
	1    0    0    -1  
$EndComp
Wire Wire Line
	15300 6650 15300 6700
Wire Wire Line
	13500 6700 15300 6700
$Comp
L power:+3V3 #PWR?
U 1 1 63296601
P 4750 6000
F 0 "#PWR?" H 4750 5850 50  0001 C CNN
F 1 "+3V3" H 4765 6173 50  0000 C CNN
F 2 "" H 4750 6000 50  0001 C CNN
F 3 "" H 4750 6000 50  0001 C CNN
	1    4750 6000
	1    0    0    -1  
$EndComp
$Comp
L power:+3V3 #PWR?
U 1 1 63297496
P 5100 6000
F 0 "#PWR?" H 5100 5850 50  0001 C CNN
F 1 "+3V3" H 5115 6173 50  0000 C CNN
F 2 "" H 5100 6000 50  0001 C CNN
F 3 "" H 5100 6000 50  0001 C CNN
	1    5100 6000
	1    0    0    -1  
$EndComp
$Comp
L power:+3V3 #PWR?
U 1 1 632B53DA
P 15300 6350
F 0 "#PWR?" H 15300 6200 50  0001 C CNN
F 1 "+3V3" H 15315 6523 50  0000 C CNN
F 2 "" H 15300 6350 50  0001 C CNN
F 3 "" H 15300 6350 50  0001 C CNN
	1    15300 6350
	1    0    0    -1  
$EndComp
$Comp
L Device:R R?
U 1 1 632CB7C3
P 15600 6500
AR Path="/619BA206/632CB7C3" Ref="R?"  Part="1" 
AR Path="/619269F2/632CB7C3" Ref="R?"  Part="1" 
AR Path="/632CB7C3" Ref="R?"  Part="1" 
AR Path="/61F42EEE/632CB7C3" Ref="R408"  Part="1" 
F 0 "R408" H 15670 6591 50  0000 L CNN
F 1 "10k" H 15670 6500 50  0000 L CNN
F 2 "Resistor_SMD:R_0402_1005Metric" V 15530 6500 50  0001 C CNN
F 3 "~" H 15600 6500 50  0001 C CNN
	1    15600 6500
	1    0    0    -1  
$EndComp
$Comp
L power:+3V3 #PWR?
U 1 1 632CB7CA
P 15600 6350
F 0 "#PWR?" H 15600 6200 50  0001 C CNN
F 1 "+3V3" H 15615 6523 50  0000 C CNN
F 2 "" H 15600 6350 50  0001 C CNN
F 3 "" H 15600 6350 50  0001 C CNN
	1    15600 6350
	1    0    0    -1  
$EndComp
Wire Wire Line
	13500 6800 15600 6800
Wire Wire Line
	15600 6650 15600 6800
$Comp
L power:+1V8 #PWR?
U 1 1 65741B44
P 4800 1800
F 0 "#PWR?" H 4800 1650 50  0001 C CNN
F 1 "+1V8" H 4815 1973 50  0000 C CNN
F 2 "" H 4800 1800 50  0001 C CNN
F 3 "" H 4800 1800 50  0001 C CNN
	1    4800 1800
	1    0    0    -1  
$EndComp
$Comp
L power:+1V8 #PWR?
U 1 1 65741F70
P 4950 2800
F 0 "#PWR?" H 4950 2650 50  0001 C CNN
F 1 "+1V8" H 4965 2973 50  0000 C CNN
F 2 "" H 4950 2800 50  0001 C CNN
F 3 "" H 4950 2800 50  0001 C CNN
	1    4950 2800
	1    0    0    -1  
$EndComp
$Comp
L power:+1V8 #PWR?
U 1 1 657425FB
P 6550 2800
F 0 "#PWR?" H 6550 2650 50  0001 C CNN
F 1 "+1V8" H 6565 2973 50  0000 C CNN
F 2 "" H 6550 2800 50  0001 C CNN
F 3 "" H 6550 2800 50  0001 C CNN
	1    6550 2800
	1    0    0    -1  
$EndComp
$Comp
L power:+1V8 #PWR?
U 1 1 65742DB3
P 1600 1800
F 0 "#PWR?" H 1600 1650 50  0001 C CNN
F 1 "+1V8" H 1615 1973 50  0000 C CNN
F 2 "" H 1600 1800 50  0001 C CNN
F 3 "" H 1600 1800 50  0001 C CNN
	1    1600 1800
	1    0    0    -1  
$EndComp
$EndSCHEMATC
