M48
; DRILL file {KiCad 5.1.12-84ad8e8a86~92~ubuntu18.04.1} date Tue 26 Apr 2022 04:25:02 PM CEST
; FORMAT={-:-/ absolute / inch / decimal}
; #@! TF.CreationDate,2022-04-26T16:25:02+02:00
; #@! TF.GenerationSoftware,Kicad,Pcbnew,5.1.12-84ad8e8a86~92~ubuntu18.04.1
; #@! TF.FileFunction,Plated,5,12,Blind
FMAT,2
INCH
T1C0.0079
%
G90
G05
T1
X4.4104Y-3.6238
X4.4104Y-3.6738
X4.4604Y-3.5238
X4.4604Y-3.5738
X4.4604Y-3.7238
X4.4604Y-3.7738
X4.5104Y-2.6238
X4.5104Y-2.6738
X4.5104Y-2.8238
X4.5104Y-2.8738
X4.5604Y-2.1238
X4.5604Y-2.1738
X4.5604Y-2.3238
X4.5604Y-2.3738
X4.5604Y-2.9238
X4.5604Y-2.9738
X5.0104Y-3.5238
X5.0104Y-3.5738
T0
M30
