EESchema Schematic File Version 4
EELAYER 30 0
EELAYER END
$Descr A4 11693 8268
encoding utf-8
Sheet 22 28
Title "ZynqMP Mezzanine FMC+ (BuZZyBoard)"
Date "2020-10-02"
Rev "1.0"
Comp "Karlsruhe Institute of Technology (KIT)"
Comment1 "Institute for Data Processing and Electronics (IPE)"
Comment2 "Luis Ardila"
Comment3 ""
Comment4 ""
$EndDescr
$Comp
L KIT_Connector:FMCP_VITA57.4 J2
U 2 1 5EEC7530
P 5200 2000
F 0 "J2" H 6100 2290 60  0000 C CNN
F 1 "FMCP_VITA57.4" H 6100 2184 60  0000 C CNN
F 2 "KIT_Connector:FMC_SEAM_ASP_184330_BGA-560_40x14_55.778x19.76mm" H 5400 2050 60  0001 L CNN
F 3 "http://suddendocs.samtec.com/prints/asp-188588-01-mkt.pdf" H 5400 1850 60  0001 L CNN
	2    5200 2000
	1    0    0    -1  
$EndComp
$Comp
L power:GND #PWR?
U 1 1 5F06C61A
P 5200 2300
F 0 "#PWR?" H 5200 2050 50  0001 C CNN
F 1 "GND" V 5205 2172 50  0000 R CNN
F 2 "" H 5200 2300 50  0001 C CNN
F 3 "" H 5200 2300 50  0001 C CNN
	1    5200 2300
	0    1    1    0   
$EndComp
$Comp
L power:GND #PWR?
U 1 1 5F06C620
P 5200 2400
F 0 "#PWR?" H 5200 2150 50  0001 C CNN
F 1 "GND" V 5205 2272 50  0000 R CNN
F 2 "" H 5200 2400 50  0001 C CNN
F 3 "" H 5200 2400 50  0001 C CNN
	1    5200 2400
	0    1    1    0   
$EndComp
$Comp
L power:GND #PWR?
U 1 1 5F06CE84
P 5200 2000
F 0 "#PWR?" H 5200 1750 50  0001 C CNN
F 1 "GND" V 5205 1872 50  0000 R CNN
F 2 "" H 5200 2000 50  0001 C CNN
F 3 "" H 5200 2000 50  0001 C CNN
	1    5200 2000
	0    1    1    0   
$EndComp
$Comp
L power:GND #PWR?
U 1 1 5F06DA16
P 5200 2700
F 0 "#PWR?" H 5200 2450 50  0001 C CNN
F 1 "GND" V 5205 2572 50  0000 R CNN
F 2 "" H 5200 2700 50  0001 C CNN
F 3 "" H 5200 2700 50  0001 C CNN
	1    5200 2700
	0    1    1    0   
$EndComp
$Comp
L power:GND #PWR?
U 1 1 5F06DA1C
P 5200 2800
F 0 "#PWR?" H 5200 2550 50  0001 C CNN
F 1 "GND" V 5205 2672 50  0000 R CNN
F 2 "" H 5200 2800 50  0001 C CNN
F 3 "" H 5200 2800 50  0001 C CNN
	1    5200 2800
	0    1    1    0   
$EndComp
$Comp
L power:GND #PWR?
U 1 1 5F06E076
P 5200 3100
F 0 "#PWR?" H 5200 2850 50  0001 C CNN
F 1 "GND" V 5205 2972 50  0000 R CNN
F 2 "" H 5200 3100 50  0001 C CNN
F 3 "" H 5200 3100 50  0001 C CNN
	1    5200 3100
	0    1    1    0   
$EndComp
$Comp
L power:GND #PWR?
U 1 1 5F06E07C
P 5200 3200
F 0 "#PWR?" H 5200 2950 50  0001 C CNN
F 1 "GND" V 5205 3072 50  0000 R CNN
F 2 "" H 5200 3200 50  0001 C CNN
F 3 "" H 5200 3200 50  0001 C CNN
	1    5200 3200
	0    1    1    0   
$EndComp
$Comp
L power:GND #PWR?
U 1 1 5F06E9A8
P 5200 3500
F 0 "#PWR?" H 5200 3250 50  0001 C CNN
F 1 "GND" V 5205 3372 50  0000 R CNN
F 2 "" H 5200 3500 50  0001 C CNN
F 3 "" H 5200 3500 50  0001 C CNN
	1    5200 3500
	0    1    1    0   
$EndComp
$Comp
L power:GND #PWR?
U 1 1 5F06E9AE
P 5200 3600
F 0 "#PWR?" H 5200 3350 50  0001 C CNN
F 1 "GND" V 5205 3472 50  0000 R CNN
F 2 "" H 5200 3600 50  0001 C CNN
F 3 "" H 5200 3600 50  0001 C CNN
	1    5200 3600
	0    1    1    0   
$EndComp
$Comp
L power:GND #PWR?
U 1 1 5F071244
P 5200 3900
F 0 "#PWR?" H 5200 3650 50  0001 C CNN
F 1 "GND" V 5205 3772 50  0000 R CNN
F 2 "" H 5200 3900 50  0001 C CNN
F 3 "" H 5200 3900 50  0001 C CNN
	1    5200 3900
	0    1    1    0   
$EndComp
$Comp
L power:GND #PWR?
U 1 1 5F07124A
P 5200 4000
F 0 "#PWR?" H 5200 3750 50  0001 C CNN
F 1 "GND" V 5205 3872 50  0000 R CNN
F 2 "" H 5200 4000 50  0001 C CNN
F 3 "" H 5200 4000 50  0001 C CNN
	1    5200 4000
	0    1    1    0   
$EndComp
$Comp
L power:GND #PWR?
U 1 1 5F071920
P 5200 4300
F 0 "#PWR?" H 5200 4050 50  0001 C CNN
F 1 "GND" V 5205 4172 50  0000 R CNN
F 2 "" H 5200 4300 50  0001 C CNN
F 3 "" H 5200 4300 50  0001 C CNN
	1    5200 4300
	0    1    1    0   
$EndComp
$Comp
L power:GND #PWR?
U 1 1 5F071926
P 5200 4400
F 0 "#PWR?" H 5200 4150 50  0001 C CNN
F 1 "GND" V 5205 4272 50  0000 R CNN
F 2 "" H 5200 4400 50  0001 C CNN
F 3 "" H 5200 4400 50  0001 C CNN
	1    5200 4400
	0    1    1    0   
$EndComp
$Comp
L power:GND #PWR?
U 1 1 5F072102
P 5200 4700
F 0 "#PWR?" H 5200 4450 50  0001 C CNN
F 1 "GND" V 5205 4572 50  0000 R CNN
F 2 "" H 5200 4700 50  0001 C CNN
F 3 "" H 5200 4700 50  0001 C CNN
	1    5200 4700
	0    1    1    0   
$EndComp
$Comp
L power:GND #PWR?
U 1 1 5F072108
P 5200 4800
F 0 "#PWR?" H 5200 4550 50  0001 C CNN
F 1 "GND" V 5205 4672 50  0000 R CNN
F 2 "" H 5200 4800 50  0001 C CNN
F 3 "" H 5200 4800 50  0001 C CNN
	1    5200 4800
	0    1    1    0   
$EndComp
$Comp
L power:GND #PWR?
U 1 1 5F0727D4
P 5200 5100
F 0 "#PWR?" H 5200 4850 50  0001 C CNN
F 1 "GND" V 5205 4972 50  0000 R CNN
F 2 "" H 5200 5100 50  0001 C CNN
F 3 "" H 5200 5100 50  0001 C CNN
	1    5200 5100
	0    1    1    0   
$EndComp
$Comp
L power:GND #PWR?
U 1 1 5F0727DA
P 5200 5200
F 0 "#PWR?" H 5200 4950 50  0001 C CNN
F 1 "GND" V 5205 5072 50  0000 R CNN
F 2 "" H 5200 5200 50  0001 C CNN
F 3 "" H 5200 5200 50  0001 C CNN
	1    5200 5200
	0    1    1    0   
$EndComp
$Comp
L power:GND #PWR?
U 1 1 5F07394E
P 5200 5500
F 0 "#PWR?" H 5200 5250 50  0001 C CNN
F 1 "GND" V 5205 5372 50  0000 R CNN
F 2 "" H 5200 5500 50  0001 C CNN
F 3 "" H 5200 5500 50  0001 C CNN
	1    5200 5500
	0    1    1    0   
$EndComp
$Comp
L power:GND #PWR?
U 1 1 5F073954
P 5200 5700
AR Path="/5EF3A6F3/5F073954" Ref="#PWR?"  Part="1" 
AR Path="/5EF3A6E9/5F073954" Ref="#PWR?"  Part="1" 
F 0 "#PWR?" H 5200 5450 50  0001 C CNN
F 1 "GND" V 5205 5572 50  0000 R CNN
F 2 "" H 5200 5700 50  0001 C CNN
F 3 "" H 5200 5700 50  0001 C CNN
	1    5200 5700
	0    1    1    0   
$EndComp
$Comp
L power:GND #PWR?
U 1 1 5F07776F
P 5200 5900
AR Path="/5EF3A6F3/5F07776F" Ref="#PWR?"  Part="1" 
AR Path="/5EF3A6E9/5F07776F" Ref="#PWR?"  Part="1" 
F 0 "#PWR?" H 5200 5650 50  0001 C CNN
F 1 "GND" V 5205 5772 50  0000 R CNN
F 2 "" H 5200 5900 50  0001 C CNN
F 3 "" H 5200 5900 50  0001 C CNN
	1    5200 5900
	0    1    1    0   
$EndComp
$Comp
L power:GND #PWR?
U 1 1 5F0784A6
P 7000 5600
AR Path="/5EF3A6F3/5F0784A6" Ref="#PWR?"  Part="1" 
AR Path="/5EF3A6E9/5F0784A6" Ref="#PWR?"  Part="1" 
F 0 "#PWR?" H 7000 5350 50  0001 C CNN
F 1 "GND" V 7005 5472 50  0000 R CNN
F 2 "" H 7000 5600 50  0001 C CNN
F 3 "" H 7000 5600 50  0001 C CNN
	1    7000 5600
	0    -1   1    0   
$EndComp
$Comp
L power:GND #PWR?
U 1 1 5F0784AC
P 7000 5800
F 0 "#PWR?" H 7000 5550 50  0001 C CNN
F 1 "GND" V 7005 5672 50  0000 R CNN
F 2 "" H 7000 5800 50  0001 C CNN
F 3 "" H 7000 5800 50  0001 C CNN
	1    7000 5800
	0    -1   1    0   
$EndComp
$Comp
L power:GND #PWR?
U 1 1 5F0874D5
P 7000 4700
AR Path="/5EF3A6F3/5F0874D5" Ref="#PWR?"  Part="1" 
AR Path="/5EF3A6E9/5F0874D5" Ref="#PWR?"  Part="1" 
F 0 "#PWR?" H 7000 4450 50  0001 C CNN
F 1 "GND" V 7005 4572 50  0000 R CNN
F 2 "" H 7000 4700 50  0001 C CNN
F 3 "" H 7000 4700 50  0001 C CNN
	1    7000 4700
	0    -1   1    0   
$EndComp
$Comp
L power:GND #PWR?
U 1 1 5F08DC61
P 7000 2100
F 0 "#PWR?" H 7000 1850 50  0001 C CNN
F 1 "GND" V 7005 1972 50  0000 R CNN
F 2 "" H 7000 2100 50  0001 C CNN
F 3 "" H 7000 2100 50  0001 C CNN
	1    7000 2100
	0    -1   1    0   
$EndComp
$Comp
L power:GND #PWR?
U 1 1 5F08DC67
P 7000 2200
F 0 "#PWR?" H 7000 1950 50  0001 C CNN
F 1 "GND" V 7005 2072 50  0000 R CNN
F 2 "" H 7000 2200 50  0001 C CNN
F 3 "" H 7000 2200 50  0001 C CNN
	1    7000 2200
	0    -1   1    0   
$EndComp
$Comp
L power:GND #PWR?
U 1 1 5F08E457
P 7000 2500
F 0 "#PWR?" H 7000 2250 50  0001 C CNN
F 1 "GND" V 7005 2372 50  0000 R CNN
F 2 "" H 7000 2500 50  0001 C CNN
F 3 "" H 7000 2500 50  0001 C CNN
	1    7000 2500
	0    -1   1    0   
$EndComp
$Comp
L power:GND #PWR?
U 1 1 5F08E45D
P 7000 2600
F 0 "#PWR?" H 7000 2350 50  0001 C CNN
F 1 "GND" V 7005 2472 50  0000 R CNN
F 2 "" H 7000 2600 50  0001 C CNN
F 3 "" H 7000 2600 50  0001 C CNN
	1    7000 2600
	0    -1   1    0   
$EndComp
$Comp
L power:GND #PWR?
U 1 1 5F0913EB
P 7000 2900
AR Path="/5EF3A6F3/5F0913EB" Ref="#PWR?"  Part="1" 
AR Path="/5EF3A6E9/5F0913EB" Ref="#PWR?"  Part="1" 
F 0 "#PWR?" H 7000 2650 50  0001 C CNN
F 1 "GND" V 7005 2772 50  0000 R CNN
F 2 "" H 7000 2900 50  0001 C CNN
F 3 "" H 7000 2900 50  0001 C CNN
	1    7000 2900
	0    -1   1    0   
$EndComp
$Comp
L power:GND #PWR?
U 1 1 5F0913F1
P 7000 3200
AR Path="/5EF3A6F3/5F0913F1" Ref="#PWR?"  Part="1" 
AR Path="/5EF3A6E9/5F0913F1" Ref="#PWR?"  Part="1" 
F 0 "#PWR?" H 7000 2950 50  0001 C CNN
F 1 "GND" V 7005 3072 50  0000 R CNN
F 2 "" H 7000 3200 50  0001 C CNN
F 3 "" H 7000 3200 50  0001 C CNN
	1    7000 3200
	0    -1   1    0   
$EndComp
$Comp
L power:GND #PWR?
U 1 1 5F09BF0D
P 7000 3500
AR Path="/5EF3A6F3/5F09BF0D" Ref="#PWR?"  Part="1" 
AR Path="/5EF3A6E9/5F09BF0D" Ref="#PWR?"  Part="1" 
F 0 "#PWR?" H 7000 3250 50  0001 C CNN
F 1 "GND" V 7005 3372 50  0000 R CNN
F 2 "" H 7000 3500 50  0001 C CNN
F 3 "" H 7000 3500 50  0001 C CNN
	1    7000 3500
	0    -1   1    0   
$EndComp
$Comp
L power:GND #PWR?
U 1 1 5F09C5D9
P 7000 3800
AR Path="/5EF3A6F3/5F09C5D9" Ref="#PWR?"  Part="1" 
AR Path="/5EF3A6E9/5F09C5D9" Ref="#PWR?"  Part="1" 
F 0 "#PWR?" H 7000 3550 50  0001 C CNN
F 1 "GND" V 7005 3672 50  0000 R CNN
F 2 "" H 7000 3800 50  0001 C CNN
F 3 "" H 7000 3800 50  0001 C CNN
	1    7000 3800
	0    -1   1    0   
$EndComp
$Comp
L power:GND #PWR?
U 1 1 5F09CC96
P 7000 4100
AR Path="/5EF3A6F3/5F09CC96" Ref="#PWR?"  Part="1" 
AR Path="/5EF3A6E9/5F09CC96" Ref="#PWR?"  Part="1" 
F 0 "#PWR?" H 7000 3850 50  0001 C CNN
F 1 "GND" V 7005 3972 50  0000 R CNN
F 2 "" H 7000 4100 50  0001 C CNN
F 3 "" H 7000 4100 50  0001 C CNN
	1    7000 4100
	0    -1   1    0   
$EndComp
$Comp
L power:GND #PWR?
U 1 1 5F09F419
P 7000 4400
AR Path="/5EF3A6F3/5F09F419" Ref="#PWR?"  Part="1" 
AR Path="/5EF3A6E9/5F09F419" Ref="#PWR?"  Part="1" 
F 0 "#PWR?" H 7000 4150 50  0001 C CNN
F 1 "GND" V 7005 4272 50  0000 R CNN
F 2 "" H 7000 4400 50  0001 C CNN
F 3 "" H 7000 4400 50  0001 C CNN
	1    7000 4400
	0    -1   1    0   
$EndComp
Text Label 4350 5000 0    50   ~ 0
SDA
Text Label 4350 4900 0    50   ~ 0
SCL
Wire Wire Line
	4350 4900 5200 4900
Wire Wire Line
	4350 5000 5200 5000
Text Notes 1300 2500 0    50   ~ 0
VITA 57.1- Observation 5.22: \nGA[0] is connected to Address bit [1] \nand GA[1] is connected to Address bit[0].
Text Label 750  1500 0    50   ~ 0
GA1
Wire Wire Line
	750  1600 1350 1600
Wire Wire Line
	750  1500 1350 1500
$Comp
L power:GND #PWR?
U 1 1 5F589CFC
P 1750 1900
F 0 "#PWR?" H 1750 1650 50  0001 C CNN
F 1 "GND" H 1755 1727 50  0000 C CNN
F 2 "" H 1750 1900 50  0001 C CNN
F 3 "" H 1750 1900 50  0001 C CNN
	1    1750 1900
	1    0    0    -1  
$EndComp
Text Label 3750 1600 2    50   ~ 0
SCL
Wire Wire Line
	3750 1600 3050 1600
Wire Wire Line
	3750 1500 2750 1500
Wire Wire Line
	2200 1900 2200 1700
Wire Wire Line
	2200 1700 2150 1700
$Comp
L power:GND #PWR?
U 1 1 5E357AF9
P 1300 1900
F 0 "#PWR?" H 1300 1650 50  0001 C CNN
F 1 "GND" H 1305 1727 50  0000 C CNN
F 2 "" H 1300 1900 50  0001 C CNN
F 3 "" H 1300 1900 50  0001 C CNN
	1    1300 1900
	-1   0    0    -1  
$EndComp
Wire Wire Line
	1300 1900 1300 1700
Wire Wire Line
	1300 1700 1350 1700
$Comp
L Device:C C7
U 1 1 5F41CE07
P 950 900
F 0 "C7" H 835 946 50  0000 R CNN
F 1 "0.1uF" H 835 855 50  0000 R CNN
F 2 "Capacitor_SMD:C_0402_1005Metric" H 988 750 50  0001 C CNN
F 3 "~" H 950 900 50  0001 C CNN
F 4 "16 V" H 950 900 50  0001 C CNN "info"
F 5 "AVT-IPE" H 950 900 50  0001 C CNN "stock"
	1    950  900 
	-1   0    0    -1  
$EndComp
$Comp
L power:GND #PWR?
U 1 1 5F41CDDB
P 950 1050
F 0 "#PWR?" H 950 800 50  0001 C CNN
F 1 "GND" H 955 877 50  0000 C CNN
F 2 "" H 950 1050 50  0001 C CNN
F 3 "" H 950 1050 50  0001 C CNN
	1    950  1050
	1    0    0    -1  
$EndComp
$Comp
L Device:R R11
U 1 1 5F41CDDC
P 2750 1250
F 0 "R11" H 2820 1204 50  0000 L CNN
F 1 "10k" H 2820 1295 50  0000 L CNN
F 2 "Resistor_SMD:R_0402_1005Metric" V 2680 1250 50  0001 C CNN
F 3 "~" H 2750 1250 50  0001 C CNN
F 4 "AVT-IPE" H 2750 1250 50  0001 C CNN "stock"
	1    2750 1250
	1    0    0    1   
$EndComp
$Comp
L Device:R R12
U 1 1 5F41CDDD
P 3050 1250
F 0 "R12" H 3120 1204 50  0000 L CNN
F 1 "10k" H 3120 1295 50  0000 L CNN
F 2 "Resistor_SMD:R_0402_1005Metric" V 2980 1250 50  0001 C CNN
F 3 "~" H 3050 1250 50  0001 C CNN
F 4 "AVT-IPE" H 3050 1250 50  0001 C CNN "stock"
	1    3050 1250
	1    0    0    1   
$EndComp
Wire Wire Line
	3050 1400 3050 1600
Connection ~ 3050 1600
Wire Wire Line
	3050 1600 2150 1600
Wire Wire Line
	2750 1400 2750 1500
Connection ~ 2750 1500
Wire Wire Line
	2750 1500 2150 1500
Wire Wire Line
	2750 1100 2750 1050
Wire Wire Line
	2750 1050 2900 1050
Wire Wire Line
	3050 1050 3050 1100
Wire Wire Line
	2900 1000 2900 1050
Connection ~ 2900 1050
Wire Wire Line
	2900 1050 3050 1050
Text Notes 9900 5200 0    50   ~ 0
VITA 57.1 - Rule 5.66: \nThe FMC JTAG signals require \nLVTTL (3.3V) levels on the\nJTAG signals.
$Comp
L KIT_Power:+3V3_STBY #PWR?
U 1 1 6176CD90
P 2900 1000
F 0 "#PWR?" H 2900 850 50  0001 C CNN
F 1 "+3V3_STBY" H 2915 1173 50  0000 C CNN
F 2 "" H 2900 1000 50  0001 C CNN
F 3 "" H 2900 1000 50  0001 C CNN
	1    2900 1000
	1    0    0    -1  
$EndComp
$Comp
L KIT_Power:+3V3_STBY #PWR?
U 1 1 5F589D2D
P 1750 1300
F 0 "#PWR?" H 1750 1150 50  0001 C CNN
F 1 "+3V3_STBY" H 1765 1473 50  0000 C CNN
F 2 "" H 1750 1300 50  0001 C CNN
F 3 "" H 1750 1300 50  0001 C CNN
	1    1750 1300
	1    0    0    -1  
$EndComp
$Comp
L KIT_Power:+3V3_STBY #PWR?
U 1 1 5F589D2E
P 950 750
F 0 "#PWR?" H 950 600 50  0001 C CNN
F 1 "+3V3_STBY" H 965 923 50  0000 C CNN
F 2 "" H 950 750 50  0001 C CNN
F 3 "" H 950 750 50  0001 C CNN
	1    950  750 
	1    0    0    -1  
$EndComp
$Comp
L Memory_EEPROM:AT24CS64-MAHM U6
U 1 1 5F589D10
P 1750 1600
F 0 "U6" H 1500 1850 50  0000 C CNN
F 1 "AT24C512C" H 2100 1850 50  0000 C CNN
F 2 "Package_DFN_QFN:DFN-8-1EP_3x2mm_P0.5mm_EP1.3x1.5mm" H 1750 1600 50  0001 C CNN
F 3 "http://ww1.microchip.com/downloads/en/DeviceDoc/Atmel-8870-SEEPROM-AT24CS64-Datasheet.pdf" H 1750 1600 50  0001 C CNN
F 4 "AT24C512C-MAHM-TCT-ND" H 1750 1600 50  0001 C CNN "digikey#"
	1    1750 1600
	1    0    0    -1  
$EndComp
Wire Wire Line
	7000 2300 7400 2300
Wire Wire Line
	7000 2400 7400 2400
Wire Notes Line
	-200 400  -200 850 
Wire Wire Line
	1900 5800 1900 5850
$Comp
L power:GND #PWR?
U 1 1 5F41CDDF
P 1900 5850
F 0 "#PWR?" H 1900 5600 50  0001 C CNN
F 1 "GND" H 1905 5677 50  0000 C CNN
F 2 "" H 1900 5850 50  0001 C CNN
F 3 "" H 1900 5850 50  0001 C CNN
	1    1900 5850
	1    0    0    -1  
$EndComp
$Comp
L Device:C C23
U 1 1 5F41CDE3
P 8850 6000
F 0 "C23" H 8965 6091 50  0000 L CNN
F 1 "1uF" H 8965 6000 50  0000 L CNN
F 2 "Capacitor_SMD:C_0402_1005Metric" H 8888 5850 50  0001 C CNN
F 3 "~" H 8850 6000 50  0001 C CNN
F 4 "16 V" H 8965 5909 50  0000 L CNN "info"
F 5 "AVT-IPE" H 8850 6000 50  0001 C CNN "stock"
	1    8850 6000
	1    0    0    -1  
$EndComp
$Comp
L Device:C C24
U 1 1 5F2EC4E7
P 9350 6000
F 0 "C24" H 9465 6091 50  0000 L CNN
F 1 "1uF" H 9465 6000 50  0000 L CNN
F 2 "Capacitor_SMD:C_0402_1005Metric" H 9388 5850 50  0001 C CNN
F 3 "~" H 9350 6000 50  0001 C CNN
F 4 "16 V" H 9465 5909 50  0000 L CNN "info"
F 5 "AVT-IPE" H 9350 6000 50  0001 C CNN "stock"
	1    9350 6000
	1    0    0    -1  
$EndComp
$Comp
L Device:C C13
U 1 1 5F9088CD
P 3650 5600
F 0 "C13" H 3535 5691 50  0000 R CNN
F 1 "10uF" H 3535 5600 50  0000 R CNN
F 2 "Capacitor_SMD:C_0603_1608Metric" H 3688 5450 50  0001 C CNN
F 3 "~" H 3650 5600 50  0001 C CNN
F 4 "AVT-IPE" H 3650 5600 50  0001 C CNN "stock"
F 5 "25V" H 3535 5509 50  0000 R CNN "info"
	1    3650 5600
	-1   0    0    -1  
$EndComp
$Comp
L Device:C C8
U 1 1 5F41CDFF
P 4100 5600
F 0 "C8" H 3985 5691 50  0000 R CNN
F 1 "1uF" H 3985 5600 50  0000 R CNN
F 2 "Capacitor_SMD:C_0402_1005Metric" H 4138 5450 50  0001 C CNN
F 3 "~" H 4100 5600 50  0001 C CNN
F 4 "16 V" H 3985 5509 50  0000 R CNN "info"
F 5 "AVT-IPE" H 4100 5600 50  0001 C CNN "stock"
	1    4100 5600
	-1   0    0    -1  
$EndComp
$Comp
L Device:C C18
U 1 1 5F2EC535
P 3150 5600
F 0 "C18" H 3035 5691 50  0000 R CNN
F 1 "22uF" H 3035 5600 50  0000 R CNN
F 2 "Capacitor_SMD:C_1210_3225Metric" H 3188 5450 50  0001 C CNN
F 3 "~" H 3150 5600 50  0001 C CNN
F 4 "AVT-IPE" H 3150 5600 50  0001 C CNN "stock"
F 5 "25V" H 3035 5509 50  0000 R CNN "info"
F 6 "" H 3150 5600 50  0001 C CNN "rs#"
	1    3150 5600
	-1   0    0    -1  
$EndComp
Wire Wire Line
	9350 5800 9350 5850
Wire Wire Line
	9350 6150 9350 6200
Wire Wire Line
	8850 6150 8850 6200
Wire Wire Line
	8850 6200 9350 6200
Wire Wire Line
	8850 5850 8850 5800
Wire Wire Line
	8850 5800 9350 5800
Wire Wire Line
	1900 5800 2150 5800
Wire Wire Line
	2650 5750 2650 5800
Wire Wire Line
	2150 5750 2150 5800
Connection ~ 2150 5800
Wire Wire Line
	2150 5800 2650 5800
Wire Wire Line
	3150 5400 3150 5450
Wire Wire Line
	3150 5750 3150 5800
Wire Wire Line
	3650 5400 3650 5450
Wire Wire Line
	3650 5750 3650 5800
Wire Wire Line
	2650 5400 2950 5400
Wire Wire Line
	2650 5800 3150 5800
Wire Wire Line
	4100 5400 4100 5450
Wire Wire Line
	4100 5750 4100 5800
Wire Wire Line
	3150 5400 3650 5400
Wire Wire Line
	3150 5800 3650 5800
$Comp
L Device:C C25
U 1 1 5F2EC528
P 9900 6000
F 0 "C25" H 10015 6091 50  0000 L CNN
F 1 "47uF" H 10015 6000 50  0000 L CNN
F 2 "Capacitor_SMD:C_0805_2012Metric" H 9938 5850 50  0001 C CNN
F 3 "~" H 9900 6000 50  0001 C CNN
F 4 "AVT-IPE" H 9900 6000 50  0001 C CNN "stock"
F 5 "10V" H 10015 5909 50  0000 L CNN "info"
	1    9900 6000
	1    0    0    -1  
$EndComp
$Comp
L Device:C C9
U 1 1 5F41CE11
P 2150 5600
F 0 "C9" H 2035 5691 50  0000 R CNN
F 1 "22uF" H 2035 5600 50  0000 R CNN
F 2 "Capacitor_SMD:C_1210_3225Metric" H 2188 5450 50  0001 C CNN
F 3 "~" H 2150 5600 50  0001 C CNN
F 4 "AVT-IPE" H 2150 5600 50  0001 C CNN "stock"
F 5 "25V" H 2035 5509 50  0000 R CNN "info"
F 6 "" H 2150 5600 50  0001 C CNN "rs#"
	1    2150 5600
	-1   0    0    -1  
$EndComp
$Comp
L Device:C C14
U 1 1 5F41CE12
P 2650 5600
F 0 "C14" H 2535 5691 50  0000 R CNN
F 1 "22uF" H 2535 5600 50  0000 R CNN
F 2 "Capacitor_SMD:C_1210_3225Metric" H 2688 5450 50  0001 C CNN
F 3 "~" H 2650 5600 50  0001 C CNN
F 4 "AVT-IPE" H 2650 5600 50  0001 C CNN "stock"
F 5 "25V" H 2535 5509 50  0000 R CNN "info"
F 6 "" H 2650 5600 50  0001 C CNN "rs#"
	1    2650 5600
	-1   0    0    -1  
$EndComp
Wire Wire Line
	9350 5800 9600 5800
Wire Wire Line
	9900 5800 9900 5850
Connection ~ 9350 5800
Wire Wire Line
	9900 6150 9900 6200
Wire Wire Line
	9900 6200 9350 6200
Connection ~ 9350 6200
$Comp
L power:+12V #PWR?
U 1 1 5F2EC500
P 1900 5350
AR Path="/5F2EC500" Ref="#PWR?"  Part="1" 
AR Path="/5EF3A6E9/5F2EC500" Ref="#PWR?"  Part="1" 
F 0 "#PWR?" H 1900 5200 50  0001 C CNN
F 1 "+12V" H 1915 5523 50  0000 C CNN
F 2 "" H 1900 5350 50  0001 C CNN
F 3 "" H 1900 5350 50  0001 C CNN
	1    1900 5350
	1    0    0    -1  
$EndComp
Wire Wire Line
	1900 5350 1900 5400
Wire Wire Line
	1900 5400 2150 5400
Wire Wire Line
	2650 5400 2650 5450
Wire Wire Line
	2150 5450 2150 5400
Connection ~ 2150 5400
Wire Wire Line
	2150 5400 2650 5400
Text Label 750  1600 0    50   ~ 0
GA0
Text Label 3750 1500 2    50   ~ 0
SDA
Text Label 7500 5400 2    50   ~ 0
GA1
Wire Wire Line
	4350 5300 5200 5300
Wire Wire Line
	7500 5400 7000 5400
Text Label 4350 5300 0    50   ~ 0
GA0
Connection ~ 2650 5400
Connection ~ 2650 5800
Connection ~ 3150 5400
Connection ~ 3150 5800
Wire Wire Line
	3650 5400 4100 5400
Connection ~ 3650 5400
Wire Wire Line
	3650 5800 4100 5800
Connection ~ 3650 5800
Text Notes 8250 2350 0    50   ~ 0
MGTREFCLK1_226
$Comp
L KIT_Power:+3V3_STBY #PWR?
U 1 1 5FD341DB
P 7350 5100
F 0 "#PWR?" H 7350 4950 50  0001 C CNN
F 1 "+3V3_STBY" V 7365 5228 50  0000 L CNN
F 2 "" H 7350 5100 50  0001 C CNN
F 3 "" H 7350 5100 50  0001 C CNN
	1    7350 5100
	0    1    1    0   
$EndComp
Wire Wire Line
	7350 5100 7000 5100
Text Label 9350 2000 0    50   ~ 0
PG_C2M
$Comp
L power:GND #PWR?
U 1 1 5FE0B4E6
P 10500 2450
F 0 "#PWR?" H 10500 2200 50  0001 C CNN
F 1 "GND" H 10505 2277 50  0000 C CNN
F 2 "" H 10500 2450 50  0001 C CNN
F 3 "" H 10500 2450 50  0001 C CNN
	1    10500 2450
	1    0    0    -1  
$EndComp
$Comp
L Device:R R26
U 1 1 5FE0B4EC
P 9950 2200
F 0 "R26" H 10020 2246 50  0000 L CNN
F 1 "10k" H 10020 2155 50  0000 L CNN
F 2 "Resistor_SMD:R_0402_1005Metric" V 9880 2200 50  0001 C CNN
F 3 "~" H 9950 2200 50  0001 C CNN
F 4 "AVT-IPE" H 9950 2200 50  0001 C CNN "stock"
	1    9950 2200
	1    0    0    -1  
$EndComp
Wire Wire Line
	9950 2000 9950 2050
Connection ~ 9950 2000
Wire Wire Line
	9950 2000 10200 2000
Wire Wire Line
	9950 2350 9950 2400
Wire Wire Line
	9950 2400 10500 2400
Wire Wire Line
	10500 2400 10500 2450
Wire Wire Line
	10500 2400 10500 2200
Connection ~ 10500 2400
$Comp
L Device:LED D7
U 1 1 5FE0B4FB
P 10500 1600
F 0 "D7" V 10539 1483 50  0000 R CNN
F 1 "GRN" V 10448 1483 50  0000 R CNN
F 2 "LED_SMD:LED_0603_1608Metric" H 10500 1600 50  0001 C CNN
F 3 "~" H 10500 1600 50  0001 C CNN
F 4 "691-0408" V 10500 1600 50  0001 C CNN "rs#"
F 5 "Broadcom" H 10500 1600 50  0001 C CNN "manf"
F 6 "HSME-C191" H 10500 1600 50  0001 C CNN "manf#"
	1    10500 1600
	0    -1   -1   0   
$EndComp
Wire Wire Line
	10500 1750 10500 1800
$Comp
L Device:R R27
U 1 1 5FE0B502
P 10500 1250
F 0 "R27" H 10570 1296 50  0000 L CNN
F 1 "470" H 10570 1205 50  0000 L CNN
F 2 "Resistor_SMD:R_0402_1005Metric" V 10430 1250 50  0001 C CNN
F 3 "~" H 10500 1250 50  0001 C CNN
	1    10500 1250
	1    0    0    -1  
$EndComp
Wire Wire Line
	10500 1400 10500 1450
$Comp
L KIT_Power:+3V3_STBY #PWR?
U 1 1 5FE0B509
P 10500 1100
F 0 "#PWR?" H 10500 950 50  0001 C CNN
F 1 "+3V3_STBY" H 10515 1273 50  0000 C CNN
F 2 "" H 10500 1100 50  0001 C CNN
F 3 "" H 10500 1100 50  0001 C CNN
	1    10500 1100
	1    0    0    -1  
$EndComp
$Comp
L KIT_Transistor_FET:FDV301N Q4
U 1 1 5FE0B50F
P 10400 2000
F 0 "Q4" H 10606 2046 50  0000 L CNN
F 1 "FDV301N" H 10606 1955 50  0000 L CNN
F 2 "Package_TO_SOT_SMD:SOT-23" H 10600 1925 50  0001 L CIN
F 3 "https://media.digikey.com/pdf/Data%20Sheets/Fairchild%20PDFs/FDV301N.pdf" H 10400 2000 50  0001 L CNN
	1    10400 2000
	1    0    0    -1  
$EndComp
Wire Wire Line
	7000 2000 9950 2000
Wire Wire Line
	9400 5200 7000 5200
Wire Wire Line
	9400 5000 7000 5000
Wire Wire Line
	9400 4900 7000 4900
Wire Wire Line
	9400 4800 7000 4800
Text GLabel 9400 4800 2    50   Output ~ 0
TCK
Text GLabel 9400 4900 2    50   Output ~ 0
TDI
Text GLabel 9400 5000 2    50   Input ~ 0
TDO
Text GLabel 9400 5200 2    50   Output ~ 0
TMS
Wire Wire Line
	7000 5500 7600 5500
Wire Wire Line
	7000 5700 7600 5700
Wire Wire Line
	7000 5900 7600 5900
Connection ~ 9900 5800
$Comp
L power:GND #PWR?
U 1 1 5F589CFD
P 2200 1900
F 0 "#PWR?" H 2200 1650 50  0001 C CNN
F 1 "GND" H 2205 1727 50  0000 C CNN
F 2 "" H 2200 1900 50  0001 C CNN
F 3 "" H 2200 1900 50  0001 C CNN
	1    2200 1900
	1    0    0    -1  
$EndComp
Connection ~ 9900 6200
Wire Wire Line
	4100 5400 4600 5400
Connection ~ 4100 5400
Wire Wire Line
	4600 5600 4600 5400
Wire Wire Line
	4600 5600 5200 5600
Connection ~ 4600 5400
Wire Wire Line
	4600 5400 5200 5400
Wire Wire Line
	4800 6350 4800 5800
Wire Wire Line
	4800 5800 5200 5800
Wire Wire Line
	4550 6350 4800 6350
Connection ~ 4550 6350
Wire Wire Line
	4550 6700 4550 6750
Wire Wire Line
	4550 6350 4550 6400
Wire Wire Line
	4300 6750 4550 6750
Wire Wire Line
	4300 6350 4550 6350
$Comp
L KIT_Power:+3V3_STBY #PWR?
U 1 1 5E440CDF
P 4300 6300
F 0 "#PWR?" H 4300 6150 50  0001 C CNN
F 1 "+3V3_STBY" H 4315 6473 50  0000 C CNN
F 2 "" H 4300 6300 50  0001 C CNN
F 3 "" H 4300 6300 50  0001 C CNN
	1    4300 6300
	1    0    0    -1  
$EndComp
$Comp
L power:GND #PWR?
U 1 1 5F41CDF7
P 4300 6800
F 0 "#PWR?" H 4300 6550 50  0001 C CNN
F 1 "GND" H 4305 6627 50  0000 C CNN
F 2 "" H 4300 6800 50  0001 C CNN
F 3 "" H 4300 6800 50  0001 C CNN
	1    4300 6800
	1    0    0    -1  
$EndComp
Wire Wire Line
	4300 6750 4300 6800
Wire Wire Line
	4300 6350 4300 6300
$Comp
L Device:C C10
U 1 1 5F2EC4E4
P 4550 6550
F 0 "C10" H 4665 6641 50  0000 L CNN
F 1 "1uF" H 4665 6550 50  0000 L CNN
F 2 "Capacitor_SMD:C_0402_1005Metric" H 4588 6400 50  0001 C CNN
F 3 "~" H 4550 6550 50  0001 C CNN
F 4 "16 V" H 4665 6459 50  0000 L CNN "info"
F 5 "AVT-IPE" H 4550 6550 50  0001 C CNN "stock"
	1    4550 6550
	1    0    0    -1  
$EndComp
Wire Notes Line
	9300 4700 11150 4700
Wire Notes Line
	11150 4700 11150 5400
Wire Notes Line
	11150 5400 9300 5400
Wire Notes Line
	9300 5400 9300 4700
Wire Wire Line
	4800 2900 5200 2900
Wire Wire Line
	4800 3000 5200 3000
Wire Wire Line
	7400 3000 7000 3000
Wire Wire Line
	7400 3100 7000 3100
Wire Wire Line
	7400 2700 7000 2700
Wire Wire Line
	7400 2800 7000 2800
Text GLabel 7400 3100 2    50   BiDi ~ 0
SD_DATA3
Text GLabel 7400 3000 2    50   BiDi ~ 0
SD_DATA2
Text GLabel 4800 3000 0    50   BiDi ~ 0
SD_DATA1
Text GLabel 4800 2900 0    50   BiDi ~ 0
SD_DATA0
Text GLabel 7400 2800 2    50   Input ~ 0
SD_CD
Text GLabel 7400 2700 2    50   Input ~ 0
SD_SEL
Wire Wire Line
	7400 3300 7000 3300
Wire Wire Line
	7400 3400 7000 3400
Text GLabel 7400 3300 2    50   Input ~ 0
SD_CMD
Text GLabel 7400 3400 2    50   Input ~ 0
SD_CLK
Text GLabel 4800 2500 0    50   Input ~ 0
PS_MGT_TX_P0
Text GLabel 4800 2600 0    50   Input ~ 0
PS_MGT_TX_N0
Wire Wire Line
	4800 2500 5200 2500
Wire Wire Line
	4800 2600 5200 2600
Wire Wire Line
	4800 2200 5200 2200
Wire Wire Line
	4800 2100 5200 2100
Text GLabel 4800 2200 0    50   Output ~ 0
PS_MGT_RX_N0
Text GLabel 4800 2100 0    50   Output ~ 0
PS_MGT_RX_P0
Text Notes 4100 2150 2    50   ~ 0
SGMII
Text Notes 4100 2550 2    50   ~ 0
SGMII
Text Notes 4200 4950 2    50   ~ 0
Not Connected in Motherboard!
Wire Notes Line
	4700 4800 4700 5050
Wire Notes Line
	4700 5050 2950 5050
Wire Notes Line
	2950 5050 2950 4800
Wire Notes Line
	2950 4800 4700 4800
Text Label 4350 3300 0    50   ~ 0
PCIE_RST_N
Text Label 4350 3400 0    50   ~ 0
FPD_HEARTBEAT_LED
Text Label 4600 3700 0    50   ~ 0
I2C_SCL
Text Label 4600 3800 0    50   ~ 0
I2C_SDA
Text Label 7750 3600 2    50   ~ 0
I2C_RESET_B
Text Label 7750 3700 2    50   ~ 0
I2C_INTERRUPT_B
Text Notes 7350 1950 0    50   ~ 0
PG_C2M Connected hard to 3V3 in Motherboard!\n
Text Notes 8250 2450 0    50   ~ 0
Not connected in Motherboard!
Text Notes 8200 3900 0    50   ~ 0
Not connected in Motherboard!
Text Notes 2700 4150 0    50   ~ 0
Not connected in Motherboard!
Wire Wire Line
	10400 6150 10400 6200
$Comp
L Device:C C65
U 1 1 5F5D1A9A
P 10400 6000
F 0 "C65" H 10285 6091 50  0000 R CNN
F 1 "100uF" H 10285 6000 50  0000 R CNN
F 2 "Capacitor_SMD:C_1210_3225Metric" H 10438 5850 50  0001 C CNN
F 3 "~" H 10400 6000 50  0001 C CNN
F 4 "AVT-IPE" H 10400 6000 50  0001 C CNN "stock"
F 5 "10V" H 10285 5909 50  0000 R CNN "info"
	1    10400 6000
	-1   0    0    -1  
$EndComp
$Comp
L KIT_Power:+3V3_STBY #PWR?
U 1 1 5F5E5643
P 10750 5750
F 0 "#PWR?" H 10750 5600 50  0001 C CNN
F 1 "+3V3_STBY" H 10765 5923 50  0000 C CNN
F 2 "" H 10750 5750 50  0001 C CNN
F 3 "" H 10750 5750 50  0001 C CNN
	1    10750 5750
	1    0    0    -1  
$EndComp
Wire Wire Line
	10750 5800 10750 5750
$Comp
L power:GND #PWR?
U 1 1 5F5E564B
P 10750 6250
F 0 "#PWR?" H 10750 6000 50  0001 C CNN
F 1 "GND" H 10755 6077 50  0000 C CNN
F 2 "" H 10750 6250 50  0001 C CNN
F 3 "" H 10750 6250 50  0001 C CNN
	1    10750 6250
	1    0    0    -1  
$EndComp
Wire Wire Line
	10750 6250 10750 6200
Wire Wire Line
	10750 6200 10400 6200
Wire Wire Line
	9900 5800 10400 5800
Wire Wire Line
	10400 5850 10400 5800
Connection ~ 10400 5800
Wire Wire Line
	10400 5800 10750 5800
Wire Wire Line
	9900 6200 10400 6200
Connection ~ 10400 6200
$Comp
L Device:C C74
U 1 1 5F67F318
P 8350 6000
F 0 "C74" H 8465 6091 50  0000 L CNN
F 1 "1uF" H 8465 6000 50  0000 L CNN
F 2 "Capacitor_SMD:C_0402_1005Metric" H 8388 5850 50  0001 C CNN
F 3 "~" H 8350 6000 50  0001 C CNN
F 4 "16 V" H 8465 5909 50  0000 L CNN "info"
F 5 "AVT-IPE" H 8350 6000 50  0001 C CNN "stock"
	1    8350 6000
	1    0    0    -1  
$EndComp
Wire Wire Line
	8350 5850 8350 5800
Connection ~ 8350 5800
Wire Wire Line
	8350 5800 8850 5800
Wire Wire Line
	8350 6150 8350 6200
Wire Wire Line
	8350 6200 8850 6200
$Comp
L Device:C C21
U 1 1 5F6844E1
P 7850 6000
F 0 "C21" H 7965 6091 50  0000 L CNN
F 1 "1uF" H 7965 6000 50  0000 L CNN
F 2 "Capacitor_SMD:C_0402_1005Metric" H 7888 5850 50  0001 C CNN
F 3 "~" H 7850 6000 50  0001 C CNN
F 4 "16 V" H 7965 5909 50  0000 L CNN "info"
F 5 "AVT-IPE" H 7850 6000 50  0001 C CNN "stock"
	1    7850 6000
	1    0    0    -1  
$EndComp
Wire Wire Line
	7850 5800 8350 5800
Wire Wire Line
	7850 6150 7850 6200
Wire Wire Line
	7850 6200 8350 6200
Wire Wire Line
	7600 5900 7600 5700
Connection ~ 7600 5700
Wire Wire Line
	7600 5700 7600 5500
Wire Wire Line
	7600 5500 7850 5500
Wire Wire Line
	7850 5500 7850 5800
Connection ~ 7600 5500
Connection ~ 7850 5800
Wire Wire Line
	7850 5800 7850 5850
Text Notes 7500 2300 0    50   ~ 0
PL_MGT_CLK_P7
Text Notes 7500 2400 0    50   ~ 0
PL_MGT_CLK_N7
NoConn ~ 7400 2300
NoConn ~ 7400 2400
Wire Wire Line
	4800 4100 5200 4100
Wire Wire Line
	4800 4200 5200 4200
Wire Wire Line
	7400 3900 7000 3900
Wire Wire Line
	7400 4000 7000 4000
Text GLabel 1600 2900 0    50   BiDi ~ 0
B66_IO_[0..51]
Wire Bus Line
	1800 2900 1600 2900
Text GLabel 1600 3050 0    50   BiDi ~ 0
B65_IO_[0..51]
Wire Bus Line
	1800 3050 1600 3050
Wire Wire Line
	5200 3300 3750 3300
Wire Wire Line
	5200 3400 3750 3400
Wire Wire Line
	5200 3700 3750 3700
Wire Wire Line
	5200 3800 3750 3800
Wire Wire Line
	5200 4500 3750 4500
Wire Wire Line
	5200 4600 3750 4600
Wire Wire Line
	8450 3600 7000 3600
Wire Wire Line
	8450 3700 7000 3700
Wire Wire Line
	8450 4200 7000 4200
Wire Wire Line
	8450 4300 7000 4300
Wire Wire Line
	8450 4500 7000 4500
Wire Wire Line
	8450 4600 7000 4600
Text Label 8450 4300 2    50   ~ 0
B66_IO_28
Text Label 8450 4200 2    50   ~ 0
B66_IO_36
Text Label 3750 3800 0    50   ~ 0
B66_IO_44
Text Label 3750 3700 0    50   ~ 0
B66_IO_47
Text Label 8450 3700 2    50   ~ 0
B66_IO_42
Text Label 8450 3600 2    50   ~ 0
B66_IO_46
Text Label 3750 3400 0    50   ~ 0
B66_IO_39
Text Label 3750 3300 0    50   ~ 0
B66_IO_50
Text Label 3750 4500 0    50   ~ 0
B66_IO_20
Text Label 8450 4500 2    50   ~ 0
B66_IO_19
Text Label 3750 4600 0    50   ~ 0
B66_IO_22
Text Label 8450 4600 2    50   ~ 0
B66_IO_16
Text GLabel 7400 3900 2    50   Output ~ 0
SD_DIR_CMD
Text GLabel 7400 4000 2    50   Output ~ 0
SD_DIR_DAT0
Text GLabel 4800 4100 0    50   Output ~ 0
SD_DIR_DAT1
NoConn ~ 4800 4200
Text GLabel 9400 5300 2    50   Output ~ 0
TRST_L
Wire Wire Line
	7000 5300 9400 5300
$Comp
L power:PWR_FLAG #FLG?
U 1 1 5FAFCE24
P 2950 5400
F 0 "#FLG?" H 2950 5475 50  0001 C CNN
F 1 "PWR_FLAG" H 2950 5573 50  0000 C CNN
F 2 "" H 2950 5400 50  0001 C CNN
F 3 "~" H 2950 5400 50  0001 C CNN
	1    2950 5400
	1    0    0    -1  
$EndComp
Connection ~ 2950 5400
Wire Wire Line
	2950 5400 3150 5400
$Comp
L power:PWR_FLAG #FLG?
U 1 1 5FAFE78C
P 9600 5800
F 0 "#FLG?" H 9600 5875 50  0001 C CNN
F 1 "PWR_FLAG" H 9600 5973 50  0000 C CNN
F 2 "" H 9600 5800 50  0001 C CNN
F 3 "~" H 9600 5800 50  0001 C CNN
	1    9600 5800
	1    0    0    -1  
$EndComp
Connection ~ 9600 5800
Wire Wire Line
	9600 5800 9900 5800
$EndSCHEMATC
