EESchema Schematic File Version 4
EELAYER 30 0
EELAYER END
$Descr A4 11693 8268
encoding utf-8
Sheet 24 28
Title "ZynqMP Mezzanine FMC+ (BuZZyBoard)"
Date "2020-10-02"
Rev "1.0"
Comp "Karlsruhe Institute of Technology (KIT)"
Comment1 "Institute for Data Processing and Electronics (IPE)"
Comment2 "Luis Ardila"
Comment3 ""
Comment4 ""
$EndDescr
$Comp
L KIT_Connector:FMCP_VITA57.4 J2
U 4 1 5EEF4A7E
P 5150 1950
AR Path="/5EEF4A7E" Ref="J2"  Part="4" 
AR Path="/5EF3A6ED/5EEF4A7E" Ref="J2"  Part="4" 
F 0 "J2" H 6000 2240 60  0000 C CNN
F 1 "FMCP_VITA57.4" H 6000 2134 60  0000 C CNN
F 2 "KIT_Connector:FMC_SEAM_ASP_184330_BGA-560_40x14_55.778x19.76mm" H 5250 1800 60  0001 L CNN
F 3 "http://suddendocs.samtec.com/prints/asp-188588-01-mkt.pdf" H 5250 1600 60  0001 L CNN
	4    5150 1950
	1    0    0    -1  
$EndComp
$Comp
L power:GND #PWR?
U 1 1 5F0D471D
P 5150 2650
AR Path="/5EF3A6F3/5F0D471D" Ref="#PWR?"  Part="1" 
AR Path="/5EF3A6EB/5F0D471D" Ref="#PWR?"  Part="1" 
AR Path="/5EF3A6ED/5F0D471D" Ref="#PWR?"  Part="1" 
F 0 "#PWR?" H 5150 2400 50  0001 C CNN
F 1 "GND" V 5155 2522 50  0000 R CNN
F 2 "" H 5150 2650 50  0001 C CNN
F 3 "" H 5150 2650 50  0001 C CNN
	1    5150 2650
	0    1    -1   0   
$EndComp
$Comp
L power:GND #PWR?
U 1 1 5F0D4723
P 5150 2350
AR Path="/5EF3A6F3/5F0D4723" Ref="#PWR?"  Part="1" 
AR Path="/5EF3A6EB/5F0D4723" Ref="#PWR?"  Part="1" 
AR Path="/5EF3A6ED/5F0D4723" Ref="#PWR?"  Part="1" 
F 0 "#PWR?" H 5150 2100 50  0001 C CNN
F 1 "GND" V 5155 2222 50  0000 R CNN
F 2 "" H 5150 2350 50  0001 C CNN
F 3 "" H 5150 2350 50  0001 C CNN
	1    5150 2350
	0    1    -1   0   
$EndComp
$Comp
L power:GND #PWR?
U 1 1 5F0D4F91
P 5150 2250
AR Path="/5EF3A6F3/5F0D4F91" Ref="#PWR?"  Part="1" 
AR Path="/5EF3A6EB/5F0D4F91" Ref="#PWR?"  Part="1" 
AR Path="/5EF3A6ED/5F0D4F91" Ref="#PWR?"  Part="1" 
F 0 "#PWR?" H 5150 2000 50  0001 C CNN
F 1 "GND" V 5155 2122 50  0000 R CNN
F 2 "" H 5150 2250 50  0001 C CNN
F 3 "" H 5150 2250 50  0001 C CNN
	1    5150 2250
	0    1    -1   0   
$EndComp
$Comp
L power:GND #PWR?
U 1 1 5F0D4F97
P 5150 1950
AR Path="/5EF3A6F3/5F0D4F97" Ref="#PWR?"  Part="1" 
AR Path="/5EF3A6EB/5F0D4F97" Ref="#PWR?"  Part="1" 
AR Path="/5EF3A6ED/5F0D4F97" Ref="#PWR?"  Part="1" 
F 0 "#PWR?" H 5150 1700 50  0001 C CNN
F 1 "GND" V 5155 1822 50  0000 R CNN
F 2 "" H 5150 1950 50  0001 C CNN
F 3 "" H 5150 1950 50  0001 C CNN
	1    5150 1950
	0    1    -1   0   
$EndComp
$Comp
L power:GND #PWR?
U 1 1 5F0D5B9B
P 5150 3250
AR Path="/5EF3A6F3/5F0D5B9B" Ref="#PWR?"  Part="1" 
AR Path="/5EF3A6EB/5F0D5B9B" Ref="#PWR?"  Part="1" 
AR Path="/5EF3A6ED/5F0D5B9B" Ref="#PWR?"  Part="1" 
F 0 "#PWR?" H 5150 3000 50  0001 C CNN
F 1 "GND" V 5155 3122 50  0000 R CNN
F 2 "" H 5150 3250 50  0001 C CNN
F 3 "" H 5150 3250 50  0001 C CNN
	1    5150 3250
	0    1    -1   0   
$EndComp
$Comp
L power:GND #PWR?
U 1 1 5F0D5BA1
P 5150 2950
AR Path="/5EF3A6F3/5F0D5BA1" Ref="#PWR?"  Part="1" 
AR Path="/5EF3A6EB/5F0D5BA1" Ref="#PWR?"  Part="1" 
AR Path="/5EF3A6ED/5F0D5BA1" Ref="#PWR?"  Part="1" 
F 0 "#PWR?" H 5150 2700 50  0001 C CNN
F 1 "GND" V 5155 2822 50  0000 R CNN
F 2 "" H 5150 2950 50  0001 C CNN
F 3 "" H 5150 2950 50  0001 C CNN
	1    5150 2950
	0    1    -1   0   
$EndComp
$Comp
L power:GND #PWR?
U 1 1 5F0D7B07
P 5150 3850
AR Path="/5EF3A6F3/5F0D7B07" Ref="#PWR?"  Part="1" 
AR Path="/5EF3A6EB/5F0D7B07" Ref="#PWR?"  Part="1" 
AR Path="/5EF3A6ED/5F0D7B07" Ref="#PWR?"  Part="1" 
F 0 "#PWR?" H 5150 3600 50  0001 C CNN
F 1 "GND" V 5155 3722 50  0000 R CNN
F 2 "" H 5150 3850 50  0001 C CNN
F 3 "" H 5150 3850 50  0001 C CNN
	1    5150 3850
	0    1    -1   0   
$EndComp
$Comp
L power:GND #PWR?
U 1 1 5F0D7B0D
P 5150 3550
AR Path="/5EF3A6F3/5F0D7B0D" Ref="#PWR?"  Part="1" 
AR Path="/5EF3A6EB/5F0D7B0D" Ref="#PWR?"  Part="1" 
AR Path="/5EF3A6ED/5F0D7B0D" Ref="#PWR?"  Part="1" 
F 0 "#PWR?" H 5150 3300 50  0001 C CNN
F 1 "GND" V 5155 3422 50  0000 R CNN
F 2 "" H 5150 3550 50  0001 C CNN
F 3 "" H 5150 3550 50  0001 C CNN
	1    5150 3550
	0    1    -1   0   
$EndComp
$Comp
L power:GND #PWR?
U 1 1 5F0D81B3
P 5150 4450
AR Path="/5EF3A6F3/5F0D81B3" Ref="#PWR?"  Part="1" 
AR Path="/5EF3A6EB/5F0D81B3" Ref="#PWR?"  Part="1" 
AR Path="/5EF3A6ED/5F0D81B3" Ref="#PWR?"  Part="1" 
F 0 "#PWR?" H 5150 4200 50  0001 C CNN
F 1 "GND" V 5155 4322 50  0000 R CNN
F 2 "" H 5150 4450 50  0001 C CNN
F 3 "" H 5150 4450 50  0001 C CNN
	1    5150 4450
	0    1    -1   0   
$EndComp
$Comp
L power:GND #PWR?
U 1 1 5F0D81B9
P 5150 4150
AR Path="/5EF3A6F3/5F0D81B9" Ref="#PWR?"  Part="1" 
AR Path="/5EF3A6EB/5F0D81B9" Ref="#PWR?"  Part="1" 
AR Path="/5EF3A6ED/5F0D81B9" Ref="#PWR?"  Part="1" 
F 0 "#PWR?" H 5150 3900 50  0001 C CNN
F 1 "GND" V 5155 4022 50  0000 R CNN
F 2 "" H 5150 4150 50  0001 C CNN
F 3 "" H 5150 4150 50  0001 C CNN
	1    5150 4150
	0    1    -1   0   
$EndComp
$Comp
L power:GND #PWR?
U 1 1 5F0DA3D1
P 5150 5050
AR Path="/5EF3A6F3/5F0DA3D1" Ref="#PWR?"  Part="1" 
AR Path="/5EF3A6EB/5F0DA3D1" Ref="#PWR?"  Part="1" 
AR Path="/5EF3A6ED/5F0DA3D1" Ref="#PWR?"  Part="1" 
F 0 "#PWR?" H 5150 4800 50  0001 C CNN
F 1 "GND" V 5155 4922 50  0000 R CNN
F 2 "" H 5150 5050 50  0001 C CNN
F 3 "" H 5150 5050 50  0001 C CNN
	1    5150 5050
	0    1    -1   0   
$EndComp
$Comp
L power:GND #PWR?
U 1 1 5F0DA3D7
P 5150 4750
AR Path="/5EF3A6F3/5F0DA3D7" Ref="#PWR?"  Part="1" 
AR Path="/5EF3A6EB/5F0DA3D7" Ref="#PWR?"  Part="1" 
AR Path="/5EF3A6ED/5F0DA3D7" Ref="#PWR?"  Part="1" 
F 0 "#PWR?" H 5150 4500 50  0001 C CNN
F 1 "GND" V 5155 4622 50  0000 R CNN
F 2 "" H 5150 4750 50  0001 C CNN
F 3 "" H 5150 4750 50  0001 C CNN
	1    5150 4750
	0    1    -1   0   
$EndComp
$Comp
L power:GND #PWR?
U 1 1 5F0DAC65
P 5150 5650
AR Path="/5EF3A6F3/5F0DAC65" Ref="#PWR?"  Part="1" 
AR Path="/5EF3A6EB/5F0DAC65" Ref="#PWR?"  Part="1" 
AR Path="/5EF3A6ED/5F0DAC65" Ref="#PWR?"  Part="1" 
F 0 "#PWR?" H 5150 5400 50  0001 C CNN
F 1 "GND" V 5155 5522 50  0000 R CNN
F 2 "" H 5150 5650 50  0001 C CNN
F 3 "" H 5150 5650 50  0001 C CNN
	1    5150 5650
	0    1    -1   0   
$EndComp
$Comp
L power:GND #PWR?
U 1 1 5F0DAC6B
P 5150 5350
AR Path="/5EF3A6F3/5F0DAC6B" Ref="#PWR?"  Part="1" 
AR Path="/5EF3A6EB/5F0DAC6B" Ref="#PWR?"  Part="1" 
AR Path="/5EF3A6ED/5F0DAC6B" Ref="#PWR?"  Part="1" 
F 0 "#PWR?" H 5150 5100 50  0001 C CNN
F 1 "GND" V 5155 5222 50  0000 R CNN
F 2 "" H 5150 5350 50  0001 C CNN
F 3 "" H 5150 5350 50  0001 C CNN
	1    5150 5350
	0    1    -1   0   
$EndComp
$Comp
L power:GND #PWR?
U 1 1 5F0DB453
P 6850 5450
AR Path="/5EF3A6F3/5F0DB453" Ref="#PWR?"  Part="1" 
AR Path="/5EF3A6EB/5F0DB453" Ref="#PWR?"  Part="1" 
AR Path="/5EF3A6ED/5F0DB453" Ref="#PWR?"  Part="1" 
F 0 "#PWR?" H 6850 5200 50  0001 C CNN
F 1 "GND" V 6855 5322 50  0000 R CNN
F 2 "" H 6850 5450 50  0001 C CNN
F 3 "" H 6850 5450 50  0001 C CNN
	1    6850 5450
	0    -1   1    0   
$EndComp
$Comp
L power:GND #PWR?
U 1 1 5F0DB459
P 6850 5750
AR Path="/5EF3A6F3/5F0DB459" Ref="#PWR?"  Part="1" 
AR Path="/5EF3A6EB/5F0DB459" Ref="#PWR?"  Part="1" 
AR Path="/5EF3A6ED/5F0DB459" Ref="#PWR?"  Part="1" 
F 0 "#PWR?" H 6850 5500 50  0001 C CNN
F 1 "GND" V 6855 5622 50  0000 R CNN
F 2 "" H 6850 5750 50  0001 C CNN
F 3 "" H 6850 5750 50  0001 C CNN
	1    6850 5750
	0    -1   1    0   
$EndComp
$Comp
L power:GND #PWR?
U 1 1 5F0DBC09
P 6850 4850
AR Path="/5EF3A6F3/5F0DBC09" Ref="#PWR?"  Part="1" 
AR Path="/5EF3A6EB/5F0DBC09" Ref="#PWR?"  Part="1" 
AR Path="/5EF3A6ED/5F0DBC09" Ref="#PWR?"  Part="1" 
F 0 "#PWR?" H 6850 4600 50  0001 C CNN
F 1 "GND" V 6855 4722 50  0000 R CNN
F 2 "" H 6850 4850 50  0001 C CNN
F 3 "" H 6850 4850 50  0001 C CNN
	1    6850 4850
	0    -1   1    0   
$EndComp
$Comp
L power:GND #PWR?
U 1 1 5F0DBC0F
P 6850 5150
AR Path="/5EF3A6F3/5F0DBC0F" Ref="#PWR?"  Part="1" 
AR Path="/5EF3A6EB/5F0DBC0F" Ref="#PWR?"  Part="1" 
AR Path="/5EF3A6ED/5F0DBC0F" Ref="#PWR?"  Part="1" 
F 0 "#PWR?" H 6850 4900 50  0001 C CNN
F 1 "GND" V 6855 5022 50  0000 R CNN
F 2 "" H 6850 5150 50  0001 C CNN
F 3 "" H 6850 5150 50  0001 C CNN
	1    6850 5150
	0    -1   1    0   
$EndComp
$Comp
L power:GND #PWR?
U 1 1 5F0DC555
P 6850 4250
AR Path="/5EF3A6F3/5F0DC555" Ref="#PWR?"  Part="1" 
AR Path="/5EF3A6EB/5F0DC555" Ref="#PWR?"  Part="1" 
AR Path="/5EF3A6ED/5F0DC555" Ref="#PWR?"  Part="1" 
F 0 "#PWR?" H 6850 4000 50  0001 C CNN
F 1 "GND" V 6855 4122 50  0000 R CNN
F 2 "" H 6850 4250 50  0001 C CNN
F 3 "" H 6850 4250 50  0001 C CNN
	1    6850 4250
	0    -1   1    0   
$EndComp
$Comp
L power:GND #PWR?
U 1 1 5F0DC55B
P 6850 4550
AR Path="/5EF3A6F3/5F0DC55B" Ref="#PWR?"  Part="1" 
AR Path="/5EF3A6EB/5F0DC55B" Ref="#PWR?"  Part="1" 
AR Path="/5EF3A6ED/5F0DC55B" Ref="#PWR?"  Part="1" 
F 0 "#PWR?" H 6850 4300 50  0001 C CNN
F 1 "GND" V 6855 4422 50  0000 R CNN
F 2 "" H 6850 4550 50  0001 C CNN
F 3 "" H 6850 4550 50  0001 C CNN
	1    6850 4550
	0    -1   1    0   
$EndComp
$Comp
L power:GND #PWR?
U 1 1 5F0DD5F3
P 6850 3650
AR Path="/5EF3A6F3/5F0DD5F3" Ref="#PWR?"  Part="1" 
AR Path="/5EF3A6EB/5F0DD5F3" Ref="#PWR?"  Part="1" 
AR Path="/5EF3A6ED/5F0DD5F3" Ref="#PWR?"  Part="1" 
F 0 "#PWR?" H 6850 3400 50  0001 C CNN
F 1 "GND" V 6855 3522 50  0000 R CNN
F 2 "" H 6850 3650 50  0001 C CNN
F 3 "" H 6850 3650 50  0001 C CNN
	1    6850 3650
	0    -1   1    0   
$EndComp
$Comp
L power:GND #PWR?
U 1 1 5F0DD5F9
P 6850 3950
AR Path="/5EF3A6F3/5F0DD5F9" Ref="#PWR?"  Part="1" 
AR Path="/5EF3A6EB/5F0DD5F9" Ref="#PWR?"  Part="1" 
AR Path="/5EF3A6ED/5F0DD5F9" Ref="#PWR?"  Part="1" 
F 0 "#PWR?" H 6850 3700 50  0001 C CNN
F 1 "GND" V 6855 3822 50  0000 R CNN
F 2 "" H 6850 3950 50  0001 C CNN
F 3 "" H 6850 3950 50  0001 C CNN
	1    6850 3950
	0    -1   1    0   
$EndComp
$Comp
L power:GND #PWR?
U 1 1 5F0DDD6B
P 6850 3050
AR Path="/5EF3A6F3/5F0DDD6B" Ref="#PWR?"  Part="1" 
AR Path="/5EF3A6EB/5F0DDD6B" Ref="#PWR?"  Part="1" 
AR Path="/5EF3A6ED/5F0DDD6B" Ref="#PWR?"  Part="1" 
F 0 "#PWR?" H 6850 2800 50  0001 C CNN
F 1 "GND" V 6855 2922 50  0000 R CNN
F 2 "" H 6850 3050 50  0001 C CNN
F 3 "" H 6850 3050 50  0001 C CNN
	1    6850 3050
	0    -1   1    0   
$EndComp
$Comp
L power:GND #PWR?
U 1 1 5F0DDD71
P 6850 3350
AR Path="/5EF3A6F3/5F0DDD71" Ref="#PWR?"  Part="1" 
AR Path="/5EF3A6EB/5F0DDD71" Ref="#PWR?"  Part="1" 
AR Path="/5EF3A6ED/5F0DDD71" Ref="#PWR?"  Part="1" 
F 0 "#PWR?" H 6850 3100 50  0001 C CNN
F 1 "GND" V 6855 3222 50  0000 R CNN
F 2 "" H 6850 3350 50  0001 C CNN
F 3 "" H 6850 3350 50  0001 C CNN
	1    6850 3350
	0    -1   1    0   
$EndComp
$Comp
L power:GND #PWR?
U 1 1 5F0E0333
P 6850 2450
AR Path="/5EF3A6F3/5F0E0333" Ref="#PWR?"  Part="1" 
AR Path="/5EF3A6EB/5F0E0333" Ref="#PWR?"  Part="1" 
AR Path="/5EF3A6ED/5F0E0333" Ref="#PWR?"  Part="1" 
F 0 "#PWR?" H 6850 2200 50  0001 C CNN
F 1 "GND" V 6855 2322 50  0000 R CNN
F 2 "" H 6850 2450 50  0001 C CNN
F 3 "" H 6850 2450 50  0001 C CNN
	1    6850 2450
	0    -1   1    0   
$EndComp
$Comp
L power:GND #PWR?
U 1 1 5F0E0339
P 6850 2750
AR Path="/5EF3A6F3/5F0E0339" Ref="#PWR?"  Part="1" 
AR Path="/5EF3A6EB/5F0E0339" Ref="#PWR?"  Part="1" 
AR Path="/5EF3A6ED/5F0E0339" Ref="#PWR?"  Part="1" 
F 0 "#PWR?" H 6850 2500 50  0001 C CNN
F 1 "GND" V 6855 2622 50  0000 R CNN
F 2 "" H 6850 2750 50  0001 C CNN
F 3 "" H 6850 2750 50  0001 C CNN
	1    6850 2750
	0    -1   1    0   
$EndComp
$Comp
L power:GND #PWR?
U 1 1 5F0E0B1F
P 6850 2150
AR Path="/5EF3A6F3/5F0E0B1F" Ref="#PWR?"  Part="1" 
AR Path="/5EF3A6EB/5F0E0B1F" Ref="#PWR?"  Part="1" 
AR Path="/5EF3A6ED/5F0E0B1F" Ref="#PWR?"  Part="1" 
F 0 "#PWR?" H 6850 1900 50  0001 C CNN
F 1 "GND" V 6855 2022 50  0000 R CNN
F 2 "" H 6850 2150 50  0001 C CNN
F 3 "" H 6850 2150 50  0001 C CNN
	1    6850 2150
	0    -1   1    0   
$EndComp
$Comp
L power:GND #PWR?
U 1 1 5F0E3D2D
P 5150 5850
AR Path="/5EF3A6F3/5F0E3D2D" Ref="#PWR?"  Part="1" 
AR Path="/5EF3A6EB/5F0E3D2D" Ref="#PWR?"  Part="1" 
AR Path="/5EF3A6ED/5F0E3D2D" Ref="#PWR?"  Part="1" 
F 0 "#PWR?" H 5150 5600 50  0001 C CNN
F 1 "GND" V 5155 5722 50  0000 R CNN
F 2 "" H 5150 5850 50  0001 C CNN
F 3 "" H 5150 5850 50  0001 C CNN
	1    5150 5850
	0    1    -1   0   
$EndComp
$Comp
L power:GND #PWR?
U 1 1 5FDC2D69
P 6850 2050
AR Path="/5EF3A6F3/5FDC2D69" Ref="#PWR?"  Part="1" 
AR Path="/5EF3A6EB/5FDC2D69" Ref="#PWR?"  Part="1" 
AR Path="/5EF3A6ED/5FDC2D69" Ref="#PWR?"  Part="1" 
F 0 "#PWR?" H 6850 1800 50  0001 C CNN
F 1 "GND" V 6855 1922 50  0000 R CNN
F 2 "" H 6850 2050 50  0001 C CNN
F 3 "" H 6850 2050 50  0001 C CNN
	1    6850 2050
	0    -1   1    0   
$EndComp
$Comp
L KIT_Power:+1V8_VADJ #PWR?
U 1 1 604860BD
P 3500 6050
AR Path="/5EF3A6E9/604860BD" Ref="#PWR?"  Part="1" 
AR Path="/5EF3A6ED/604860BD" Ref="#PWR?"  Part="1" 
F 0 "#PWR?" H 3500 5900 50  0001 C CNN
F 1 "+1V8_VADJ" H 3515 6223 50  0000 C CNN
F 2 "" H 3500 6050 50  0001 C CNN
F 3 "" H 3500 6050 50  0001 C CNN
	1    3500 6050
	1    0    0    -1  
$EndComp
$Comp
L Device:C C?
U 1 1 604860DD
P 3750 6300
AR Path="/5EF3A6E9/604860DD" Ref="C?"  Part="1" 
AR Path="/5EF3A6ED/604860DD" Ref="C156"  Part="1" 
F 0 "C156" H 3865 6391 50  0000 L CNN
F 1 "1uF" H 3865 6300 50  0000 L CNN
F 2 "Capacitor_SMD:C_0402_1005Metric" H 3788 6150 50  0001 C CNN
F 3 "~" H 3750 6300 50  0001 C CNN
F 4 "16 V" H 3865 6209 50  0000 L CNN "info"
F 5 "AVT-IPE" H 3750 6300 50  0001 C CNN "stock"
	1    3750 6300
	1    0    0    -1  
$EndComp
Wire Wire Line
	3500 6100 3500 6050
Wire Wire Line
	3500 6500 3500 6550
$Comp
L power:GND #PWR?
U 1 1 604860E5
P 3500 6550
AR Path="/5EF3A6E9/604860E5" Ref="#PWR?"  Part="1" 
AR Path="/5EF3A6ED/604860E5" Ref="#PWR?"  Part="1" 
F 0 "#PWR?" H 3500 6300 50  0001 C CNN
F 1 "GND" H 3505 6377 50  0000 C CNN
F 2 "" H 3500 6550 50  0001 C CNN
F 3 "" H 3500 6550 50  0001 C CNN
	1    3500 6550
	1    0    0    -1  
$EndComp
Wire Wire Line
	3500 6100 3750 6100
Wire Wire Line
	3500 6500 3750 6500
Wire Wire Line
	3750 6150 3750 6100
Wire Wire Line
	3750 6450 3750 6500
$Comp
L KIT_Power:+1V8_VADJ #PWR?
U 1 1 604B56E8
P 8850 5800
AR Path="/5EF3A6E9/604B56E8" Ref="#PWR?"  Part="1" 
AR Path="/5EF3A6ED/604B56E8" Ref="#PWR?"  Part="1" 
F 0 "#PWR?" H 8850 5650 50  0001 C CNN
F 1 "+1V8_VADJ" H 8865 5973 50  0000 C CNN
F 2 "" H 8850 5800 50  0001 C CNN
F 3 "" H 8850 5800 50  0001 C CNN
	1    8850 5800
	-1   0    0    -1  
$EndComp
$Comp
L Device:C C?
U 1 1 604B56F0
P 8600 6050
AR Path="/5EF3A6E9/604B56F0" Ref="C?"  Part="1" 
AR Path="/5EF3A6ED/604B56F0" Ref="C157"  Part="1" 
F 0 "C157" H 8715 6141 50  0000 L CNN
F 1 "1uF" H 8715 6050 50  0000 L CNN
F 2 "Capacitor_SMD:C_0402_1005Metric" H 8638 5900 50  0001 C CNN
F 3 "~" H 8600 6050 50  0001 C CNN
F 4 "16 V" H 8715 5959 50  0000 L CNN "info"
F 5 "AVT-IPE" H 8600 6050 50  0001 C CNN "stock"
	1    8600 6050
	-1   0    0    -1  
$EndComp
Wire Wire Line
	8850 5850 8850 5800
Wire Wire Line
	8850 6250 8850 6300
$Comp
L power:GND #PWR?
U 1 1 604B56F8
P 8850 6300
AR Path="/5EF3A6E9/604B56F8" Ref="#PWR?"  Part="1" 
AR Path="/5EF3A6ED/604B56F8" Ref="#PWR?"  Part="1" 
F 0 "#PWR?" H 8850 6050 50  0001 C CNN
F 1 "GND" H 8855 6127 50  0000 C CNN
F 2 "" H 8850 6300 50  0001 C CNN
F 3 "" H 8850 6300 50  0001 C CNN
	1    8850 6300
	-1   0    0    -1  
$EndComp
Wire Wire Line
	8850 5850 8600 5850
Wire Wire Line
	8850 6250 8600 6250
Wire Wire Line
	8600 5900 8600 5850
Wire Wire Line
	8600 6200 8600 6250
Connection ~ 8600 5850
Wire Wire Line
	6850 5850 8600 5850
Wire Wire Line
	7300 2950 6850 2950
Wire Wire Line
	7300 2850 6850 2850
Wire Wire Line
	4750 2850 5150 2850
Wire Wire Line
	4750 2750 5150 2750
Wire Wire Line
	7300 2650 6850 2650
Wire Wire Line
	7300 2550 6850 2550
Wire Wire Line
	4750 2550 5150 2550
Wire Wire Line
	4750 2450 5150 2450
Text GLabel 4750 2550 0    50   BiDi ~ 0
GBE_A_N
Text GLabel 4750 2450 0    50   BiDi ~ 0
GBE_A_P
Text GLabel 7300 2650 2    50   BiDi ~ 0
GBE_B_N
Text GLabel 7300 2550 2    50   BiDi ~ 0
GBE_B_P
Text GLabel 4750 2850 0    50   BiDi ~ 0
GBE_C_N
Text GLabel 4750 2750 0    50   BiDi ~ 0
GBE_C_P
Text GLabel 7300 2950 2    50   BiDi ~ 0
GBE_D_N
Text GLabel 7300 2850 2    50   BiDi ~ 0
GBE_D_P
Text Label 7700 4050 2    50   ~ 0
X1_JTAG_TDI
Text Label 7700 4150 2    50   ~ 0
X1_JTAG_TDO
Text Label 4300 4050 0    50   ~ 0
X1_JTAG_TCK
Text Label 4300 3950 0    50   ~ 0
X1_JTAG_TMS
Text Label 4300 3050 0    50   ~ 0
X0_SCL
Text Label 4300 3150 0    50   ~ 0
X0_SDA
Text Label 4300 3350 0    50   ~ 0
X0_JTAG_TMS
Text Label 4300 3450 0    50   ~ 0
X0_JTAG_TCK
Text Label 4300 3650 0    50   ~ 0
X1_SCL
Text Label 4300 3750 0    50   ~ 0
X1_SDA
Text Label 7700 3150 2    50   ~ 0
X0_RESET_B
Text Label 7700 3250 2    50   ~ 0
X0_INTERRUPT_B
Text Label 7700 3450 2    50   ~ 0
X0_JTAG_TDI
Text Label 7700 3550 2    50   ~ 0
X0_JTAG_TDO
Text Label 7700 3750 2    50   ~ 0
X1_RESET_B
Text Label 7700 3850 2    50   ~ 0
X1_INTERRUPT_B
Wire Wire Line
	5150 5750 4350 5750
Wire Wire Line
	4350 5750 4350 6100
Connection ~ 3750 6100
Wire Wire Line
	3750 3050 5150 3050
Wire Wire Line
	3750 3150 5150 3150
Wire Wire Line
	3750 3350 5150 3350
Wire Wire Line
	3750 3450 5150 3450
Wire Wire Line
	3750 3650 5150 3650
Wire Wire Line
	3750 3750 5150 3750
Wire Wire Line
	3750 3950 5150 3950
Wire Wire Line
	3750 4050 5150 4050
Wire Wire Line
	3750 4250 5150 4250
Wire Wire Line
	3750 4350 5150 4350
Wire Wire Line
	3750 4550 5150 4550
Wire Wire Line
	3750 4650 5150 4650
NoConn ~ 6850 2250
NoConn ~ 6850 2350
Wire Wire Line
	4750 2050 5150 2050
NoConn ~ 4750 2050
Wire Wire Line
	4750 2150 5150 2150
NoConn ~ 4750 2150
Text Notes 4600 2100 2    50   ~ 0
Not connected in Motherboard!
Wire Wire Line
	7250 1950 6850 1950
NoConn ~ 7250 1950
Text Notes 7400 1950 0    50   ~ 0
Not connected in Motherboard!
Text Notes 4650 4950 2    50   ~ 0
Not connected in Motherboard!
Text Notes 4650 5250 2    50   ~ 0
Not connected in Motherboard!
Text Notes 4650 5550 2    50   ~ 0
Not connected in Motherboard!
Text Notes 7350 5650 0    50   ~ 0
Not connected in Motherboard!
Text Notes 7350 5350 0    50   ~ 0
Not connected in Motherboard!
Wire Wire Line
	4750 4850 5150 4850
NoConn ~ 4750 4850
Wire Wire Line
	4750 4950 5150 4950
NoConn ~ 4750 4950
Wire Wire Line
	4750 5150 5150 5150
NoConn ~ 4750 5150
Wire Wire Line
	4750 5250 5150 5250
NoConn ~ 4750 5250
Wire Wire Line
	4750 5450 5150 5450
NoConn ~ 4750 5450
Wire Wire Line
	4750 5550 5150 5550
NoConn ~ 4750 5550
Wire Wire Line
	7250 5250 6850 5250
NoConn ~ 7250 5250
Wire Wire Line
	7250 5350 6850 5350
NoConn ~ 7250 5350
Wire Wire Line
	7250 5550 6850 5550
NoConn ~ 7250 5550
Wire Wire Line
	7250 5650 6850 5650
NoConn ~ 7250 5650
Text GLabel 1650 1850 0    50   BiDi ~ 0
B66_IO_[0..51]
Wire Bus Line
	1850 1850 1650 1850
Text GLabel 1650 2000 0    50   BiDi ~ 0
B65_IO_[0..51]
Wire Bus Line
	1850 2000 1650 2000
Wire Wire Line
	6850 3150 8250 3150
Wire Wire Line
	8250 3250 6850 3250
Wire Wire Line
	8250 3450 6850 3450
Wire Wire Line
	8250 3550 6850 3550
Wire Wire Line
	8250 3750 6850 3750
Wire Wire Line
	8250 3850 6850 3850
Wire Wire Line
	8250 4050 6850 4050
Wire Wire Line
	8250 4150 6850 4150
Wire Wire Line
	8250 4350 6850 4350
Wire Wire Line
	8250 4450 6850 4450
Wire Wire Line
	8250 4650 6850 4650
Wire Wire Line
	8250 4750 6850 4750
Wire Wire Line
	8250 4950 6850 4950
Wire Wire Line
	8250 5050 6850 5050
Text Label 3750 4350 0    50   ~ 0
B66_IO_37
Text Label 3750 4250 0    50   ~ 0
B66_IO_29
Text Label 8250 4050 2    50   ~ 0
B66_IO_34
Text Label 3750 4050 0    50   ~ 0
B66_IO_51
Text Label 3750 3950 0    50   ~ 0
B66_IO_45
Text Label 8250 3850 2    50   ~ 0
B66_IO_49
Text Label 8250 3750 2    50   ~ 0
B66_IO_48
Text Label 3750 3750 0    50   ~ 0
B66_IO_35
Text Label 3750 3650 0    50   ~ 0
B66_IO_43
Text Label 8250 3550 2    50   ~ 0
B66_IO_33
Text Label 8250 3450 2    50   ~ 0
B66_IO_41
Text Label 3750 3450 0    50   ~ 0
B66_IO_38
Text Label 3750 3350 0    50   ~ 0
B66_IO_40
Text Label 8250 4350 2    50   ~ 0
B66_IO_15
Text Label 8250 4450 2    50   ~ 0
B66_IO_18
Text Label 3750 4550 0    50   ~ 0
B66_IO_23
Text Label 3750 4650 0    50   ~ 0
B66_IO_8
Text Label 8250 4650 2    50   ~ 0
B66_IO_24
Text Label 8250 4750 2    50   ~ 0
B66_IO_11
Text Label 8250 4950 2    50   ~ 0
B66_IO_10
Text Label 8250 5050 2    50   ~ 0
B66_IO_2
Text Label 8250 4150 2    50   ~ 0
B66_IO_21
Text Label 3750 3050 0    50   ~ 0
B66_IO_30
Text Label 8250 3150 2    50   ~ 0
B66_IO_14
Text Label 8250 3250 2    50   ~ 0
B66_IO_31
Text Label 3750 3150 0    50   ~ 0
B66_IO_32
Wire Wire Line
	3750 6100 4350 6100
$EndSCHEMATC
