EESchema Schematic File Version 4
EELAYER 30 0
EELAYER END
$Descr A4 11693 8268
encoding utf-8
Sheet 8 28
Title "ZynqMP Mezzanine FMC+ (BuZZyBoard)"
Date "2020-10-02"
Rev "1.0"
Comp "Karlsruhe Institute of Technology (KIT)"
Comment1 "Institute for Data Processing and Electronics (IPE)"
Comment2 "Luis Ardila"
Comment3 ""
Comment4 ""
$EndDescr
Wire Notes Line
	11150 3100 500  3100
$Comp
L power:GND #PWR?
U 1 1 5E4C2130
P 3200 2500
F 0 "#PWR?" H 3200 2250 50  0001 C CNN
F 1 "GND" H 3205 2327 50  0000 C CNN
F 2 "" H 3200 2500 50  0001 C CNN
F 3 "" H 3200 2500 50  0001 C CNN
	1    3200 2500
	1    0    0    -1  
$EndComp
Text Notes 5050 750  0    100  ~ 20
IPMB_A
$Comp
L Device:C C112
U 1 1 5E4C213A
P 2000 1000
F 0 "C112" H 2115 1046 50  0000 L CNN
F 1 "0.1uF" H 2115 955 50  0000 L CNN
F 2 "Capacitor_SMD:C_0402_1005Metric" H 2038 850 50  0001 C CNN
F 3 "~" H 2000 1000 50  0001 C CNN
F 4 "16 V" H 2000 1000 50  0001 C CNN "info"
F 5 "AVT-IPE" H 2000 1000 50  0001 C CNN "stock"
	1    2000 1000
	1    0    0    -1  
$EndComp
$Comp
L Device:R R53
U 1 1 5E4C2143
P 4700 1350
F 0 "R53" H 4770 1304 50  0000 L CNN
F 1 "10k" H 4770 1395 50  0000 L CNN
F 2 "Resistor_SMD:R_0402_1005Metric" V 4630 1350 50  0001 C CNN
F 3 "~" H 4700 1350 50  0001 C CNN
F 4 "" H 4700 1350 50  0001 C CNN "VPN"
F 5 "AVT-IPE" H 4700 1350 50  0001 C CNN "stock"
F 6 "1%" H 4700 1350 50  0001 C CNN "info"
	1    4700 1350
	1    0    0    1   
$EndComp
$Comp
L power:GND #PWR?
U 1 1 5E4C214E
P 2000 1150
F 0 "#PWR?" H 2000 900 50  0001 C CNN
F 1 "GND" H 2005 977 50  0000 C CNN
F 2 "" H 2000 1150 50  0001 C CNN
F 3 "" H 2000 1150 50  0001 C CNN
	1    2000 1150
	1    0    0    -1  
$EndComp
Wire Wire Line
	4100 1700 4100 1500
Wire Wire Line
	4000 1700 4100 1700
Wire Wire Line
	4400 1800 4400 1500
Wire Wire Line
	4000 1800 4400 1800
Connection ~ 4100 1700
Wire Wire Line
	4100 1700 4900 1700
$Comp
L Device:R R51
U 1 1 5E4C215F
P 4100 1350
F 0 "R51" H 4170 1441 50  0000 L CNN
F 1 "10k" H 4170 1350 50  0000 L CNN
F 2 "KIT_Resistor_SMD:R_0402_1005Metric_DNP" V 4030 1350 50  0001 C CNN
F 3 "~" H 4100 1350 50  0001 C CNN
F 4 "" H 4100 1350 50  0001 C CNN "info"
F 5 "AVT-IPE" H 4100 1350 50  0001 C CNN "stock"
F 6 "DNP" H 4170 1259 50  0000 L CNN "DNP"
	1    4100 1350
	1    0    0    -1  
$EndComp
$Comp
L Device:R R52
U 1 1 5E4C2167
P 4400 1350
F 0 "R52" H 4470 1441 50  0000 L CNN
F 1 "10k" H 4470 1350 50  0000 L CNN
F 2 "KIT_Resistor_SMD:R_0402_1005Metric_DNP" V 4330 1350 50  0001 C CNN
F 3 "~" H 4400 1350 50  0001 C CNN
F 4 "" H 4400 1350 50  0001 C CNN "info"
F 5 "AVT-IPE" H 4400 1350 50  0001 C CNN "stock"
F 6 "DNP" H 4470 1259 50  0000 L CNN "DNP"
	1    4400 1350
	1    0    0    -1  
$EndComp
$Comp
L power:GND #PWR?
U 1 1 5E4C216D
P 950 1900
F 0 "#PWR?" H 950 1650 50  0001 C CNN
F 1 "GND" H 955 1727 50  0000 C CNN
F 2 "" H 950 1900 50  0001 C CNN
F 3 "" H 950 1900 50  0001 C CNN
	1    950  1900
	1    0    0    -1  
$EndComp
$Comp
L Device:C C111
U 1 1 5E4C2175
P 950 1750
F 0 "C111" H 1065 1796 50  0000 L CNN
F 1 "0.1uF" H 1065 1705 50  0000 L CNN
F 2 "Capacitor_SMD:C_0402_1005Metric" H 988 1600 50  0001 C CNN
F 3 "~" H 950 1750 50  0001 C CNN
F 4 "16 V" H 950 1750 50  0001 C CNN "info"
F 5 "AVT-IPE" H 950 1750 50  0001 C CNN "stock"
	1    950  1750
	1    0    0    -1  
$EndComp
Wire Wire Line
	2400 1700 2200 1700
Wire Wire Line
	2200 1800 2400 1800
$Comp
L KIT_Interface:LTC4300-1 U11
U 1 1 5E4C21B7
P 3200 1800
F 0 "U11" H 2750 2250 60  0000 C CNN
F 1 "LTC4300-1" H 3500 2250 60  0000 C CNN
F 2 "Package_SO:MSOP-8_3x3mm_P0.65mm" H 3300 600 60  0001 C CNN
F 3 "https://www.analog.com/media/en/technical-documentation/data-sheets/4300a12fa.pdf" H 2400 2000 60  0001 C CNN
F 4 "822-6718" H 3200 1800 50  0001 C CNN "rs#"
F 5 "LTC4300A-1CMS8#PBF-ND" H 3200 1800 50  0001 C CNN "digikey#"
F 6 "Buffer, Accelerator 2 Channel 400kHz 8-MSOP" H 3200 1800 50  0001 C CNN "info"
F 7 "Analog Devices" H 3200 1800 50  0001 C CNN "manf"
F 8 "LTC4300A-1CMS8#PBF" H 3200 1800 50  0001 C CNN "manf#"
	1    3200 1800
	1    0    0    -1  
$EndComp
Wire Wire Line
	2250 2450 2250 2050
Wire Wire Line
	2250 2050 2400 2050
$Comp
L KIT_Power:+3V3_STBY #PWR?
U 1 1 613F7A4B
P 3200 1100
F 0 "#PWR?" H 3200 950 50  0001 C CNN
F 1 "+3V3_STBY" H 3215 1273 50  0000 C CNN
F 2 "" H 3200 1100 50  0001 C CNN
F 3 "" H 3200 1100 50  0001 C CNN
	1    3200 1100
	1    0    0    -1  
$EndComp
$Comp
L KIT_Power:+3V3_STBY #PWR?
U 1 1 613F7D9F
P 950 1600
F 0 "#PWR?" H 950 1450 50  0001 C CNN
F 1 "+3V3_STBY" H 965 1773 50  0000 C CNN
F 2 "" H 950 1600 50  0001 C CNN
F 3 "" H 950 1600 50  0001 C CNN
	1    950  1600
	1    0    0    -1  
$EndComp
Connection ~ 4400 1800
Wire Wire Line
	4400 1800 4900 1800
Wire Wire Line
	4000 2050 4700 2050
Wire Wire Line
	4700 1500 4700 2050
Connection ~ 4700 2050
Wire Wire Line
	4700 2050 4900 2050
Wire Wire Line
	2150 2450 2250 2450
Wire Wire Line
	1350 2500 1600 2500
Wire Wire Line
	1900 2150 1900 2200
$Comp
L power:GND #PWR?
U 1 1 5E4C219F
P 1900 2700
F 0 "#PWR?" H 1900 2450 50  0001 C CNN
F 1 "GND" H 1905 2527 50  0000 C CNN
F 2 "" H 1900 2700 50  0001 C CNN
F 3 "" H 1900 2700 50  0001 C CNN
	1    1900 2700
	1    0    0    -1  
$EndComp
Wire Wire Line
	850  2400 1600 2400
$Comp
L KIT_Power:+3V3_STBY #PWR?
U 1 1 6140DDD9
P 4100 1100
F 0 "#PWR?" H 4100 950 50  0001 C CNN
F 1 "+3V3_STBY" H 4115 1273 50  0000 C CNN
F 2 "" H 4100 1100 50  0001 C CNN
F 3 "" H 4100 1100 50  0001 C CNN
	1    4100 1100
	1    0    0    -1  
$EndComp
Wire Wire Line
	4100 1100 4100 1150
Wire Wire Line
	4100 1150 4400 1150
Wire Wire Line
	4700 1150 4700 1200
Connection ~ 4100 1150
Wire Wire Line
	4100 1150 4100 1200
Wire Wire Line
	4400 1200 4400 1150
Connection ~ 4400 1150
Wire Wire Line
	4400 1150 4700 1150
$Comp
L KIT_Power:+3V3_STBY #PWR?
U 1 1 614211BA
P 1900 2150
F 0 "#PWR?" H 1900 2000 50  0001 C CNN
F 1 "+3V3_STBY" H 1915 2323 50  0000 C CNN
F 2 "" H 1900 2150 50  0001 C CNN
F 3 "" H 1900 2150 50  0001 C CNN
	1    1900 2150
	1    0    0    -1  
$EndComp
$Comp
L KIT_Power:+3V3_STBY #PWR?
U 1 1 6142C228
P 2000 850
F 0 "#PWR?" H 2000 700 50  0001 C CNN
F 1 "+3V3_STBY" H 2015 1023 50  0000 C CNN
F 2 "" H 2000 850 50  0001 C CNN
F 3 "" H 2000 850 50  0001 C CNN
	1    2000 850 
	1    0    0    -1  
$EndComp
$Comp
L power:GND #PWR?
U 1 1 6143E914
P 8600 2500
F 0 "#PWR?" H 8600 2250 50  0001 C CNN
F 1 "GND" H 8605 2327 50  0000 C CNN
F 2 "" H 8600 2500 50  0001 C CNN
F 3 "" H 8600 2500 50  0001 C CNN
	1    8600 2500
	1    0    0    -1  
$EndComp
Text Notes 10450 750  0    100  ~ 20
IPMB_B
$Comp
L Device:C C115
U 1 1 6143E91D
P 7400 1000
F 0 "C115" H 7515 1046 50  0000 L CNN
F 1 "0.1uF" H 7515 955 50  0000 L CNN
F 2 "Capacitor_SMD:C_0402_1005Metric" H 7438 850 50  0001 C CNN
F 3 "~" H 7400 1000 50  0001 C CNN
F 4 "16 V" H 7400 1000 50  0001 C CNN "info"
F 5 "AVT-IPE" H 7400 1000 50  0001 C CNN "stock"
	1    7400 1000
	1    0    0    -1  
$EndComp
$Comp
L Device:R R56
U 1 1 6143E926
P 10100 1350
F 0 "R56" H 10170 1304 50  0000 L CNN
F 1 "10k" H 10170 1395 50  0000 L CNN
F 2 "Resistor_SMD:R_0402_1005Metric" V 10030 1350 50  0001 C CNN
F 3 "~" H 10100 1350 50  0001 C CNN
F 4 "" H 10100 1350 50  0001 C CNN "VPN"
F 5 "AVT-IPE" H 10100 1350 50  0001 C CNN "stock"
F 6 "1%" H 10100 1350 50  0001 C CNN "info"
	1    10100 1350
	1    0    0    1   
$EndComp
$Comp
L power:GND #PWR?
U 1 1 6143E92C
P 7400 1150
F 0 "#PWR?" H 7400 900 50  0001 C CNN
F 1 "GND" H 7405 977 50  0000 C CNN
F 2 "" H 7400 1150 50  0001 C CNN
F 3 "" H 7400 1150 50  0001 C CNN
	1    7400 1150
	1    0    0    -1  
$EndComp
Wire Wire Line
	9500 1700 9500 1500
Wire Wire Line
	9400 1700 9500 1700
Wire Wire Line
	9800 1800 9800 1500
Wire Wire Line
	9400 1800 9800 1800
Connection ~ 9500 1700
Wire Wire Line
	9500 1700 10300 1700
$Comp
L Device:R R54
U 1 1 6143E93A
P 9500 1350
F 0 "R54" H 9570 1441 50  0000 L CNN
F 1 "10k" H 9570 1350 50  0000 L CNN
F 2 "KIT_Resistor_SMD:R_0402_1005Metric_DNP" V 9430 1350 50  0001 C CNN
F 3 "~" H 9500 1350 50  0001 C CNN
F 4 "" H 9500 1350 50  0001 C CNN "info"
F 5 "AVT-IPE" H 9500 1350 50  0001 C CNN "stock"
F 6 "DNP" H 9570 1259 50  0000 L CNN "DNP"
	1    9500 1350
	1    0    0    -1  
$EndComp
$Comp
L Device:R R55
U 1 1 6143E942
P 9800 1350
F 0 "R55" H 9870 1441 50  0000 L CNN
F 1 "10k" H 9870 1350 50  0000 L CNN
F 2 "KIT_Resistor_SMD:R_0402_1005Metric_DNP" V 9730 1350 50  0001 C CNN
F 3 "~" H 9800 1350 50  0001 C CNN
F 4 "" H 9800 1350 50  0001 C CNN "info"
F 5 "AVT-IPE" H 9800 1350 50  0001 C CNN "stock"
F 6 "DNP" H 9870 1259 50  0000 L CNN "DNP"
	1    9800 1350
	1    0    0    -1  
$EndComp
$Comp
L power:GND #PWR?
U 1 1 6143E948
P 6350 1900
F 0 "#PWR?" H 6350 1650 50  0001 C CNN
F 1 "GND" H 6355 1727 50  0000 C CNN
F 2 "" H 6350 1900 50  0001 C CNN
F 3 "" H 6350 1900 50  0001 C CNN
	1    6350 1900
	1    0    0    -1  
$EndComp
$Comp
L Device:C C114
U 1 1 6143E950
P 6350 1750
F 0 "C114" H 6465 1796 50  0000 L CNN
F 1 "0.1uF" H 6465 1705 50  0000 L CNN
F 2 "Capacitor_SMD:C_0402_1005Metric" H 6388 1600 50  0001 C CNN
F 3 "~" H 6350 1750 50  0001 C CNN
F 4 "16 V" H 6350 1750 50  0001 C CNN "info"
F 5 "AVT-IPE" H 6350 1750 50  0001 C CNN "stock"
	1    6350 1750
	1    0    0    -1  
$EndComp
Wire Wire Line
	7800 1700 7600 1700
Wire Wire Line
	7600 1800 7800 1800
Wire Wire Line
	7650 2450 7650 2050
Wire Wire Line
	7650 2050 7800 2050
$Comp
L KIT_Power:+3V3_STBY #PWR?
U 1 1 6143E967
P 8600 1100
F 0 "#PWR?" H 8600 950 50  0001 C CNN
F 1 "+3V3_STBY" H 8615 1273 50  0000 C CNN
F 2 "" H 8600 1100 50  0001 C CNN
F 3 "" H 8600 1100 50  0001 C CNN
	1    8600 1100
	1    0    0    -1  
$EndComp
$Comp
L KIT_Power:+3V3_STBY #PWR?
U 1 1 6143E96D
P 6350 1600
F 0 "#PWR?" H 6350 1450 50  0001 C CNN
F 1 "+3V3_STBY" H 6365 1773 50  0000 C CNN
F 2 "" H 6350 1600 50  0001 C CNN
F 3 "" H 6350 1600 50  0001 C CNN
	1    6350 1600
	1    0    0    -1  
$EndComp
Connection ~ 9800 1800
Wire Wire Line
	9800 1800 10300 1800
Wire Wire Line
	9400 2050 10100 2050
Wire Wire Line
	10100 1500 10100 2050
Connection ~ 10100 2050
Wire Wire Line
	10100 2050 10300 2050
Wire Wire Line
	7550 2450 7650 2450
Wire Wire Line
	6750 2500 7000 2500
Wire Wire Line
	7300 2150 7300 2200
$Comp
L KIT_Logic:SN74LVC1G08 U13
U 1 1 6143E97F
P 7300 2450
F 0 "U13" H 7000 2300 50  0000 L CNN
F 1 "SN74LVC1G08DRLR" H 6550 2700 50  0000 L CNN
F 2 "Package_TO_SOT_SMD:SOT-553" H 7300 2450 50  0001 C CNN
F 3 "http://www.ti.com/lit/ds/symlink/sn74lvc1g08.pdf" H 7300 2450 50  0001 C CNN
F 4 "809-5977" H 7300 2450 50  0001 C CNN "rs#"
	1    7300 2450
	1    0    0    -1  
$EndComp
$Comp
L power:GND #PWR?
U 1 1 6143E985
P 7300 2700
F 0 "#PWR?" H 7300 2450 50  0001 C CNN
F 1 "GND" H 7305 2527 50  0000 C CNN
F 2 "" H 7300 2700 50  0001 C CNN
F 3 "" H 7300 2700 50  0001 C CNN
	1    7300 2700
	1    0    0    -1  
$EndComp
Wire Wire Line
	6200 2400 7000 2400
$Comp
L KIT_Power:+3V3_STBY #PWR?
U 1 1 6143E98D
P 9500 1100
F 0 "#PWR?" H 9500 950 50  0001 C CNN
F 1 "+3V3_STBY" H 9515 1273 50  0000 C CNN
F 2 "" H 9500 1100 50  0001 C CNN
F 3 "" H 9500 1100 50  0001 C CNN
	1    9500 1100
	1    0    0    -1  
$EndComp
Wire Wire Line
	9500 1100 9500 1150
Wire Wire Line
	9500 1150 9800 1150
Wire Wire Line
	10100 1150 10100 1200
Connection ~ 9500 1150
Wire Wire Line
	9500 1150 9500 1200
Wire Wire Line
	9800 1200 9800 1150
Connection ~ 9800 1150
Wire Wire Line
	9800 1150 10100 1150
$Comp
L KIT_Power:+3V3_STBY #PWR?
U 1 1 6143E99B
P 7300 2150
F 0 "#PWR?" H 7300 2000 50  0001 C CNN
F 1 "+3V3_STBY" H 7315 2323 50  0000 C CNN
F 2 "" H 7300 2150 50  0001 C CNN
F 3 "" H 7300 2150 50  0001 C CNN
	1    7300 2150
	1    0    0    -1  
$EndComp
$Comp
L KIT_Power:+3V3_STBY #PWR?
U 1 1 6143E9A1
P 7400 850
F 0 "#PWR?" H 7400 700 50  0001 C CNN
F 1 "+3V3_STBY" H 7415 1023 50  0000 C CNN
F 2 "" H 7400 850 50  0001 C CNN
F 3 "" H 7400 850 50  0001 C CNN
	1    7400 850 
	1    0    0    -1  
$EndComp
Wire Notes Line
	5900 3100 5900 500 
Wire Wire Line
	1800 5400 2050 5400
Text GLabel 3100 4600 0    50   Input ~ 0
MO_SCL
Text GLabel 3100 4700 0    50   BiDi ~ 0
MO_SDA
$Comp
L power:GND #PWR?
U 1 1 5E7CFDC7
P 5100 6600
F 0 "#PWR?" H 5100 6350 50  0001 C CNN
F 1 "GND" H 5105 6427 50  0000 C CNN
F 2 "" H 5100 6600 50  0001 C CNN
F 3 "" H 5100 6600 50  0001 C CNN
	1    5100 6600
	1    0    0    -1  
$EndComp
Wire Wire Line
	5100 6400 5100 6500
Wire Wire Line
	5300 6400 5300 6500
Wire Wire Line
	5300 6500 5100 6500
Connection ~ 5100 6500
Wire Wire Line
	5100 6500 5100 6600
$Comp
L power:GND #PWR?
U 1 1 5EE789D7
P 5750 3950
F 0 "#PWR?" H 5750 3700 50  0001 C CNN
F 1 "GND" H 5755 3777 50  0000 C CNN
F 2 "" H 5750 3950 50  0001 C CNN
F 3 "" H 5750 3950 50  0001 C CNN
	1    5750 3950
	1    0    0    -1  
$EndComp
$Comp
L Device:C C113
U 1 1 5EE789DF
P 5750 3800
F 0 "C113" H 5865 3846 50  0000 L CNN
F 1 "0.1uF" H 5865 3755 50  0000 L CNN
F 2 "Capacitor_SMD:C_0402_1005Metric" H 5788 3650 50  0001 C CNN
F 3 "~" H 5750 3800 50  0001 C CNN
F 4 "16 V" H 5750 3800 50  0001 C CNN "info"
F 5 "AVT-IPE" H 5750 3800 50  0001 C CNN "stock"
	1    5750 3800
	1    0    0    -1  
$EndComp
$Comp
L KIT_Power:+3V3_STBY #PWR?
U 1 1 5EE789E5
P 5750 3550
F 0 "#PWR?" H 5750 3400 50  0001 C CNN
F 1 "+3V3_STBY" H 5765 3723 50  0000 C CNN
F 2 "" H 5750 3550 50  0001 C CNN
F 3 "" H 5750 3550 50  0001 C CNN
	1    5750 3550
	1    0    0    -1  
$EndComp
Wire Wire Line
	5750 3550 5750 3600
Wire Wire Line
	5750 3600 5300 3600
Wire Wire Line
	5300 3600 5300 4200
Connection ~ 5750 3600
Wire Wire Line
	5750 3600 5750 3650
$Comp
L KIT_Interface:LTC4300-1 U14
U 1 1 6143E95F
P 8600 1800
F 0 "U14" H 8150 2250 60  0000 C CNN
F 1 "LTC4300-1" H 8900 2250 60  0000 C CNN
F 2 "Package_SO:MSOP-8_3x3mm_P0.65mm" H 8700 600 60  0001 C CNN
F 3 "https://www.analog.com/media/en/technical-documentation/data-sheets/4300a12fa.pdf" H 7800 2000 60  0001 C CNN
F 4 "LTC4300A-1CMS8#PBF-ND" H 8600 1800 50  0001 C CNN "digikey#"
F 5 "Buffer, Accelerator 2 Channel 400kHz 8-MSOP" H 8600 1800 50  0001 C CNN "info"
F 6 "Analog Devices" H 8600 1800 50  0001 C CNN "manf"
F 7 "LTC4300A-1CMS8#PBF" H 8600 1800 50  0001 C CNN "manf#"
F 8 "822-6718" H 8600 1800 50  0001 C CNN "rs#"
	1    8600 1800
	1    0    0    -1  
$EndComp
Text Label 2250 2050 0    20   ~ 0
IPMB_A_EN
Text Label 7650 2050 0    20   ~ 0
IPMB_B_EN
Text GLabel 6750 2500 0    50   Input ~ 0
IPMB_B_ENABLE
Text GLabel 4900 2050 2    50   Input ~ 0
IMPB_A_READY
Text GLabel 1350 2500 0    50   Input ~ 0
IPMB_A_ENABLE
Text GLabel 2200 1700 0    50   Input ~ 0
IMPB_A_SDA
Text GLabel 2200 1800 0    50   Input ~ 0
IMPB_A_SCL
Text Label 850  2400 0    50   ~ 0
IPMB_ENABLE
Text Label 6200 2400 0    50   ~ 0
IPMB_ENABLE
Text GLabel 7600 1800 0    50   Input ~ 0
IMPB_B_SCL
Text GLabel 7600 1700 0    50   Input ~ 0
IPMB_B_SDA
Text GLabel 10300 2050 2    50   Input ~ 0
IPMB_B_READY
Wire Wire Line
	1800 5500 2400 5500
Text Label 1800 5500 0    50   ~ 0
IPMB_ENABLE
Text Label 6650 4900 2    50   ~ 0
ATCA_Z1_HA2
Text Label 6650 5000 2    50   ~ 0
ATCA_Z1_HA3
Wire Wire Line
	6650 4700 6000 4700
Wire Wire Line
	6650 4800 6000 4800
Text Label 6650 5200 2    50   ~ 0
ATCA_Z1_HA0
Text Label 6650 5100 2    50   ~ 0
ATCA_Z1_HA1
Wire Wire Line
	6650 4500 6000 4500
Wire Wire Line
	6650 4600 6000 4600
Text Label 6650 4500 2    50   ~ 0
ATCA_Z1_HA6
Text Label 6650 4700 2    50   ~ 0
ATCA_Z1_HA7
Wire Wire Line
	6650 5100 6000 5100
Wire Wire Line
	6650 5200 6000 5200
Text Label 6650 4600 2    50   ~ 0
ATCA_Z1_HA4
Text Label 6650 4800 2    50   ~ 0
ATCA_Z1_HA5
Wire Wire Line
	6650 4900 6000 4900
Wire Wire Line
	6650 5000 6000 5000
Wire Wire Line
	6150 6100 6000 6100
Wire Wire Line
	6150 6000 6000 6000
Wire Wire Line
	6150 5900 6000 5900
Wire Wire Line
	6150 5800 6000 5800
Wire Wire Line
	6150 5700 6000 5700
Wire Wire Line
	6150 5600 6000 5600
Wire Wire Line
	6150 5500 6000 5500
Wire Wire Line
	6150 5400 6000 5400
Text GLabel 4900 1800 2    50   Input ~ 0
ATCA_Z1_IPMB_A_SCL
Text GLabel 4900 1700 2    50   Input ~ 0
ATCA_Z1_IPMB_A_SDA
Text GLabel 6850 4400 2    50   Input ~ 0
ATCA_Z1_HA[0..7]
Entry Wire Line
	6650 4500 6750 4400
Entry Wire Line
	6650 4600 6750 4500
Entry Wire Line
	6650 4700 6750 4600
Entry Wire Line
	6650 4800 6750 4700
Entry Wire Line
	6650 4900 6750 4800
Entry Wire Line
	6650 5000 6750 4900
Entry Wire Line
	6650 5100 6750 5000
Entry Wire Line
	6650 5200 6750 5100
Wire Bus Line
	6750 4400 6850 4400
Text GLabel 1800 5400 0    50   Output ~ 0
12V_POWER_ENABLE
Text GLabel 10300 1800 2    50   Input ~ 0
ATCA_Z1_IPMB_B_SDA
Text GLabel 10300 1700 2    50   Input ~ 0
ATCA_Z1_IPMB_B_SCL
Text GLabel 3100 4800 0    50   Output ~ 0
MO_INT_N
Text GLabel 3100 4900 0    50   Input ~ 0
MO_RESET_N
$Comp
L power:GND #PWR?
U 1 1 5EDCF748
P 4650 4000
F 0 "#PWR?" H 4650 3750 50  0001 C CNN
F 1 "GND" H 4655 3827 50  0000 C CNN
F 2 "" H 4650 4000 50  0001 C CNN
F 3 "" H 4650 4000 50  0001 C CNN
	1    4650 4000
	-1   0    0    -1  
$EndComp
$Comp
L Device:C C136
U 1 1 5EDCF750
P 4650 3850
F 0 "C136" H 4765 3896 50  0000 L CNN
F 1 "0.1uF" H 4765 3805 50  0000 L CNN
F 2 "Capacitor_SMD:C_0402_1005Metric" H 4688 3700 50  0001 C CNN
F 3 "~" H 4650 3850 50  0001 C CNN
F 4 "16 V" H 4650 3850 50  0001 C CNN "info"
F 5 "AVT-IPE" H 4650 3850 50  0001 C CNN "stock"
	1    4650 3850
	-1   0    0    -1  
$EndComp
$Comp
L KIT_Power:+1V8_STBY #PWR?
U 1 1 5EDCF756
P 4650 3600
F 0 "#PWR?" H 4650 3450 50  0001 C CNN
F 1 "+1V8_STBY" H 4665 3773 50  0000 C CNN
F 2 "" H 4650 3600 50  0001 C CNN
F 3 "" H 4650 3600 50  0001 C CNN
	1    4650 3600
	-1   0    0    -1  
$EndComp
Wire Wire Line
	4650 3600 4650 3650
Wire Wire Line
	4650 3650 5100 3650
Connection ~ 4650 3650
Wire Wire Line
	4650 3650 4650 3700
Wire Wire Line
	5100 3650 5100 4200
$Comp
L power:GND #PWR?
U 1 1 5EDDBBBE
P 4300 5050
F 0 "#PWR?" H 4300 4800 50  0001 C CNN
F 1 "GND" H 4305 4877 50  0000 C CNN
F 2 "" H 4300 5050 50  0001 C CNN
F 3 "" H 4300 5050 50  0001 C CNN
	1    4300 5050
	1    0    0    -1  
$EndComp
Wire Wire Line
	4300 5050 4300 5000
Wire Wire Line
	4300 5000 4400 5000
$Comp
L Device:R R167
U 1 1 5EDF57AF
P 3250 5100
F 0 "R167" H 3180 5054 50  0000 R CNN
F 1 "10k" H 3180 5145 50  0000 R CNN
F 2 "Resistor_SMD:R_0402_1005Metric" V 3180 5100 50  0001 C CNN
F 3 "~" H 3250 5100 50  0001 C CNN
F 4 "AVT-IPE" H 3250 5100 50  0001 C CNN "stock"
	1    3250 5100
	-1   0    0    1   
$EndComp
$Comp
L Device:R R68
U 1 1 5EDFB34F
P 3550 4200
F 0 "R68" H 3480 4154 50  0000 R CNN
F 1 "10k" H 3480 4245 50  0000 R CNN
F 2 "Resistor_SMD:R_0402_1005Metric" V 3480 4200 50  0001 C CNN
F 3 "~" H 3550 4200 50  0001 C CNN
F 4 "AVT-IPE" H 3550 4200 50  0001 C CNN "stock"
	1    3550 4200
	-1   0    0    1   
$EndComp
$Comp
L KIT_Power:+1V8_STBY #PWR?
U 1 1 5EE0207B
P 3250 3900
F 0 "#PWR?" H 3250 3750 50  0001 C CNN
F 1 "+1V8_STBY" H 3265 4073 50  0000 C CNN
F 2 "" H 3250 3900 50  0001 C CNN
F 3 "" H 3250 3900 50  0001 C CNN
	1    3250 3900
	-1   0    0    -1  
$EndComp
Wire Wire Line
	3250 3900 3250 3950
Wire Wire Line
	3250 3950 3550 3950
Wire Wire Line
	3550 3950 3550 4050
Connection ~ 3250 3950
Wire Wire Line
	3250 3950 3250 4050
$Comp
L Device:R R69
U 1 1 5EE1A9CE
P 3850 4200
F 0 "R69" H 3780 4154 50  0000 R CNN
F 1 "10k" H 3780 4245 50  0000 R CNN
F 2 "Resistor_SMD:R_0402_1005Metric" V 3780 4200 50  0001 C CNN
F 3 "~" H 3850 4200 50  0001 C CNN
F 4 "AVT-IPE" H 3850 4200 50  0001 C CNN "stock"
	1    3850 4200
	-1   0    0    1   
$EndComp
$Comp
L Device:R R70
U 1 1 5EE1A9D5
P 4150 4200
F 0 "R70" H 4080 4154 50  0000 R CNN
F 1 "10k" H 4080 4245 50  0000 R CNN
F 2 "Resistor_SMD:R_0402_1005Metric" V 4080 4200 50  0001 C CNN
F 3 "~" H 4150 4200 50  0001 C CNN
F 4 "AVT-IPE" H 4150 4200 50  0001 C CNN "stock"
	1    4150 4200
	-1   0    0    1   
$EndComp
Wire Wire Line
	4150 3950 4150 4050
Wire Wire Line
	3850 3950 3850 4050
Wire Wire Line
	4150 3950 3850 3950
Connection ~ 3550 3950
Connection ~ 3850 3950
Wire Wire Line
	3850 3950 3550 3950
Wire Wire Line
	3100 4700 3850 4700
Wire Wire Line
	3100 4600 4150 4600
Wire Wire Line
	3100 4900 3250 4900
Wire Wire Line
	3100 4800 3550 4800
Wire Wire Line
	4150 4350 4150 4600
Connection ~ 4150 4600
Wire Wire Line
	4150 4600 4400 4600
Wire Wire Line
	3850 4350 3850 4700
Connection ~ 3850 4700
Wire Wire Line
	3850 4700 4400 4700
Wire Wire Line
	3550 4350 3550 4800
Connection ~ 3550 4800
Wire Wire Line
	3550 4800 4400 4800
Wire Wire Line
	3250 4350 3250 4900
Connection ~ 3250 4900
Wire Wire Line
	3250 4900 4400 4900
$Comp
L Device:R R28
U 1 1 5F28A817
P 2400 6350
F 0 "R28" H 2330 6304 50  0000 R CNN
F 1 "10k" H 2330 6395 50  0000 R CNN
F 2 "Resistor_SMD:R_0402_1005Metric" V 2330 6350 50  0001 C CNN
F 3 "~" H 2400 6350 50  0001 C CNN
F 4 "AVT-IPE" H 2400 6350 50  0001 C CNN "stock"
	1    2400 6350
	-1   0    0    1   
$EndComp
$Comp
L power:GND #PWR?
U 1 1 5F28DD80
P 2400 6500
F 0 "#PWR?" H 2400 6250 50  0001 C CNN
F 1 "GND" H 2405 6327 50  0000 C CNN
F 2 "" H 2400 6500 50  0001 C CNN
F 3 "" H 2400 6500 50  0001 C CNN
	1    2400 6500
	1    0    0    -1  
$EndComp
Wire Wire Line
	2400 6200 2400 5500
$Comp
L Device:R R15
U 1 1 5F2A9E6F
P 2050 6350
F 0 "R15" H 1980 6304 50  0000 R CNN
F 1 "10k" H 1980 6395 50  0000 R CNN
F 2 "Resistor_SMD:R_0402_1005Metric" V 1980 6350 50  0001 C CNN
F 3 "~" H 2050 6350 50  0001 C CNN
F 4 "AVT-IPE" H 2050 6350 50  0001 C CNN "stock"
	1    2050 6350
	-1   0    0    1   
$EndComp
$Comp
L power:GND #PWR?
U 1 1 5F2A9E75
P 2050 6500
F 0 "#PWR?" H 2050 6250 50  0001 C CNN
F 1 "GND" H 2055 6327 50  0000 C CNN
F 2 "" H 2050 6500 50  0001 C CNN
F 3 "" H 2050 6500 50  0001 C CNN
	1    2050 6500
	1    0    0    -1  
$EndComp
Wire Wire Line
	2050 6200 2050 5400
NoConn ~ 6150 5500
Connection ~ 2050 5400
Connection ~ 2400 5500
Wire Wire Line
	2400 5500 4400 5500
Wire Wire Line
	2050 5400 4400 5400
$Comp
L Device:R R89
U 1 1 5F3549A7
P 3100 6350
F 0 "R89" H 3030 6304 50  0000 R CNN
F 1 "10k" H 3030 6395 50  0000 R CNN
F 2 "Resistor_SMD:R_0402_1005Metric" V 3030 6350 50  0001 C CNN
F 3 "~" H 3100 6350 50  0001 C CNN
F 4 "AVT-IPE" H 3100 6350 50  0001 C CNN "stock"
	1    3100 6350
	-1   0    0    1   
$EndComp
$Comp
L power:GND #PWR?
U 1 1 5F3549AD
P 3100 6500
F 0 "#PWR?" H 3100 6250 50  0001 C CNN
F 1 "GND" H 3105 6327 50  0000 C CNN
F 2 "" H 3100 6500 50  0001 C CNN
F 3 "" H 3100 6500 50  0001 C CNN
	1    3100 6500
	1    0    0    -1  
$EndComp
Wire Wire Line
	3100 6200 3100 5700
$Comp
L Device:R R87
U 1 1 5F3549B5
P 2750 6350
F 0 "R87" H 2680 6304 50  0000 R CNN
F 1 "10k" H 2680 6395 50  0000 R CNN
F 2 "Resistor_SMD:R_0402_1005Metric" V 2680 6350 50  0001 C CNN
F 3 "~" H 2750 6350 50  0001 C CNN
F 4 "AVT-IPE" H 2750 6350 50  0001 C CNN "stock"
	1    2750 6350
	-1   0    0    1   
$EndComp
$Comp
L power:GND #PWR?
U 1 1 5F3549BB
P 2750 6500
F 0 "#PWR?" H 2750 6250 50  0001 C CNN
F 1 "GND" H 2755 6327 50  0000 C CNN
F 2 "" H 2750 6500 50  0001 C CNN
F 3 "" H 2750 6500 50  0001 C CNN
	1    2750 6500
	1    0    0    -1  
$EndComp
Wire Wire Line
	2750 6200 2750 5600
$Comp
L Device:R R92
U 1 1 5F35EE51
P 3800 6350
F 0 "R92" H 3730 6304 50  0000 R CNN
F 1 "10k" H 3730 6395 50  0000 R CNN
F 2 "Resistor_SMD:R_0402_1005Metric" V 3730 6350 50  0001 C CNN
F 3 "~" H 3800 6350 50  0001 C CNN
F 4 "AVT-IPE" H 3800 6350 50  0001 C CNN "stock"
	1    3800 6350
	-1   0    0    1   
$EndComp
$Comp
L power:GND #PWR?
U 1 1 5F35EE57
P 3800 6500
F 0 "#PWR?" H 3800 6250 50  0001 C CNN
F 1 "GND" H 3805 6327 50  0000 C CNN
F 2 "" H 3800 6500 50  0001 C CNN
F 3 "" H 3800 6500 50  0001 C CNN
	1    3800 6500
	1    0    0    -1  
$EndComp
Wire Wire Line
	3800 6200 3800 5900
$Comp
L Device:R R91
U 1 1 5F35EE5F
P 3450 6350
F 0 "R91" H 3380 6304 50  0000 R CNN
F 1 "10k" H 3380 6395 50  0000 R CNN
F 2 "Resistor_SMD:R_0402_1005Metric" V 3380 6350 50  0001 C CNN
F 3 "~" H 3450 6350 50  0001 C CNN
F 4 "AVT-IPE" H 3450 6350 50  0001 C CNN "stock"
	1    3450 6350
	-1   0    0    1   
$EndComp
$Comp
L power:GND #PWR?
U 1 1 5F35EE65
P 3450 6500
F 0 "#PWR?" H 3450 6250 50  0001 C CNN
F 1 "GND" H 3455 6327 50  0000 C CNN
F 2 "" H 3450 6500 50  0001 C CNN
F 3 "" H 3450 6500 50  0001 C CNN
	1    3450 6500
	1    0    0    -1  
$EndComp
Wire Wire Line
	3450 6200 3450 5800
Wire Wire Line
	4400 5600 2750 5600
Connection ~ 2750 5600
Wire Wire Line
	2750 5600 1800 5600
Wire Wire Line
	4400 5700 3100 5700
Connection ~ 3100 5700
Wire Wire Line
	3100 5700 1800 5700
Wire Wire Line
	4400 5800 3450 5800
Connection ~ 3450 5800
Wire Wire Line
	3450 5800 1800 5800
Wire Wire Line
	4400 5900 3800 5900
Connection ~ 3800 5900
Wire Wire Line
	3800 5900 1800 5900
Text GLabel 1800 5600 0    50   Output ~ 0
EN_PL_VCCINT
Text GLabel 1800 5800 0    50   Output ~ 0
EN_PL_MGTAVTT
Text GLabel 1800 6000 0    50   Output ~ 0
EN_PL_MGTVCCAUX
Text GLabel 1800 5900 0    50   Output ~ 0
EN_PL_MGTAVCC
NoConn ~ 4400 6100
Text GLabel 1800 5700 0    50   Input ~ 0
EN_PL_VCCINT_PWM
$Comp
L Device:R R93
U 1 1 6073E9C8
P 4150 6350
F 0 "R93" H 4080 6304 50  0000 R CNN
F 1 "10k" H 4080 6395 50  0000 R CNN
F 2 "Resistor_SMD:R_0402_1005Metric" V 4080 6350 50  0001 C CNN
F 3 "~" H 4150 6350 50  0001 C CNN
F 4 "AVT-IPE" H 4150 6350 50  0001 C CNN "stock"
	1    4150 6350
	-1   0    0    1   
$EndComp
$Comp
L power:GND #PWR?
U 1 1 6073E9CE
P 4150 6500
F 0 "#PWR?" H 4150 6250 50  0001 C CNN
F 1 "GND" H 4155 6327 50  0000 C CNN
F 2 "" H 4150 6500 50  0001 C CNN
F 3 "" H 4150 6500 50  0001 C CNN
	1    4150 6500
	1    0    0    -1  
$EndComp
Wire Wire Line
	4150 6200 4150 6000
$Comp
L KIT_Interface_Expansion:TCA6424ARGJR U12
U 1 1 5E7CD984
P 5200 5400
F 0 "U12" H 4650 6450 60  0000 C CNN
F 1 "TCA6424ARGJR" H 5750 6450 60  0000 C CNN
F 2 "KIT_Package_DFN_QFN:TCA6424ARGJR_QFN-32-1EP_5x5mm_P0.5mm_EP3.1x3.1mm_ThermalVias" H 5200 5340 60  0001 C CNN
F 3 "https://www.ti.com/lit/ds/symlink/tca6424a.pdf" H 5200 5400 60  0001 C CNN
	1    5200 5400
	1    0    0    -1  
$EndComp
Wire Wire Line
	1800 6000 4150 6000
Connection ~ 4150 6000
Wire Wire Line
	4150 6000 4400 6000
Text GLabel 6150 5700 2    50   Input ~ 0
ATCA_ORANGE_LED
Text GLabel 6150 5800 2    50   Input ~ 0
ATCA_GREEN_LED
Text GLabel 6150 5900 2    50   Input ~ 0
LPD_HEARTBEAT_LED
Text GLabel 6150 6000 2    50   Input ~ 0
ATCA_RED_LED
Text GLabel 6150 5600 2    50   Input ~ 0
ATCA_EXTRACTION_HANDLE
Text GLabel 6150 6100 2    50   Input ~ 0
ATCA_BLUE_LED
Text GLabel 6150 5400 2    50   Input ~ 0
ATCA_FP_RESET_B
$Comp
L Device:R R?
U 1 1 6068448A
P 3250 4200
AR Path="/5EB76D90/6068448A" Ref="R?"  Part="1" 
AR Path="/5FFD078E/6068448A" Ref="R?"  Part="1" 
AR Path="/5F28C5AE/6068448A" Ref="R67"  Part="1" 
F 0 "R67" H 3180 4291 50  0000 R CNN
F 1 "10k" H 3180 4200 50  0000 R CNN
F 2 "KIT_Resistor_SMD:R_0402_1005Metric_DNP" V 3180 4200 50  0001 C CNN
F 3 "~" H 3250 4200 50  0001 C CNN
F 4 "AVT-IPE" H 3250 4200 50  0001 C CNN "stock"
F 5 "DNP" H 3180 4109 50  0000 R CNN "DNP"
	1    3250 4200
	-1   0    0    -1  
$EndComp
$Comp
L power:GND #PWR?
U 1 1 6068BEDA
P 3000 5100
F 0 "#PWR?" H 3000 4850 50  0001 C CNN
F 1 "GND" H 3005 4927 50  0000 C CNN
F 2 "" H 3000 5100 50  0001 C CNN
F 3 "" H 3000 5100 50  0001 C CNN
	1    3000 5100
	1    0    0    -1  
$EndComp
Wire Wire Line
	3250 5250 3250 5300
Wire Wire Line
	3250 5300 3100 5300
Wire Wire Line
	3100 5300 3100 5000
Wire Wire Line
	3100 5000 3000 5000
Wire Wire Line
	3000 5000 3000 5100
Wire Wire Line
	3250 4950 3250 4900
$Comp
L KIT_Logic:SN74LVC1G08 U10
U 1 1 5E4C21A7
P 1900 2450
F 0 "U10" H 1600 2300 50  0000 L CNN
F 1 "SN74LVC1G08DRLR" H 1150 2700 50  0000 L CNN
F 2 "Package_TO_SOT_SMD:SOT-553" H 1900 2450 50  0001 C CNN
F 3 "http://www.ti.com/lit/ds/symlink/sn74lvc1g08.pdf" H 1900 2450 50  0001 C CNN
F 4 "809-5977" H 1900 2450 50  0001 C CNN "rs#"
	1    1900 2450
	1    0    0    -1  
$EndComp
Wire Bus Line
	6750 4400 6750 5100
$EndSCHEMATC
