EESchema Schematic File Version 4
EELAYER 30 0
EELAYER END
$Descr A3 16535 11693
encoding utf-8
Sheet 10 28
Title "ZynqMP Mezzanine FMC+ (BuZZyBoard)"
Date "2020-10-02"
Rev "1.0"
Comp "Karlsruhe Institute of Technology (KIT)"
Comment1 "Institute for Data Processing and Electronics (IPE)"
Comment2 "Luis Ardila"
Comment3 ""
Comment4 ""
$EndDescr
$Comp
L Device:R R64
U 1 1 5D8A5766
P 5900 8600
F 0 "R64" V 6107 8600 50  0000 C CNN
F 1 "33" V 6016 8600 50  0000 C CNN
F 2 "Resistor_SMD:R_0402_1005Metric" V 5830 8600 50  0001 C CNN
F 3 "~" H 5900 8600 50  0001 C CNN
F 4 "AVT-IPE" H 5900 8600 50  0001 C CNN "stock"
	1    5900 8600
	0    -1   -1   0   
$EndComp
Wire Wire Line
	4850 8600 5750 8600
$Comp
L Device:R R63
U 1 1 5D8A57A9
P 5700 7450
F 0 "R63" V 5493 7450 50  0000 C CNN
F 1 "20k" V 5584 7450 50  0000 C CNN
F 2 "Resistor_SMD:R_0402_1005Metric" V 5630 7450 50  0001 C CNN
F 3 "~" H 5700 7450 50  0001 C CNN
F 4 "AVT-IPE" H 5700 7450 50  0001 C CNN "stock"
	1    5700 7450
	0    1    1    0   
$EndComp
$Comp
L Device:R R62
U 1 1 5D8A57D3
P 5100 9200
F 0 "R62" V 4900 9200 50  0000 C CNN
F 1 "8.06k" V 5000 9200 50  0000 C CNN
F 2 "Resistor_SMD:R_0402_1005Metric" V 5030 9200 50  0001 C CNN
F 3 "~" H 5100 9200 50  0001 C CNN
F 4 "0.1%" V 5200 9200 50  0000 C CNN "info"
F 5 "701-5620" H 5100 9200 50  0001 C CNN "rs#"
	1    5100 9200
	0    1    1    0   
$EndComp
$Comp
L KIT_Oscillator:OSC U18
U 1 1 5D8A5804
P 8200 8700
F 0 "U18" H 8750 8850 60  0000 C CNN
F 1 "OSC 52.0 MHz" H 8750 8450 60  0000 C CNN
F 2 "KIT_Crystal:Crystal_SMD_2016-4Pin_2.0x1.6mm" H 8200 8700 50  0001 C CNN
F 3 "https://media.digikey.com/pdf/Data%20Sheets/SiTime%20PDFs/SiT8008A.pdf" H 8200 8700 50  0001 C CNN
F 4 "SIT8008AI-73-33E-52.000000E" H 8200 8700 50  0001 C CNN "manf#"
F 5 "SiTIME" H 8200 8700 50  0001 C CNN "manf"
F 6 "1473-SIT8008AI-73-33E-52.000000E-ND" H 8200 8700 50  0001 C CNN "digikey#"
F 7 "52MHz XO (Standard) HCMOS, LVCMOS Oscillator 3.3V Enable/Disable 4-SMD, No Lead" H 8200 8700 50  0001 C CNN "info"
	1    8200 8700
	-1   0    0    -1  
$EndComp
$Comp
L Device:R R65
U 1 1 5D8A581B
P 8450 8700
F 0 "R65" V 8243 8700 50  0000 C CNN
F 1 "1k" V 8334 8700 50  0000 C CNN
F 2 "Resistor_SMD:R_0402_1005Metric" V 8380 8700 50  0001 C CNN
F 3 "~" H 8450 8700 50  0001 C CNN
F 4 "1%" H 8450 8700 50  0001 C CNN "info"
F 5 "AVT-IPE" H 8450 8700 50  0001 C CNN "stock"
	1    8450 8700
	0    1    1    0   
$EndComp
Text Notes 7200 7850 0    50   ~ 0
CLKOUT -> ULPI  Clock  Output  Mode:\n60 MHz ULPI clock output. All ULPI signals are driven  \nsynchronous  to  the  rising  edge  of  this  clock.
Text Label 4850 8600 0    20   ~ 0
sCLKOUT
$Comp
L power:GND #PWR?
U 1 1 5D8EDF1A
P 4850 7900
F 0 "#PWR?" H 4850 7650 50  0001 C CNN
F 1 "GND" V 4855 7772 50  0000 R CNN
F 2 "" H 4850 7900 50  0001 C CNN
F 3 "" H 4850 7900 50  0001 C CNN
	1    4850 7900
	0    -1   -1   0   
$EndComp
Wire Wire Line
	3250 7700 3050 7700
Wire Wire Line
	3050 7700 3050 7800
Wire Wire Line
	3050 7800 3250 7800
Wire Wire Line
	3050 7600 3050 7700
Connection ~ 3050 7700
Connection ~ 3050 7600
Wire Wire Line
	3250 7600 3050 7600
Wire Wire Line
	2700 7600 3050 7600
Wire Wire Line
	2700 7650 2700 7600
$Comp
L power:GND #PWR?
U 1 1 5D8EE8C5
P 2700 7650
F 0 "#PWR?" H 2700 7400 50  0001 C CNN
F 1 "GND" H 2705 7477 50  0000 C CNN
F 2 "" H 2700 7650 50  0001 C CNN
F 3 "" H 2700 7650 50  0001 C CNN
	1    2700 7650
	1    0    0    -1  
$EndComp
Text Label 5350 8800 0    50   ~ 0
USB_REFCLK
$Comp
L Device:C C126
U 1 1 5D904739
P 9250 8700
F 0 "C126" H 9365 8746 50  0000 L CNN
F 1 "0.1uF" H 9365 8655 50  0000 L CNN
F 2 "Capacitor_SMD:C_0402_1005Metric" H 9288 8550 50  0001 C CNN
F 3 "~" H 9250 8700 50  0001 C CNN
F 4 "16 V" H 9250 8700 50  0001 C CNN "info"
F 5 "AVT-IPE" H 9250 8700 50  0001 C CNN "stock"
	1    9250 8700
	1    0    0    -1  
$EndComp
Wire Wire Line
	4850 8800 7100 8800
Wire Wire Line
	8600 8500 8600 8700
$Comp
L power:GND #PWR?
U 1 1 5D914E50
P 8600 8850
F 0 "#PWR?" H 8600 8600 50  0001 C CNN
F 1 "GND" H 8605 8677 50  0000 C CNN
F 2 "" H 8600 8850 50  0001 C CNN
F 3 "" H 8600 8850 50  0001 C CNN
	1    8600 8850
	1    0    0    -1  
$EndComp
Text Notes 2150 7450 0    50   ~ 0
REFSEL[2:0] = 000\nREFCLK_Frequency = 52 MHz
NoConn ~ 4850 9000
$Comp
L power:GND #PWR?
U 1 1 5D9229F5
P 5250 9200
F 0 "#PWR?" H 5250 8950 50  0001 C CNN
F 1 "GND" V 5255 9072 50  0000 R CNN
F 2 "" H 5250 9200 50  0001 C CNN
F 3 "" H 5250 9200 50  0001 C CNN
	1    5250 9200
	0    -1   -1   0   
$EndComp
Wire Wire Line
	4950 9200 4850 9200
Text Label 4850 9200 0    20   ~ 0
sRBIAS
NoConn ~ 3250 9100
NoConn ~ 3250 9200
$Comp
L Device:C C123
U 1 1 5D92E70F
P 5750 9800
F 0 "C123" H 5865 9891 50  0000 L CNN
F 1 "1uF" H 5865 9800 50  0000 L CNN
F 2 "Capacitor_SMD:C_0402_1005Metric" H 5788 9650 50  0001 C CNN
F 3 "~" H 5750 9800 50  0001 C CNN
F 4 "16 V" H 5865 9709 50  0000 L CNN "info"
F 5 "AVT-IPE" H 5750 9800 50  0001 C CNN "stock"
	1    5750 9800
	1    0    0    -1  
$EndComp
$Comp
L Device:C C122
U 1 1 5D92F544
P 5150 9800
F 0 "C122" H 5265 9891 50  0000 L CNN
F 1 "1uF" H 5265 9800 50  0000 L CNN
F 2 "Capacitor_SMD:C_0402_1005Metric" H 5188 9650 50  0001 C CNN
F 3 "~" H 5150 9800 50  0001 C CNN
F 4 "16 V" H 5265 9709 50  0000 L CNN "info"
F 5 "AVT-IPE" H 5150 9800 50  0001 C CNN "stock"
	1    5150 9800
	1    0    0    -1  
$EndComp
$Comp
L Device:C C121
U 1 1 5D943D09
P 3000 9800
F 0 "C121" H 3115 9891 50  0000 L CNN
F 1 "1uF" H 3115 9800 50  0000 L CNN
F 2 "Capacitor_SMD:C_0402_1005Metric" H 3038 9650 50  0001 C CNN
F 3 "~" H 3000 9800 50  0001 C CNN
F 4 "16 V" H 3115 9709 50  0000 L CNN "info"
F 5 "AVT-IPE" H 3000 9800 50  0001 C CNN "stock"
	1    3000 9800
	1    0    0    -1  
$EndComp
$Comp
L power:GND #PWR?
U 1 1 5D948BE2
P 5750 9950
F 0 "#PWR?" H 5750 9700 50  0001 C CNN
F 1 "GND" H 5755 9777 50  0000 C CNN
F 2 "" H 5750 9950 50  0001 C CNN
F 3 "" H 5750 9950 50  0001 C CNN
	1    5750 9950
	1    0    0    -1  
$EndComp
$Comp
L power:GND #PWR?
U 1 1 5D948F1F
P 5150 9950
F 0 "#PWR?" H 5150 9700 50  0001 C CNN
F 1 "GND" H 5155 9777 50  0000 C CNN
F 2 "" H 5150 9950 50  0001 C CNN
F 3 "" H 5150 9950 50  0001 C CNN
	1    5150 9950
	1    0    0    -1  
$EndComp
Wire Wire Line
	8600 8800 8600 8850
Wire Wire Line
	8200 8800 8600 8800
Wire Wire Line
	8300 8700 8200 8700
Text Label 8200 8700 0    20   ~ 0
sFS_OE
Text Label 4900 7600 0    50   ~ 0
sVBUS
Text Notes 7200 7500 0    50   ~ 0
R_VBUS = 20k  \nHost  or  OTG  Host  capable  of  >100mA\nUseExternalVbusIndicator = 1
$Comp
L Device:R R61
U 1 1 5D16A69C
P 2350 9300
F 0 "R61" H 2420 9346 50  0000 L CNN
F 1 "10k" H 2420 9255 50  0000 L CNN
F 2 "Resistor_SMD:R_0402_1005Metric" V 2280 9300 50  0001 C CNN
F 3 "~" H 2350 9300 50  0001 C CNN
F 4 "" H 2350 9300 50  0001 C CNN "VPN"
F 5 "AVT-IPE" H 2350 9300 50  0001 C CNN "stock"
F 6 "1%" H 2350 9300 50  0001 C CNN "info"
	1    2350 9300
	1    0    0    -1  
$EndComp
Wire Wire Line
	2350 9450 2350 9500
Wire Wire Line
	4100 9800 4100 9950
$Comp
L power:GND #PWR?
U 1 1 5D91A769
P 4100 9950
F 0 "#PWR?" H 4100 9700 50  0001 C CNN
F 1 "GND" H 4105 9777 50  0000 C CNN
F 2 "" H 4100 9950 50  0001 C CNN
F 3 "" H 4100 9950 50  0001 C CNN
	1    4100 9950
	1    0    0    -1  
$EndComp
$Comp
L KIT_Interface_USB:USB3340-EZK-TR U17
U 1 1 5D8A5755
P 4050 8300
F 0 "U17" H 3550 9550 60  0000 C CNN
F 1 "USB3340-EZK-TR" H 4750 9550 60  0000 C CNN
F 2 "Package_DFN_QFN:QFN-32-1EP_5x5mm_P0.5mm_EP3.45x3.45mm" H 4050 8300 50  0001 C CNN
F 3 "http://ww1.microchip.com/downloads/en/DeviceDoc/00001678B.pdf" H 4050 8300 50  0001 C CNN
F 4 "Microchip" H 1050 7250 50  0001 C CNN "manf"
F 5 "USB3340-EZK-TR" H 1050 7250 50  0001 C CNN "manf#"
F 6 "716-0461" H 1050 7250 50  0001 C CNN "rs#"
	1    4050 8300
	1    0    0    -1  
$EndComp
Wire Wire Line
	5150 9500 5150 9650
$Comp
L power:GND #PWR?
U 1 1 5D38496C
P 3000 9950
F 0 "#PWR?" H 3000 9700 50  0001 C CNN
F 1 "GND" H 3005 9777 50  0000 C CNN
F 2 "" H 3000 9950 50  0001 C CNN
F 3 "" H 3000 9950 50  0001 C CNN
	1    3000 9950
	1    0    0    -1  
$EndComp
Wire Wire Line
	3000 9650 3000 9400
Wire Wire Line
	4850 9400 5750 9400
Wire Wire Line
	4850 9500 5150 9500
Wire Wire Line
	5750 9400 5750 9650
$Comp
L power:GND #PWR?
U 1 1 5D406FE8
P 1650 7100
F 0 "#PWR?" H 1650 6850 50  0001 C CNN
F 1 "GND" H 1655 6927 50  0000 C CNN
F 2 "" H 1650 7100 50  0001 C CNN
F 3 "" H 1650 7100 50  0001 C CNN
	1    1650 7100
	1    0    0    -1  
$EndComp
$Comp
L power:GND #PWR?
U 1 1 5D40E07B
P 9250 8850
F 0 "#PWR?" H 9250 8600 50  0001 C CNN
F 1 "GND" H 9255 8677 50  0000 C CNN
F 2 "" H 9250 8850 50  0001 C CNN
F 3 "" H 9250 8850 50  0001 C CNN
	1    9250 8850
	1    0    0    -1  
$EndComp
Wire Wire Line
	7100 8500 7100 8700
$Comp
L Device:C C118
U 1 1 5D45E857
P 1800 6850
F 0 "C118" H 1915 6941 50  0000 L CNN
F 1 "4.7uF" H 1915 6850 50  0000 L CNN
F 2 "Capacitor_SMD:C_0603_1608Metric" H 1838 6700 50  0001 C CNN
F 3 "~" H 1800 6850 50  0001 C CNN
F 4 "25 V" H 1915 6759 50  0000 L CNN "info"
F 5 "AVT-IPE" H 1800 6850 50  0001 C CNN "stock"
	1    1800 6850
	1    0    0    -1  
$EndComp
Text Label 4900 9400 0    20   ~ 0
sVDD18_30
Text Label 4900 9500 0    20   ~ 0
sVDD18_28
Text Label 3050 9400 0    20   ~ 0
sVDD33
Text Label 5850 7800 2    50   ~ 0
USB_C_D+
Text Label 5850 7700 2    50   ~ 0
USB_C_D-
Wire Notes Line
	7150 7150 7150 7950
Wire Notes Line
	7150 7950 9400 7950
Wire Notes Line
	9400 7950 9400 7150
Wire Notes Line
	9400 7150 7150 7150
Wire Notes Line
	7150 7550 9400 7550
Wire Wire Line
	5850 7450 5950 7450
Wire Wire Line
	4850 8100 5050 8100
Wire Wire Line
	5050 8400 4850 8400
Wire Wire Line
	5050 8300 4850 8300
Wire Wire Line
	5050 8500 4850 8500
Wire Wire Line
	6050 8600 6150 8600
Wire Wire Line
	1650 6650 1800 6650
Wire Wire Line
	1800 6700 1800 6650
Connection ~ 1800 6650
Wire Wire Line
	1800 6650 2400 6650
Wire Wire Line
	2400 7050 1800 7050
Wire Wire Line
	1800 7050 1800 7000
Wire Wire Line
	1650 7050 1650 7100
Wire Wire Line
	2400 7000 2400 7050
Wire Wire Line
	2400 6650 2400 6700
$Comp
L Device:C C119
U 1 1 5D9277B5
P 2400 6850
F 0 "C119" H 2285 6896 50  0000 R CNN
F 1 "0.1uF" H 2285 6805 50  0000 R CNN
F 2 "Capacitor_SMD:C_0402_1005Metric" H 2438 6700 50  0001 C CNN
F 3 "~" H 2400 6850 50  0001 C CNN
F 4 "16 V" H 2400 6850 50  0001 C CNN "info"
F 5 "AVT-IPE" H 2400 6850 50  0001 C CNN "stock"
	1    2400 6850
	-1   0    0    -1  
$EndComp
Wire Wire Line
	2400 6650 3000 6650
Wire Wire Line
	3000 7050 2400 7050
Wire Wire Line
	3000 7000 3000 7050
Wire Wire Line
	3000 6650 3000 6700
$Comp
L Device:C C120
U 1 1 614C4BA7
P 3000 6850
F 0 "C120" H 2885 6896 50  0000 R CNN
F 1 "0.1uF" H 2885 6805 50  0000 R CNN
F 2 "Capacitor_SMD:C_0402_1005Metric" H 3038 6700 50  0001 C CNN
F 3 "~" H 3000 6850 50  0001 C CNN
F 4 "16 V" H 3000 6850 50  0001 C CNN "info"
F 5 "AVT-IPE" H 3000 6850 50  0001 C CNN "stock"
	1    3000 6850
	-1   0    0    -1  
$EndComp
Connection ~ 2400 6650
Connection ~ 2400 7050
Wire Wire Line
	4250 6750 4250 6950
Wire Wire Line
	3950 6750 3950 6950
Wire Wire Line
	3950 6750 4250 6750
Wire Wire Line
	4850 7700 5850 7700
Wire Wire Line
	4850 7800 5850 7800
Wire Wire Line
	3000 9400 3250 9400
$Comp
L Connector:USB_C_Receptacle J1
U 1 1 5FD5E5B1
P 15200 3200
AR Path="/5FD5E5B1" Ref="J1"  Part="1" 
AR Path="/5FA2C9D2/5FD5E5B1" Ref="J1"  Part="1" 
F 0 "J1" H 15307 4467 50  0000 C CNN
F 1 "USB_C_Receptacle" H 15307 4376 50  0000 C CNN
F 2 "KIT_Connector:USBC_DX07S024JJ2R1300" H 15350 3200 50  0001 C CNN
F 3 "https://www.usb.org/sites/default/files/documents/usb_type-c.zip" H 15350 3200 50  0001 C CNN
F 4 "JAE Electronics" H 15200 3200 50  0001 C CNN "manf"
F 5 "DX07S024JJ2R1300" H 15200 3200 50  0001 C CNN "manf#"
F 6 "670-2794-1-ND" H 15200 3200 50  0001 C CNN "digikey#"
F 7 "910-8544" H 15200 3200 50  0001 C CNN "rs#"
	1    15200 3200
	-1   0    0    -1  
$EndComp
$Comp
L Device:C C125
U 1 1 5E874929
P 13300 3300
F 0 "C125" V 13250 3400 50  0000 L CNN
F 1 "0.1uF" V 13250 3200 50  0000 R CNN
F 2 "Capacitor_SMD:C_0201_0603Metric" H 13338 3150 50  0001 C CNN
F 3 "~" H 13300 3300 50  0001 C CNN
	1    13300 3300
	0    -1   1    0   
$EndComp
$Comp
L Device:C C128
U 1 1 5E874937
P 13850 3200
F 0 "C128" V 13800 3300 50  0000 L CNN
F 1 "0.1uF" V 13800 3100 50  0000 R CNN
F 2 "Capacitor_SMD:C_0201_0603Metric" H 13888 3050 50  0001 C CNN
F 3 "~" H 13850 3200 50  0001 C CNN
	1    13850 3200
	0    -1   1    0   
$EndComp
$Comp
L Device:C C124
U 1 1 5E87493F
P 13300 3900
F 0 "C124" V 13250 4000 50  0000 L CNN
F 1 "0.1uF" V 13250 3800 50  0000 R CNN
F 2 "Capacitor_SMD:C_0201_0603Metric" H 13338 3750 50  0001 C CNN
F 3 "~" H 13300 3900 50  0001 C CNN
	1    13300 3900
	0    -1   1    0   
$EndComp
$Comp
L Device:C C127
U 1 1 5E874946
P 13850 3800
F 0 "C127" V 13800 3900 50  0000 L CNN
F 1 "0.1uF" V 13800 3700 50  0000 R CNN
F 2 "Capacitor_SMD:C_0201_0603Metric" H 13888 3650 50  0001 C CNN
F 3 "~" H 13850 3800 50  0001 C CNN
	1    13850 3800
	0    -1   1    0   
$EndComp
Text Label 12550 4100 0    50   ~ 0
C_TX2_N
Text Label 12550 4200 0    50   ~ 0
C_TX2_P
Text Label 12550 3500 0    50   ~ 0
C_TX1_N
Text Label 12550 3600 0    50   ~ 0
C_TX1_P
Wire Wire Line
	12550 3800 13700 3800
Wire Wire Line
	13150 3300 12550 3300
Wire Wire Line
	12550 3200 13700 3200
Wire Wire Line
	13150 3900 12550 3900
Text Label 2500 8700 0    50   ~ 0
USB_DATA_7
Text Label 2500 8600 0    50   ~ 0
USB_DATA_6
Text Label 2500 8500 0    50   ~ 0
USB_DATA_5
Text Label 2500 8400 0    50   ~ 0
USB_DATA_4
Text Label 2500 8300 0    50   ~ 0
USB_DATA_3
Text GLabel 6150 8600 2    50   Output ~ 0
USB_CLK_IN
Text GLabel 5050 8500 2    50   Output ~ 0
USB_DIR
Text GLabel 5050 8400 2    50   Output ~ 0
USB_NXT
Text GLabel 5050 8300 2    50   Input ~ 0
USB_STP
Text GLabel 2150 9500 0    50   Input ~ 0
USB_RESET_B
Text GLabel 2300 7900 0    50   BiDi ~ 0
USB_DATA_[0..7]
Entry Wire Line
	2400 8200 2500 8300
Entry Wire Line
	2400 8300 2500 8400
Entry Wire Line
	2400 8400 2500 8500
Entry Wire Line
	2400 8500 2500 8600
Entry Wire Line
	2400 8600 2500 8700
Wire Bus Line
	2300 7900 2400 7900
$Comp
L KIT_Power:+3V3_STBY #PWR?
U 1 1 5F65884B
P 1650 6600
F 0 "#PWR?" H 1650 6450 50  0001 C CNN
F 1 "+3V3_STBY" H 1665 6773 50  0000 C CNN
F 2 "" H 1650 6600 50  0001 C CNN
F 3 "" H 1650 6600 50  0001 C CNN
	1    1650 6600
	1    0    0    -1  
$EndComp
Wire Wire Line
	1650 6600 1650 6650
Wire Wire Line
	1800 7050 1650 7050
Connection ~ 1800 7050
Wire Wire Line
	3950 6700 3950 6750
$Comp
L KIT_Power:+3V3_STBY #PWR?
U 1 1 5F687517
P 3950 6700
F 0 "#PWR?" H 3950 6550 50  0001 C CNN
F 1 "+3V3_STBY" H 3965 6873 50  0000 C CNN
F 2 "" H 3950 6700 50  0001 C CNN
F 3 "" H 3950 6700 50  0001 C CNN
	1    3950 6700
	1    0    0    -1  
$EndComp
Connection ~ 3950 6750
$Comp
L KIT_Power:+3V3_STBY #PWR?
U 1 1 5F6A269A
P 2350 9100
F 0 "#PWR?" H 2350 8950 50  0001 C CNN
F 1 "+3V3_STBY" H 2365 9273 50  0000 C CNN
F 2 "" H 2350 9100 50  0001 C CNN
F 3 "" H 2350 9100 50  0001 C CNN
	1    2350 9100
	1    0    0    -1  
$EndComp
Wire Wire Line
	2350 9100 2350 9150
Wire Wire Line
	2150 9500 2350 9500
Wire Wire Line
	3250 8900 2800 8900
Wire Wire Line
	2800 8900 2800 9500
Wire Wire Line
	2800 9500 2350 9500
Connection ~ 2350 9500
Entry Wire Line
	2400 8000 2500 8100
Entry Wire Line
	2400 7900 2500 8000
Text Label 2500 8100 0    50   ~ 0
USB_DATA_1
Text Label 2500 8000 0    50   ~ 0
USB_DATA_0
Text Label 2500 8200 0    50   ~ 0
USB_DATA_2
Entry Wire Line
	2400 8100 2500 8200
Wire Wire Line
	2500 8000 3250 8000
Wire Wire Line
	2500 8100 3250 8100
Wire Wire Line
	2500 8200 3250 8200
Wire Wire Line
	2500 8300 3250 8300
Wire Wire Line
	2500 8400 3250 8400
Wire Wire Line
	2500 8500 3250 8500
Wire Wire Line
	2500 8600 3250 8600
Wire Wire Line
	2500 8700 3250 8700
$Comp
L power:GND #PWR?
U 1 1 5F8D1561
P 15200 5250
F 0 "#PWR?" H 15200 5000 50  0001 C CNN
F 1 "GND" H 15205 5077 50  0000 C CNN
F 2 "" H 15200 5250 50  0001 C CNN
F 3 "" H 15200 5250 50  0001 C CNN
	1    15200 5250
	1    0    0    -1  
$EndComp
$Comp
L Device:R R66
U 1 1 5F8D2826
P 15500 5000
F 0 "R66" H 15430 4954 50  0000 R CNN
F 1 "0" H 15430 5045 50  0000 R CNN
F 2 "Resistor_SMD:R_0402_1005Metric" V 15430 5000 50  0001 C CNN
F 3 "~" H 15500 5000 50  0001 C CNN
F 4 "AVT-IPE" H 15500 5000 50  0001 C CNN "stock"
	1    15500 5000
	-1   0    0    1   
$EndComp
Wire Wire Line
	15500 5150 15500 5200
Wire Wire Line
	15500 5200 15200 5200
Wire Wire Line
	15200 5200 15200 5250
Wire Wire Line
	15200 5200 15200 4800
Connection ~ 15200 5200
Wire Wire Line
	15500 4850 15500 4800
Text Label 14100 2900 0    50   ~ 0
USB_D+
Text Label 14100 2700 0    50   ~ 0
USB_D-
Wire Wire Line
	14600 2800 14450 2800
Wire Wire Line
	14450 2800 14450 2700
Connection ~ 14450 2700
Wire Wire Line
	14450 2700 14600 2700
Wire Wire Line
	14600 3000 14450 3000
Wire Wire Line
	14450 3000 14450 2900
Connection ~ 14450 2900
Wire Wire Line
	14450 2900 14600 2900
Wire Wire Line
	5950 7200 5950 7450
Wire Wire Line
	5550 7450 5250 7450
Wire Wire Line
	5250 7450 5250 7600
Wire Wire Line
	4850 7600 5250 7600
Text GLabel 5050 8100 2    50   Output ~ 0
USB_PWR_CPEN
$Comp
L KIT_Interface_USB:HD3SS3220IRNHT U3
U 1 1 60403A68
P 7550 3300
F 0 "U3" H 7000 1950 60  0000 C CNN
F 1 "HD3SS3220IRNHT" H 8100 1950 60  0000 C CNN
F 2 "KIT_Package_DFN_QFN:HD3SS3220IRNHT" H 7550 5090 60  0001 C CNN
F 3 "http://www.ti.com/general/docs/suppproductinfo.tsp?distId=10&gotoUrl=http%3A%2F%2Fwww.ti.com%2Flit%2Fgpn%2Fhd3ss3220" H 7550 3300 60  0001 C CNN
F 4 "Texas Instruments" H 7550 3300 50  0001 C CNN "manf"
F 5 "HD3SS3220IRNHT" H 7550 3300 50  0001 C CNN "manf#"
F 6 "USB, Type-C Controller PMIC 30-WQFN (4.5x2.5)" H 7550 3300 50  0001 C CNN "info"
F 7 "296-43694-1-ND" H 7550 3300 50  0001 C CNN "digikey#"
	1    7550 3300
	1    0    0    -1  
$EndComp
Wire Wire Line
	8450 3000 9100 3000
Text Label 9100 3000 2    50   ~ 0
CC1
Wire Wire Line
	8450 3100 9100 3100
Text Label 9100 3100 2    50   ~ 0
CC2
Text Label 12550 3200 0    50   ~ 0
C_RX1_N
Text Label 12550 3300 0    50   ~ 0
C_RX1_P
Text Label 12550 3900 0    50   ~ 0
C_RX2_P
Text Label 12550 3800 0    50   ~ 0
C_RX2_N
Wire Wire Line
	14600 2400 14400 2400
Text Label 14400 2400 0    50   ~ 0
CC1
Wire Wire Line
	14600 2500 14400 2500
Text Label 14400 2500 0    50   ~ 0
CC2
$Comp
L KIT_Interface_USB:TPD4E05U06DQAR U20
U 1 1 608B70FA
P 14650 7350
F 0 "U20" H 14600 7127 50  0000 C CNN
F 1 "TPD4E05U06DQAR" H 14600 7036 50  0000 C CNN
F 2 "KIT_Package_SON:TI_TPD4E05U06DQAR" H 14300 7100 50  0001 L BNN
F 3 "https://www.ti.com/lit/ds/symlink/tpd4e05u06.pdf" H 14100 7000 50  0001 L BNN
F 4 "296-35765-1-ND" H 14650 7350 50  0001 C CNN "digikey#"
F 5 "14V Clamp 2.5A (8/20µs) Ipp Tvs Diode Surface Mount 10-USON (2.5x1)" H 14650 7350 50  0001 C CNN "info"
F 6 "Texas Instruments" H 14650 7350 50  0001 C CNN "manf"
F 7 "TPD4E05U06DQAR" H 14650 7350 50  0001 C CNN "manf#"
	1    14650 7350
	1    0    0    -1  
$EndComp
$Comp
L power:GND #PWR?
U 1 1 608B8D76
P 14150 6650
F 0 "#PWR?" H 14150 6400 50  0001 C CNN
F 1 "GND" V 14155 6522 50  0000 R CNN
F 2 "" H 14150 6650 50  0001 C CNN
F 3 "" H 14150 6650 50  0001 C CNN
	1    14150 6650
	0    1    1    0   
$EndComp
$Comp
L power:GND #PWR?
U 1 1 608B9038
P 14150 7250
F 0 "#PWR?" H 14150 7000 50  0001 C CNN
F 1 "GND" V 14155 7122 50  0000 R CNN
F 2 "" H 14150 7250 50  0001 C CNN
F 3 "" H 14150 7250 50  0001 C CNN
	1    14150 7250
	0    1    1    0   
$EndComp
$Comp
L power:GND #PWR?
U 1 1 608B92E7
P 15050 7250
F 0 "#PWR?" H 15050 7000 50  0001 C CNN
F 1 "GND" V 15055 7122 50  0000 R CNN
F 2 "" H 15050 7250 50  0001 C CNN
F 3 "" H 15050 7250 50  0001 C CNN
	1    15050 7250
	0    -1   -1   0   
$EndComp
$Comp
L power:GND #PWR?
U 1 1 608B9663
P 15050 6650
F 0 "#PWR?" H 15050 6400 50  0001 C CNN
F 1 "GND" V 15055 6522 50  0000 R CNN
F 2 "" H 15050 6650 50  0001 C CNN
F 3 "" H 15050 6650 50  0001 C CNN
	1    15050 6650
	0    -1   -1   0   
$EndComp
$Comp
L KIT_Interface_USB:TPD4E05U06DQAR U19
U 1 1 6085BB41
P 14650 6750
F 0 "U19" H 14600 7275 50  0000 C CNN
F 1 "TPD4E05U06DQAR" H 14600 7184 50  0000 C CNN
F 2 "KIT_Package_SON:TI_TPD4E05U06DQAR" H 14300 6500 50  0001 L BNN
F 3 "https://www.ti.com/lit/ds/symlink/tpd4e05u06.pdf" H 14100 6400 50  0001 L BNN
F 4 "296-35765-1-ND" H 14650 6750 50  0001 C CNN "digikey#"
F 5 "14V Clamp 2.5A (8/20µs) Ipp Tvs Diode Surface Mount 10-USON (2.5x1)" H 14650 6750 50  0001 C CNN "info"
F 6 "Texas Instruments" H 14650 6750 50  0001 C CNN "manf"
F 7 "TPD4E05U06DQAR" H 14650 6750 50  0001 C CNN "manf#"
	1    14650 6750
	1    0    0    -1  
$EndComp
Wire Wire Line
	12550 3500 14600 3500
Wire Wire Line
	12550 3600 14600 3600
Wire Wire Line
	12550 4100 14600 4100
Wire Wire Line
	12550 4200 14600 4200
Text Label 14200 3200 0    50   ~ 0
sC_RX1_N
Text Label 14200 3300 0    50   ~ 0
sC_RX1_P
Text Label 14200 3800 0    50   ~ 0
sC_RX2_N
Text Label 14200 3900 0    50   ~ 0
sC_RX2_P
Text Label 13500 6450 0    50   ~ 0
sC_RX1_N
Wire Wire Line
	13500 6450 14150 6450
Wire Wire Line
	14150 6550 13500 6550
Text Label 15700 6450 2    50   ~ 0
sC_RX1_N
Text Label 15700 6550 2    50   ~ 0
sC_RX1_P
Wire Wire Line
	15700 6450 15050 6450
Wire Wire Line
	15050 6550 15700 6550
Text Label 15700 7450 2    50   ~ 0
C_TX2_N
Text Label 15700 7350 2    50   ~ 0
C_TX2_P
Text Label 15700 6750 2    50   ~ 0
C_TX1_N
Text Label 15700 6850 2    50   ~ 0
C_TX1_P
Text Label 15700 7050 2    50   ~ 0
sC_RX2_P
Text Label 15700 7150 2    50   ~ 0
sC_RX2_N
Wire Wire Line
	15700 6750 15050 6750
Wire Wire Line
	15050 6850 15700 6850
Wire Wire Line
	15700 7150 15050 7150
Wire Wire Line
	15050 7050 15700 7050
Wire Wire Line
	15700 7450 15050 7450
Wire Wire Line
	15050 7350 15700 7350
Wire Wire Line
	14150 6750 13500 6750
Wire Wire Line
	13500 6850 14150 6850
Wire Wire Line
	14150 7150 13500 7150
Wire Wire Line
	13500 7050 14150 7050
Wire Wire Line
	14150 7450 13500 7450
Wire Wire Line
	13500 7350 14150 7350
Text Label 13500 7450 0    50   ~ 0
C_TX2_N
Text Label 13500 7350 0    50   ~ 0
C_TX2_P
Text Label 13500 6750 0    50   ~ 0
C_TX1_N
Text Label 13500 6850 0    50   ~ 0
C_TX1_P
Text Label 13500 7050 0    50   ~ 0
sC_RX2_P
Text Label 13500 7150 0    50   ~ 0
sC_RX2_N
$Comp
L KIT_Interface_USB:TPD6E05U06RVZR U21
U 1 1 60F974E7
P 14650 8400
F 0 "U21" H 14600 8915 50  0000 C CNN
F 1 "TPD6E05U06RVZR" H 14600 8824 50  0000 C CNN
F 2 "KIT_Package_SON:TI_TPD6E05U06RVZR" H 13900 7750 50  0001 L BNN
F 3 "https://www.ti.com/lit/ds/symlink/tpd4e05u06.pdf" H 15100 8050 50  0001 L BNN
F 4 "296-39349-1-ND" H 14650 8400 50  0001 C CNN "digikey#"
F 5 "14V Clamp 2.5A (8/20µs) Ipp Tvs Diode Surface Mount 14-USON (3.50x1.35)" H 14650 8400 50  0001 C CNN "info"
F 6 "Texas Instruments" H 14650 8400 50  0001 C CNN "manf"
F 7 "TPD6E05U06RVZR" H 14650 8400 50  0001 C CNN "manf#"
	1    14650 8400
	1    0    0    -1  
$EndComp
Text Label 15700 8350 2    50   ~ 0
USB_D-
Wire Wire Line
	15050 8150 15700 8150
Text Label 15700 8150 2    50   ~ 0
CC1
Wire Wire Line
	15700 8350 15050 8350
Text Label 15700 8450 2    50   ~ 0
USB_D+
Wire Wire Line
	15700 8450 15050 8450
Text Label 14250 4400 0    50   ~ 0
SBU1
Wire Wire Line
	14250 4400 14600 4400
Text Label 14250 4500 0    50   ~ 0
SBU2
Wire Wire Line
	14250 4500 14600 4500
Wire Wire Line
	15700 8650 15050 8650
Text Label 15700 8250 2    50   ~ 0
SBU2
Wire Wire Line
	15700 8750 15050 8750
$Comp
L power:GND #PWR?
U 1 1 60FD9DCC
P 15050 8550
F 0 "#PWR?" H 15050 8300 50  0001 C CNN
F 1 "GND" V 15055 8422 50  0000 R CNN
F 2 "" H 15050 8550 50  0001 C CNN
F 3 "" H 15050 8550 50  0001 C CNN
	1    15050 8550
	0    -1   -1   0   
$EndComp
$Comp
L power:GND #PWR?
U 1 1 60FDA0C1
P 14150 8550
F 0 "#PWR?" H 14150 8300 50  0001 C CNN
F 1 "GND" V 14155 8422 50  0000 R CNN
F 2 "" H 14150 8550 50  0001 C CNN
F 3 "" H 14150 8550 50  0001 C CNN
	1    14150 8550
	0    1    1    0   
$EndComp
Text Label 13500 8350 0    50   ~ 0
USB_D-
Wire Wire Line
	14150 8150 13500 8150
Text Label 13500 8150 0    50   ~ 0
CC1
Wire Wire Line
	14150 8650 13500 8650
Text Label 13500 8650 0    50   ~ 0
CC2
Wire Wire Line
	13500 8350 14150 8350
Text Label 13500 8450 0    50   ~ 0
USB_D+
Wire Wire Line
	13500 8450 14150 8450
Text Label 13500 8750 0    50   ~ 0
SBU1
Wire Wire Line
	13500 8250 14150 8250
Text Label 13500 8250 0    50   ~ 0
SBU2
Wire Wire Line
	13500 8750 14150 8750
Text Label 15700 8750 2    50   ~ 0
SBU1
Text Label 15700 8650 2    50   ~ 0
CC2
Wire Wire Line
	15050 8250 15700 8250
$Comp
L Device:C C138
U 1 1 6110C506
P 13600 2900
F 0 "C138" V 13550 3050 50  0000 L CNN
F 1 "0.1uF" V 13550 2800 50  0000 R CNN
F 2 "Capacitor_SMD:C_0201_0603Metric" H 13638 2750 50  0001 C CNN
F 3 "~" H 13600 2900 50  0001 C CNN
	1    13600 2900
	0    -1   1    0   
$EndComp
$Comp
L Device:C C137
U 1 1 6110C50C
P 13600 2700
F 0 "C137" V 13550 2850 50  0000 L CNN
F 1 "0.1uF" V 13550 2600 50  0000 R CNN
F 2 "Capacitor_SMD:C_0201_0603Metric" H 13638 2550 50  0001 C CNN
F 3 "~" H 13600 2700 50  0001 C CNN
	1    13600 2700
	0    -1   1    0   
$EndComp
Wire Wire Line
	13750 2700 14450 2700
Wire Wire Line
	13750 2900 14450 2900
Wire Wire Line
	13450 2700 12700 2700
Wire Wire Line
	13450 2900 12700 2900
Text Label 12700 2900 0    50   ~ 0
USB_C_D+
Text Label 12700 2700 0    50   ~ 0
USB_C_D-
$Comp
L power:GND #PWR?
U 1 1 62274C0C
P 7350 4950
F 0 "#PWR?" H 7350 4700 50  0001 C CNN
F 1 "GND" H 7355 4777 50  0000 C CNN
F 2 "" H 7350 4950 50  0001 C CNN
F 3 "" H 7350 4950 50  0001 C CNN
	1    7350 4950
	1    0    0    -1  
$EndComp
Wire Wire Line
	7350 4950 7350 4900
Wire Wire Line
	7350 4900 7450 4900
Wire Wire Line
	7650 4900 7650 4800
Connection ~ 7350 4900
Wire Wire Line
	7350 4900 7350 4800
Wire Wire Line
	7450 4800 7450 4900
Connection ~ 7450 4900
Wire Wire Line
	7450 4900 7650 4900
$Comp
L KIT_Power:+3V3_STBY #PWR?
U 1 1 5F05E375
P 7100 8500
F 0 "#PWR?" H 7100 8350 50  0001 C CNN
F 1 "+3V3_STBY" H 7115 8673 50  0000 C CNN
F 2 "" H 7100 8500 50  0001 C CNN
F 3 "" H 7100 8500 50  0001 C CNN
	1    7100 8500
	1    0    0    -1  
$EndComp
$Comp
L KIT_Power:+3V3_STBY #PWR?
U 1 1 5F05E87C
P 8600 8500
F 0 "#PWR?" H 8600 8350 50  0001 C CNN
F 1 "+3V3_STBY" H 8615 8673 50  0000 C CNN
F 2 "" H 8600 8500 50  0001 C CNN
F 3 "" H 8600 8500 50  0001 C CNN
	1    8600 8500
	1    0    0    -1  
$EndComp
$Comp
L KIT_Power:+3V3_STBY #PWR?
U 1 1 5F05EC12
P 9250 8550
F 0 "#PWR?" H 9250 8400 50  0001 C CNN
F 1 "+3V3_STBY" H 9265 8723 50  0000 C CNN
F 2 "" H 9250 8550 50  0001 C CNN
F 3 "" H 9250 8550 50  0001 C CNN
	1    9250 8550
	1    0    0    -1  
$EndComp
$Comp
L KIT_Power:+3V3_STBY #PWR?
U 1 1 5F0746B4
P 5600 1400
F 0 "#PWR?" H 5600 1250 50  0001 C CNN
F 1 "+3V3_STBY" H 5615 1573 50  0000 C CNN
F 2 "" H 5600 1400 50  0001 C CNN
F 3 "" H 5600 1400 50  0001 C CNN
	1    5600 1400
	1    0    0    -1  
$EndComp
Text Notes 4550 6550 0    50   ~ 0
3V3 @ 40mA
Wire Notes Line
	2400 9850 2300 9650
Wire Wire Line
	2350 9600 2350 9500
$Comp
L Device:R R25
U 1 1 5F510686
P 2350 9750
F 0 "R25" H 2420 9841 50  0000 L CNN
F 1 "10k" H 2420 9750 50  0000 L CNN
F 2 "KIT_Resistor_SMD:R_0402_1005Metric_DNP" V 2280 9750 50  0001 C CNN
F 3 "~" H 2350 9750 50  0001 C CNN
F 4 "AVT-IPE" H 2350 9750 50  0001 C CNN "stock"
F 5 "DNP" H 2420 9659 50  0000 L CNN "DNP"
	1    2350 9750
	1    0    0    -1  
$EndComp
$Comp
L power:GND #PWR?
U 1 1 5F53AB88
P 2350 9950
F 0 "#PWR?" H 2350 9700 50  0001 C CNN
F 1 "GND" H 2355 9777 50  0000 C CNN
F 2 "" H 2350 9950 50  0001 C CNN
F 3 "" H 2350 9950 50  0001 C CNN
	1    2350 9950
	1    0    0    -1  
$EndComp
Wire Wire Line
	2350 9950 2350 9900
$Comp
L Device:R R21
U 1 1 5F5D709A
P 2700 1750
F 0 "R21" H 2770 1796 50  0000 L CNN
F 1 "10k" H 2770 1705 50  0000 L CNN
F 2 "Resistor_SMD:R_0402_1005Metric" H 2770 1659 50  0001 L CNN
F 3 "~" H 2700 1750 50  0001 C CNN
F 4 "AVT-IPE" H 2700 1750 50  0001 C CNN "stock"
	1    2700 1750
	-1   0    0    -1  
$EndComp
Text GLabel 5350 4000 0    50   Input ~ 0
PS_MGT_TX_P1
Text GLabel 5350 4300 0    50   Output ~ 0
PS_MGT_RX_P1
Text GLabel 5350 4200 0    50   Output ~ 0
PS_MGT_RX_N1
Text GLabel 5350 3900 0    50   Input ~ 0
PS_MGT_TX_N1
$Comp
L KIT_Power:+5V_USB_VBUS #PWR?
U 1 1 5ECAEBA7
P 14350 2150
F 0 "#PWR?" H 14350 2000 50  0001 C CNN
F 1 "+5V_USB_VBUS" H 14365 2323 50  0000 C CNN
F 2 "" H 14350 2150 50  0001 C CNN
F 3 "" H 14350 2150 50  0001 C CNN
	1    14350 2150
	1    0    0    -1  
$EndComp
Wire Wire Line
	14350 2150 14350 2200
Wire Wire Line
	14350 2200 14600 2200
$Comp
L Device:Ferrite_Bead FB?
U 1 1 5ECE6175
P 6250 1450
AR Path="/5DEF958D/5ECE6175" Ref="FB?"  Part="1" 
AR Path="/5FA2C9D2/5ECE6175" Ref="FB11"  Part="1" 
F 0 "FB11" V 5976 1450 50  0000 C CNN
F 1 "220 Ohms @ 100MHz" V 6067 1450 50  0000 C CNN
F 2 "Inductor_SMD:L_0603_1608Metric" V 6180 1450 50  0001 C CNN
F 3 "https://product.tdk.com/info/en/catalog/datasheets/beads_automotive_power_mpz1608_en.pdf" H 6250 1450 50  0001 C CNN
F 4 "220 Ohms @ 100MHz 1 Power Line Ferrite Bead 0603 (1608 Metric) 2.2A 50mOhm " V 6250 1450 50  0001 C CNN "info"
F 5 "TDK" V 6250 1450 50  0001 C CNN "manf"
F 6 "MPZ1608S221ATD25" V 6250 1450 50  0001 C CNN "manf#"
	1    6250 1450
	0    1    1    0   
$EndComp
$Comp
L Device:C C163
U 1 1 5ED196DA
P 6900 1650
F 0 "C163" H 6785 1696 50  0000 R CNN
F 1 "0.1uF" H 6785 1605 50  0000 R CNN
F 2 "Capacitor_SMD:C_0402_1005Metric" H 6938 1500 50  0001 C CNN
F 3 "~" H 6900 1650 50  0001 C CNN
F 4 "16 V" H 6900 1650 50  0001 C CNN "info"
F 5 "AVT-IPE" H 6900 1650 50  0001 C CNN "stock"
	1    6900 1650
	-1   0    0    -1  
$EndComp
Wire Wire Line
	5600 1400 5600 1450
Wire Wire Line
	5600 1450 6100 1450
Text Notes 700  1100 0    50   ~ 0
\nPORT -> \nH - DFP (Pull-up to VDD if DFP mode is desired)\nNC - DRP (Leave unconnected if DRP mode is desired)\nL - UFP(Pull-downor tie to GNDif UFPmodeis desired)
Wire Wire Line
	5350 4300 5500 4300
Wire Wire Line
	5350 4200 6050 4200
$Comp
L Device:C C162
U 1 1 5EDC9987
P 6200 4200
F 0 "C162" V 6150 4300 50  0000 L CNN
F 1 "0.1uF" V 6150 4100 50  0000 R CNN
F 2 "Capacitor_SMD:C_0201_0603Metric" H 6238 4050 50  0001 C CNN
F 3 "~" H 6200 4200 50  0001 C CNN
	1    6200 4200
	0    -1   1    0   
$EndComp
$Comp
L Device:C C160
U 1 1 5EDC9981
P 5650 4300
F 0 "C160" V 5600 4400 50  0000 L CNN
F 1 "0.1uF" V 5600 4200 50  0000 R CNN
F 2 "Capacitor_SMD:C_0201_0603Metric" H 5688 4150 50  0001 C CNN
F 3 "~" H 5650 4300 50  0001 C CNN
	1    5650 4300
	0    -1   1    0   
$EndComp
Wire Wire Line
	5350 4000 5500 4000
Wire Wire Line
	5350 3900 6050 3900
$Comp
L Device:C C161
U 1 1 5EE16132
P 6200 3900
F 0 "C161" V 6150 4000 50  0000 L CNN
F 1 "0.1uF" V 6150 3800 50  0000 R CNN
F 2 "Capacitor_SMD:C_0201_0603Metric" H 6238 3750 50  0001 C CNN
F 3 "~" H 6200 3900 50  0001 C CNN
	1    6200 3900
	0    -1   1    0   
$EndComp
$Comp
L Device:C C159
U 1 1 5EE16138
P 5650 4000
F 0 "C159" V 5600 4100 50  0000 L CNN
F 1 "0.1uF" V 5600 3900 50  0000 R CNN
F 2 "Capacitor_SMD:C_0201_0603Metric" H 5688 3850 50  0001 C CNN
F 3 "~" H 5650 4000 50  0001 C CNN
	1    5650 4000
	0    -1   1    0   
$EndComp
Wire Wire Line
	5800 4000 6750 4000
Wire Wire Line
	6350 3900 6750 3900
Wire Wire Line
	6350 4200 6750 4200
Wire Wire Line
	5800 4300 6750 4300
Text Label 6100 3000 0    50   ~ 0
CURRENT_MODE
Text Label 6100 3100 0    50   ~ 0
PORT
Text Label 6100 3200 0    50   ~ 0
VBUS_DET
Text Label 6100 3300 0    50   ~ 0
EN_MUX_N
Text Label 6100 3400 0    50   ~ 0
ADDR
Text Label 6100 3500 0    50   ~ 0
EN_CC_N
Text Label 6550 3900 0    50   ~ 0
TX_N
Text Label 6550 4000 0    50   ~ 0
TX_P
Text Label 6550 4200 0    50   ~ 0
RX_N
Text Label 6550 4300 0    50   ~ 0
RX_P
$Comp
L Device:R R?
U 1 1 5F5C757B
P 4950 1800
AR Path="/5F7224E6/5F5C757B" Ref="R?"  Part="1" 
AR Path="/5FA2C9D2/5F5C757B" Ref="R22"  Part="1" 
F 0 "R22" H 5020 1846 50  0000 L CNN
F 1 "10k" H 5020 1755 50  0000 L CNN
F 2 "Resistor_SMD:R_0402_1005Metric" V 4880 1800 50  0001 C CNN
F 3 "~" H 4950 1800 50  0001 C CNN
F 4 "AVT-IPE" H 4950 1800 50  0001 C CNN "stock"
	1    4950 1800
	-1   0    0    -1  
$EndComp
Text Label 9100 3700 2    50   ~ 0
C_TX2_N
Text Label 9100 3600 2    50   ~ 0
C_TX2_P
Text Label 9100 4200 2    50   ~ 0
C_TX1_N
Text Label 9100 4300 2    50   ~ 0
C_TX1_P
Text Label 9100 3900 2    50   ~ 0
C_RX1_N
Text Label 9100 4000 2    50   ~ 0
C_RX1_P
Text Label 9100 3300 2    50   ~ 0
C_RX2_P
Text Label 9100 3400 2    50   ~ 0
C_RX2_N
Wire Wire Line
	9100 3300 8450 3300
Wire Wire Line
	9100 3400 8450 3400
Wire Wire Line
	9100 3600 8450 3600
Wire Wire Line
	9100 3700 8450 3700
Wire Wire Line
	9100 4000 8450 4000
Wire Wire Line
	9100 3900 8450 3900
Wire Wire Line
	9100 4300 8450 4300
Wire Wire Line
	9100 4200 8450 4200
Text Notes 9350 3600 0    50   ~ 0
Note: HD3SS3220 \nDoes Not Care \nAbout Differential \nPair Polarity
Wire Notes Line
	8700 3200 10250 3200
Wire Notes Line
	8700 3750 10250 3750
Wire Wire Line
	7350 1400 7350 1450
$Comp
L KIT_Power:+3V3_USB #PWR?
U 1 1 5F1442E4
P 7350 1400
F 0 "#PWR?" H 7350 1250 50  0001 C CNN
F 1 "+3V3_USB" H 7365 1573 50  0000 C CNN
F 2 "" H 7350 1400 50  0001 C CNN
F 3 "" H 7350 1400 50  0001 C CNN
	1    7350 1400
	1    0    0    -1  
$EndComp
Wire Wire Line
	7350 1900 7350 1450
Connection ~ 7350 1450
Wire Wire Line
	14000 3200 14600 3200
Wire Wire Line
	13450 3300 14600 3300
Wire Wire Line
	14000 3800 14600 3800
Wire Wire Line
	13450 3900 14600 3900
Text Label 13500 6550 0    50   ~ 0
sC_RX1_P
Wire Notes Line
	10250 3750 10250 3200
Wire Notes Line
	8700 3200 8700 3750
Text Notes 3100 1100 0    50   ~ 0
CURRENT_MODE -> Thepin has 250 K internalpull-down\nL – Low - Default– 900 mA\nM - Medium (Install 500 K to VDD on the PCB) – 1.5 A\nH - High (Install 10 K to VDD on the PCB) – 3 A
$Comp
L power:+5V #PWR?
U 1 1 5EC75AC0
P 7750 1400
F 0 "#PWR?" H 7750 1250 50  0001 C CNN
F 1 "+5V" H 7765 1573 50  0000 C CNN
F 2 "" H 7750 1400 50  0001 C CNN
F 3 "" H 7750 1400 50  0001 C CNN
	1    7750 1400
	1    0    0    -1  
$EndComp
Wire Wire Line
	7750 1450 7750 1400
Wire Wire Line
	7750 1450 7750 1900
Connection ~ 7750 1450
$Comp
L power:GND #PWR?
U 1 1 5ED36B24
P 6500 1900
F 0 "#PWR?" H 6500 1650 50  0001 C CNN
F 1 "GND" H 6505 1727 50  0000 C CNN
F 2 "" H 6500 1900 50  0001 C CNN
F 3 "" H 6500 1900 50  0001 C CNN
	1    6500 1900
	1    0    0    -1  
$EndComp
$Comp
L power:GND #PWR?
U 1 1 5ECB1D67
P 8550 1900
F 0 "#PWR?" H 8550 1650 50  0001 C CNN
F 1 "GND" H 8555 1727 50  0000 C CNN
F 2 "" H 8550 1900 50  0001 C CNN
F 3 "" H 8550 1900 50  0001 C CNN
	1    8550 1900
	1    0    0    -1  
$EndComp
$Comp
L power:+5V #PWR?
U 1 1 5ECBAC6F
P 4950 1650
F 0 "#PWR?" H 4950 1500 50  0001 C CNN
F 1 "+5V" H 4965 1823 50  0000 C CNN
F 2 "" H 4950 1650 50  0001 C CNN
F 3 "" H 4950 1650 50  0001 C CNN
	1    4950 1650
	-1   0    0    -1  
$EndComp
Wire Wire Line
	4950 1950 4950 2000
Wire Wire Line
	2700 1950 2700 1900
$Comp
L power:+5V #PWR?
U 1 1 5ED9F8B1
P 2700 1600
F 0 "#PWR?" H 2700 1450 50  0001 C CNN
F 1 "+5V" H 2715 1773 50  0000 C CNN
F 2 "" H 2700 1600 50  0001 C CNN
F 3 "" H 2700 1600 50  0001 C CNN
	1    2700 1600
	-1   0    0    -1  
$EndComp
$Comp
L Device:R R?
U 1 1 5EDA897B
P 2700 2150
AR Path="/5F7224E6/5EDA897B" Ref="R?"  Part="1" 
AR Path="/5FA2C9D2/5EDA897B" Ref="R35"  Part="1" 
F 0 "R35" H 2770 2241 50  0000 L CNN
F 1 "10k" H 2770 2150 50  0000 L CNN
F 2 "KIT_Resistor_SMD:R_0402_1005Metric_DNP" V 2630 2150 50  0001 C CNN
F 3 "~" H 2700 2150 50  0001 C CNN
F 4 "AVT-IPE" H 2700 2150 50  0001 C CNN "stock"
F 5 "DNP" H 2770 2059 50  0000 L CNN "DNP"
	1    2700 2150
	-1   0    0    -1  
$EndComp
$Comp
L power:GND #PWR?
U 1 1 5EDD0B0F
P 2700 2300
F 0 "#PWR?" H 2700 2050 50  0001 C CNN
F 1 "GND" H 2705 2127 50  0000 C CNN
F 2 "" H 2700 2300 50  0001 C CNN
F 3 "" H 2700 2300 50  0001 C CNN
	1    2700 2300
	-1   0    0    -1  
$EndComp
Wire Wire Line
	2700 2000 2700 1950
Connection ~ 2700 1950
$Comp
L Device:R R39
U 1 1 5EDE2EC9
P 3750 2950
F 0 "R39" H 3820 2996 50  0000 L CNN
F 1 "0" H 3820 2905 50  0000 L CNN
F 2 "Resistor_SMD:R_0402_1005Metric" H 3820 2859 50  0001 L CNN
F 3 "~" H 3750 2950 50  0001 C CNN
F 4 "AVT-IPE" H 3750 2950 50  0001 C CNN "stock"
	1    3750 2950
	-1   0    0    -1  
$EndComp
$Comp
L power:GND #PWR?
U 1 1 5EDF95A1
P 3750 3100
F 0 "#PWR?" H 3750 2850 50  0001 C CNN
F 1 "GND" H 3755 2927 50  0000 C CNN
F 2 "" H 3750 3100 50  0001 C CNN
F 3 "" H 3750 3100 50  0001 C CNN
	1    3750 3100
	-1   0    0    -1  
$EndComp
Wire Wire Line
	3750 2800 3750 2750
$Comp
L Device:R R37
U 1 1 5EE21BC5
P 2700 3600
F 0 "R37" H 2770 3646 50  0000 L CNN
F 1 "10k" H 2770 3555 50  0000 L CNN
F 2 "Resistor_SMD:R_0402_1005Metric" H 2770 3509 50  0001 L CNN
F 3 "~" H 2700 3600 50  0001 C CNN
F 4 "AVT-IPE" H 2700 3600 50  0001 C CNN "stock"
	1    2700 3600
	-1   0    0    -1  
$EndComp
Wire Wire Line
	2700 3400 2700 3350
$Comp
L power:+5V #PWR?
U 1 1 5EE21BCE
P 2700 3050
F 0 "#PWR?" H 2700 2900 50  0001 C CNN
F 1 "+5V" H 2715 3223 50  0000 C CNN
F 2 "" H 2700 3050 50  0001 C CNN
F 3 "" H 2700 3050 50  0001 C CNN
	1    2700 3050
	-1   0    0    -1  
$EndComp
$Comp
L Device:R R?
U 1 1 5EE21BD6
P 2700 3200
AR Path="/5F7224E6/5EE21BD6" Ref="R?"  Part="1" 
AR Path="/5FA2C9D2/5EE21BD6" Ref="R36"  Part="1" 
F 0 "R36" H 2770 3291 50  0000 L CNN
F 1 "10k" H 2770 3200 50  0000 L CNN
F 2 "KIT_Resistor_SMD:R_0402_1005Metric_DNP" V 2630 3200 50  0001 C CNN
F 3 "~" H 2700 3200 50  0001 C CNN
F 4 "AVT-IPE" H 2700 3200 50  0001 C CNN "stock"
F 5 "DNP" H 2770 3109 50  0000 L CNN "DNP"
	1    2700 3200
	-1   0    0    -1  
$EndComp
$Comp
L power:GND #PWR?
U 1 1 5EE21BDD
P 2700 3750
F 0 "#PWR?" H 2700 3500 50  0001 C CNN
F 1 "GND" H 2705 3577 50  0000 C CNN
F 2 "" H 2700 3750 50  0001 C CNN
F 3 "" H 2700 3750 50  0001 C CNN
	1    2700 3750
	-1   0    0    -1  
$EndComp
Wire Wire Line
	2700 3450 2700 3400
Connection ~ 2700 3400
$Comp
L Device:R R38
U 1 1 5EE7EC65
P 3750 3800
F 0 "R38" H 3820 3846 50  0000 L CNN
F 1 "0" H 3820 3755 50  0000 L CNN
F 2 "Resistor_SMD:R_0402_1005Metric" H 3820 3709 50  0001 L CNN
F 3 "~" H 3750 3800 50  0001 C CNN
F 4 "AVT-IPE" H 3750 3800 50  0001 C CNN "stock"
	1    3750 3800
	-1   0    0    -1  
$EndComp
$Comp
L power:GND #PWR?
U 1 1 5EE7EC6D
P 3750 3950
F 0 "#PWR?" H 3750 3700 50  0001 C CNN
F 1 "GND" H 3755 3777 50  0000 C CNN
F 2 "" H 3750 3950 50  0001 C CNN
F 3 "" H 3750 3950 50  0001 C CNN
	1    3750 3950
	-1   0    0    -1  
$EndComp
Wire Wire Line
	3750 3650 3750 3600
$Comp
L Device:R R?
U 1 1 5EED84C8
P 9300 1900
AR Path="/5F7224E6/5EED84C8" Ref="R?"  Part="1" 
AR Path="/5FA2C9D2/5EED84C8" Ref="R31"  Part="1" 
F 0 "R31" H 9370 1946 50  0000 L CNN
F 1 "200k" H 9370 1855 50  0000 L CNN
F 2 "Resistor_SMD:R_0402_1005Metric" H 9370 1809 50  0001 L CNN
F 3 "~" H 9300 1900 50  0001 C CNN
F 4 "AVT-IPE" H 9300 1900 50  0001 C CNN "stock"
	1    9300 1900
	1    0    0    -1  
$EndComp
Text Notes 8550 1050 0    50   ~ 0
DIR ->\nType-C plug orientation.\nOpen drain output
$Comp
L Device:R R40
U 1 1 5F18CEA3
P 9100 2700
F 0 "R40" V 9350 2700 50  0000 C CNN
F 1 "0" V 9250 2700 50  0000 C CNN
F 2 "Resistor_SMD:R_0402_1005Metric" H 9170 2609 50  0001 L CNN
F 3 "~" H 9100 2700 50  0001 C CNN
F 4 "AVT-IPE" H 9100 2700 50  0001 C CNN "stock"
	1    9100 2700
	0    -1   -1   0   
$EndComp
Wire Wire Line
	8450 2700 8950 2700
Wire Wire Line
	8450 2800 10350 2800
Wire Wire Line
	8450 2500 9300 2500
Wire Wire Line
	9250 2700 10000 2700
$Comp
L Device:R R?
U 1 1 5F204D69
P 10350 1900
AR Path="/5F7224E6/5F204D69" Ref="R?"  Part="1" 
AR Path="/5FA2C9D2/5F204D69" Ref="R34"  Part="1" 
F 0 "R34" H 10420 1946 50  0000 L CNN
F 1 "200k" H 10420 1855 50  0000 L CNN
F 2 "Resistor_SMD:R_0402_1005Metric" H 10420 1809 50  0001 L CNN
F 3 "~" H 10350 1900 50  0001 C CNN
F 4 "AVT-IPE" H 10350 1900 50  0001 C CNN "stock"
	1    10350 1900
	1    0    0    -1  
$EndComp
Wire Wire Line
	3750 3600 4600 3600
Wire Wire Line
	2700 3400 6750 3400
Wire Wire Line
	6750 3500 4600 3500
Wire Wire Line
	4600 3500 4600 3600
Wire Wire Line
	4600 3300 4600 2750
Wire Wire Line
	4600 3300 6750 3300
Wire Wire Line
	3750 2750 4600 2750
Wire Wire Line
	4300 1950 4300 2350
Wire Wire Line
	4300 2350 5750 2350
Wire Wire Line
	5750 2350 5750 3100
Wire Wire Line
	5750 3100 6750 3100
Wire Wire Line
	2700 1950 4300 1950
Wire Wire Line
	5900 3000 5900 2000
Wire Wire Line
	5900 3000 6750 3000
Wire Wire Line
	4950 2000 5900 2000
Text Label 5650 2000 2    50   ~ 0
CURRENT_MODE
Text Label 3350 1950 2    50   ~ 0
PORT
Text Label 4400 3600 2    50   ~ 0
EN_CC_N
Text Label 3100 3400 2    50   ~ 0
ADDR
Text Label 4400 2750 2    50   ~ 0
EN_MUX_N
$Comp
L Device:R R?
U 1 1 5F5ECE58
P 5250 3000
AR Path="/5F7224E6/5F5ECE58" Ref="R?"  Part="1" 
AR Path="/5FA2C9D2/5F5ECE58" Ref="R20"  Part="1" 
F 0 "R20" H 5320 3046 50  0000 L CNN
F 1 "910k" H 5320 2955 50  0000 L CNN
F 2 "Resistor_SMD:R_0402_1005Metric" H 5320 2909 50  0001 L CNN
F 3 "~" H 5250 3000 50  0001 C CNN
F 4 "AVT-IPE" H 5250 3000 50  0001 C CNN "stock"
	1    5250 3000
	-1   0    0    -1  
$EndComp
Wire Wire Line
	5250 3200 5250 3150
Wire Wire Line
	5250 3200 6750 3200
Wire Wire Line
	9300 2050 9300 2500
Connection ~ 9300 2500
$Comp
L Device:R R?
U 1 1 5EE8F75F
P 9650 1900
AR Path="/5F7224E6/5EE8F75F" Ref="R?"  Part="1" 
AR Path="/5FA2C9D2/5EE8F75F" Ref="R33"  Part="1" 
F 0 "R33" H 9720 1946 50  0000 L CNN
F 1 "200k" H 9720 1855 50  0000 L CNN
F 2 "Resistor_SMD:R_0402_1005Metric" H 9720 1809 50  0001 L CNN
F 3 "~" H 9650 1900 50  0001 C CNN
F 4 "AVT-IPE" H 9650 1900 50  0001 C CNN "stock"
	1    9650 1900
	1    0    0    -1  
$EndComp
Wire Wire Line
	8450 2600 9650 2600
$Comp
L Device:R R?
U 1 1 5EEB4746
P 10000 1900
AR Path="/5F7224E6/5EEB4746" Ref="R?"  Part="1" 
AR Path="/5FA2C9D2/5EEB4746" Ref="R32"  Part="1" 
F 0 "R32" H 10070 1946 50  0000 L CNN
F 1 "10k" H 10070 1855 50  0000 L CNN
F 2 "Resistor_SMD:R_0402_1005Metric" H 10070 1809 50  0001 L CNN
F 3 "~" H 10000 1900 50  0001 C CNN
F 4 "AVT-IPE" H 10000 1900 50  0001 C CNN "stock"
	1    10000 1900
	1    0    0    -1  
$EndComp
Wire Wire Line
	9650 2050 9650 2600
Connection ~ 9650 2600
Wire Wire Line
	10000 2050 10000 2700
Connection ~ 10000 2700
Wire Wire Line
	10350 2050 10350 2800
Connection ~ 10350 2800
$Comp
L Device:C C?
U 1 1 5F078F1A
P 6500 1650
AR Path="/5E09AE40/5F078F1A" Ref="C?"  Part="1" 
AR Path="/5FA2C9D2/5F078F1A" Ref="C164"  Part="1" 
F 0 "C164" H 6615 1741 50  0000 L CNN
F 1 "1uF" H 6615 1650 50  0000 L CNN
F 2 "Capacitor_SMD:C_0402_1005Metric" H 6538 1500 50  0001 C CNN
F 3 "~" H 6500 1650 50  0001 C CNN
F 4 "16 V" H 6615 1559 50  0000 L CNN "info"
F 5 "AVT-IPE" H 6500 1650 50  0001 C CNN "stock"
	1    6500 1650
	1    0    0    -1  
$EndComp
Wire Wire Line
	6400 1450 6500 1450
Connection ~ 6500 1450
Wire Wire Line
	6500 1450 6500 1500
Wire Wire Line
	6500 1800 6500 1850
Wire Wire Line
	6500 1850 6900 1850
Wire Wire Line
	6900 1850 6900 1800
Wire Wire Line
	6900 1500 6900 1450
Connection ~ 6500 1850
Wire Wire Line
	6500 1850 6500 1900
Connection ~ 6900 1450
Wire Wire Line
	6900 1450 6950 1450
Wire Wire Line
	8550 1800 8550 1850
$Comp
L Device:C C?
U 1 1 5F0D8A26
P 8550 1650
AR Path="/5F7AC3E6/5F0D8A26" Ref="C?"  Part="1" 
AR Path="/5FA2C9D2/5F0D8A26" Ref="C166"  Part="1" 
F 0 "C166" H 8665 1741 50  0000 L CNN
F 1 "1uF" H 8665 1650 50  0000 L CNN
F 2 "Capacitor_SMD:C_0402_1005Metric" H 8588 1500 50  0001 C CNN
F 3 "~" H 8550 1650 50  0001 C CNN
F 4 "16 V" H 8665 1559 50  0000 L CNN "info"
F 5 "AVT-IPE" H 8550 1650 50  0001 C CNN "stock"
	1    8550 1650
	1    0    0    -1  
$EndComp
Wire Wire Line
	10350 1700 10000 1700
Wire Wire Line
	9650 1700 9650 1750
Wire Wire Line
	10000 1750 10000 1700
Connection ~ 10000 1700
Wire Wire Line
	10000 1700 9800 1700
Wire Wire Line
	10350 1750 10350 1700
Wire Wire Line
	8550 1450 8550 1500
Wire Wire Line
	7750 1450 8100 1450
$Comp
L Device:C C?
U 1 1 5F36B6CE
P 8100 1650
AR Path="/5FFD078E/5F36B6CE" Ref="C?"  Part="1" 
AR Path="/5FA2C9D2/5F36B6CE" Ref="C165"  Part="1" 
F 0 "C165" H 8215 1741 50  0000 L CNN
F 1 "22uF" H 8215 1650 50  0000 L CNN
F 2 "Capacitor_SMD:C_0603_1608Metric" H 8138 1500 50  0001 C CNN
F 3 "~" H 8100 1650 50  0001 C CNN
F 4 "AVT-IPE" H 8100 1650 50  0001 C CNN "stock"
F 5 "10V" H 8215 1559 50  0000 L CNN "info"
	1    8100 1650
	1    0    0    -1  
$EndComp
Wire Wire Line
	8100 1450 8100 1500
Wire Wire Line
	8100 1850 8550 1850
Wire Wire Line
	8100 1800 8100 1850
Connection ~ 8100 1450
Wire Wire Line
	8100 1450 8550 1450
Connection ~ 8550 1850
Wire Wire Line
	8550 1900 8550 1850
Text GLabel 6550 2500 0    50   Input ~ 0
MO_SCL
Text GLabel 6550 2600 0    50   BiDi ~ 0
MO_SDA
Wire Wire Line
	6550 2500 6750 2500
Wire Wire Line
	6750 2600 6550 2600
$Comp
L power:PWR_FLAG #FLG?
U 1 1 5F149590
P 6950 1400
AR Path="/5E09AE40/5F149590" Ref="#FLG?"  Part="1" 
AR Path="/5FA2C9D2/5F149590" Ref="#FLG?"  Part="1" 
F 0 "#FLG?" H 6950 1475 50  0001 C CNN
F 1 "PWR_FLAG" H 6950 1573 50  0000 C CNN
F 2 "" H 6950 1400 50  0001 C CNN
F 3 "~" H 6950 1400 50  0001 C CNN
	1    6950 1400
	1    0    0    -1  
$EndComp
Wire Wire Line
	6950 1400 6950 1450
Connection ~ 6950 1450
Wire Wire Line
	6950 1450 7350 1450
Wire Wire Line
	6500 1450 6900 1450
Text Label 8600 2700 0    20   ~ 0
VCONN_FAULT_R_N
$Comp
L Device:Ferrite_Bead FB?
U 1 1 5F6FE4F7
P 13600 2200
AR Path="/5DEF958D/5F6FE4F7" Ref="FB?"  Part="1" 
AR Path="/5FA2C9D2/5F6FE4F7" Ref="FB2"  Part="1" 
F 0 "FB2" V 13326 2200 50  0000 C CNN
F 1 "220 Ohms @ 100MHz" V 13417 2200 50  0000 C CNN
F 2 "Inductor_SMD:L_0603_1608Metric" V 13530 2200 50  0001 C CNN
F 3 "https://product.tdk.com/info/en/catalog/datasheets/beads_automotive_power_mpz1608_en.pdf" H 13600 2200 50  0001 C CNN
F 4 "220 Ohms @ 100MHz 1 Power Line Ferrite Bead 0603 (1608 Metric) 2.2A 50mOhm " V 13600 2200 50  0001 C CNN "info"
F 5 "TDK" V 13600 2200 50  0001 C CNN "manf"
F 6 "MPZ1608S221ATD25" V 13600 2200 50  0001 C CNN "manf#"
	1    13600 2200
	0    1    1    0   
$EndComp
Wire Wire Line
	13750 2200 14100 2200
Connection ~ 14350 2200
Wire Wire Line
	13000 2150 13000 2200
$Comp
L power:+5V #PWR?
U 1 1 5F71B9A3
P 13000 2150
F 0 "#PWR?" H 13000 2000 50  0001 C CNN
F 1 "+5V" H 13015 2323 50  0000 C CNN
F 2 "" H 13000 2150 50  0001 C CNN
F 3 "" H 13000 2150 50  0001 C CNN
	1    13000 2150
	1    0    0    -1  
$EndComp
Wire Wire Line
	13450 2200 13000 2200
$Comp
L power:+5V #PWR?
U 1 1 5F73BBE1
P 5250 2850
F 0 "#PWR?" H 5250 2700 50  0001 C CNN
F 1 "+5V" H 5265 3023 50  0000 C CNN
F 2 "" H 5250 2850 50  0001 C CNN
F 3 "" H 5250 2850 50  0001 C CNN
	1    5250 2850
	-1   0    0    -1  
$EndComp
$Comp
L power:+5V #PWR?
U 1 1 5F75CF55
P 5950 7200
F 0 "#PWR?" H 5950 7050 50  0001 C CNN
F 1 "+5V" H 5965 7373 50  0000 C CNN
F 2 "" H 5950 7200 50  0001 C CNN
F 3 "" H 5950 7200 50  0001 C CNN
	1    5950 7200
	-1   0    0    -1  
$EndComp
$Comp
L power:PWR_FLAG #FLG?
U 1 1 5F9F3D7E
P 14100 2200
F 0 "#FLG?" H 14100 2275 50  0001 C CNN
F 1 "PWR_FLAG" H 14100 2373 50  0000 C CNN
F 2 "" H 14100 2200 50  0001 C CNN
F 3 "~" H 14100 2200 50  0001 C CNN
	1    14100 2200
	-1   0    0    1   
$EndComp
Connection ~ 14100 2200
Wire Wire Line
	14100 2200 14350 2200
Wire Wire Line
	9650 1700 9300 1700
Wire Wire Line
	9300 1700 9300 1750
Connection ~ 9650 1700
$Comp
L KIT_Power:+3V3_STBY #PWR?
U 1 1 5FC5919F
P 9800 1650
F 0 "#PWR?" H 9800 1500 50  0001 C CNN
F 1 "+3V3_STBY" H 9815 1823 50  0000 C CNN
F 2 "" H 9800 1650 50  0001 C CNN
F 3 "" H 9800 1650 50  0001 C CNN
	1    9800 1650
	1    0    0    -1  
$EndComp
Wire Wire Line
	9800 1650 9800 1700
Connection ~ 9800 1700
Wire Wire Line
	9800 1700 9650 1700
Text Label 11100 2500 2    50   ~ 0
DIR
Text Label 11100 2600 2    50   ~ 0
INT_N-OUT3
Text Label 11100 2700 2    50   ~ 0
VCONN_FAULT_N
Text Label 11100 2800 2    50   ~ 0
ID
Wire Wire Line
	9300 2500 11100 2500
Wire Wire Line
	9650 2600 11100 2600
Wire Wire Line
	10000 2700 11100 2700
Wire Wire Line
	10350 2800 11100 2800
Text Notes 10600 2400 0    50   ~ 0
Not connected
Wire Notes Line
	10450 2300 11200 2300
Wire Notes Line
	11200 2300 11200 2850
Wire Notes Line
	11200 2850 10450 2850
Wire Notes Line
	10450 2850 10450 2300
Wire Bus Line
	2400 7900 2400 8600
$EndSCHEMATC
