EESchema Schematic File Version 4
EELAYER 30 0
EELAYER END
$Descr A4 11693 8268
encoding utf-8
Sheet 16 28
Title "ZynqMP Mezzanine FMC+ (BuZZyBoard)"
Date "2020-10-02"
Rev "1.0"
Comp "Karlsruhe Institute of Technology (KIT)"
Comment1 "Institute for Data Processing and Electronics (IPE)"
Comment2 "Luis Ardila"
Comment3 ""
Comment4 ""
$EndDescr
$Comp
L KIT_FPGA:ZU4EG-B900 U1
U 5 1 5E4BC182
P 3750 2450
F 0 "U1" H 5750 2740 60  0000 C CNN
F 1 "ZU4EG-B900" H 5750 2634 60  0000 C CNN
F 2 "KIT_Package_BGA:BGA-900_30x30_31.0x31.0mm" H 2050 2250 50  0001 C CNN
F 3 "" H 2050 2250 50  0001 C CNN
	5    3750 2450
	1    0    0    -1  
$EndComp
NoConn ~ 7750 2450
Wire Wire Line
	1900 1750 1900 1800
Wire Wire Line
	2800 1800 3250 1800
$Comp
L Device:C C53
U 1 1 5FFFC0AF
P 2800 2000
F 0 "C53" H 2915 2046 50  0000 L CNN
F 1 "0.1uF" H 2915 1955 50  0000 L CNN
F 2 "Capacitor_SMD:C_0402_1005Metric" H 2838 1850 50  0001 C CNN
F 3 "~" H 2800 2000 50  0001 C CNN
F 4 "16 V" H 2800 2000 50  0001 C CNN "info"
F 5 "AVT-IPE" H 2800 2000 50  0001 C CNN "stock"
	1    2800 2000
	1    0    0    -1  
$EndComp
Wire Wire Line
	2800 2200 2800 2150
Wire Wire Line
	2800 1850 2800 1800
Connection ~ 2800 1800
$Comp
L Device:C C51
U 1 1 5FFFC0BE
P 2350 2000
F 0 "C51" H 2465 2046 50  0000 L CNN
F 1 "0.1uF" H 2465 1955 50  0000 L CNN
F 2 "Capacitor_SMD:C_0402_1005Metric" H 2388 1850 50  0001 C CNN
F 3 "~" H 2350 2000 50  0001 C CNN
F 4 "16 V" H 2350 2000 50  0001 C CNN "info"
F 5 "AVT-IPE" H 2350 2000 50  0001 C CNN "stock"
	1    2350 2000
	1    0    0    -1  
$EndComp
$Comp
L power:GND #PWR?
U 1 1 5F319EE7
P 1900 2250
F 0 "#PWR?" H 1900 2000 50  0001 C CNN
F 1 "GND" H 1905 2077 50  0000 C CNN
F 2 "" H 1900 2250 50  0001 C CNN
F 3 "" H 1900 2250 50  0001 C CNN
	1    1900 2250
	1    0    0    -1  
$EndComp
Wire Wire Line
	2350 2200 2350 2150
Wire Wire Line
	2350 1850 2350 1800
Wire Wire Line
	2350 1800 2800 1800
Connection ~ 2350 1800
$Comp
L Device:C C55
U 1 1 5FFFC0CE
P 3250 2000
F 0 "C55" H 3365 2046 50  0000 L CNN
F 1 "0.1uF" H 3365 1955 50  0000 L CNN
F 2 "Capacitor_SMD:C_0402_1005Metric" H 3288 1850 50  0001 C CNN
F 3 "~" H 3250 2000 50  0001 C CNN
F 4 "16 V" H 3250 2000 50  0001 C CNN "info"
F 5 "AVT-IPE" H 3250 2000 50  0001 C CNN "stock"
	1    3250 2000
	1    0    0    -1  
$EndComp
Wire Wire Line
	3250 2200 3250 2150
Wire Wire Line
	3250 1850 3250 1800
Wire Wire Line
	3250 1800 3600 1800
Wire Wire Line
	3600 1800 3600 2450
Wire Wire Line
	3600 2450 3750 2450
Connection ~ 3250 1800
$Comp
L KIT_Power:+1V8_STBY #PWR?
U 1 1 613A0090
P 1900 1750
F 0 "#PWR?" H 1900 1600 50  0001 C CNN
F 1 "+1V8_STBY" H 1915 1923 50  0000 C CNN
F 2 "" H 1900 1750 50  0001 C CNN
F 3 "" H 1900 1750 50  0001 C CNN
	1    1900 1750
	1    0    0    -1  
$EndComp
Text Label 3200 2550 0    50   ~ 0
B65_IO_0
Text Label 3200 2650 0    50   ~ 0
B65_IO_1
Text Label 3200 2750 0    50   ~ 0
B65_IO_2
Text Label 3200 2850 0    50   ~ 0
B65_IO_3
Text Label 3200 2950 0    50   ~ 0
B65_IO_4
Text Label 3200 3050 0    50   ~ 0
B65_IO_5
Text Label 3200 3150 0    50   ~ 0
B65_IO_6
Text Label 3200 3250 0    50   ~ 0
B65_IO_7
Text Label 3200 3350 0    50   ~ 0
B65_IO_8
Text Label 3200 3450 0    50   ~ 0
B65_IO_9
Text Label 3200 3550 0    50   ~ 0
B65_IO_10
Text Label 3200 3650 0    50   ~ 0
B65_IO_11
Text Label 3200 3750 0    50   ~ 0
B65_IO_12
Text Label 3200 3850 0    50   ~ 0
B65_IO_13
Text Label 3200 3950 0    50   ~ 0
B65_IO_14
Text Label 3200 4050 0    50   ~ 0
B65_IO_15
Text Label 3200 4150 0    50   ~ 0
B65_IO_16
Text Label 3200 4250 0    50   ~ 0
B65_IO_17
Text Label 3200 4350 0    50   ~ 0
B65_IO_18
Text Label 3200 4450 0    50   ~ 0
B65_IO_19
Text Label 3200 4550 0    50   ~ 0
B65_IO_20
Text Label 3200 4650 0    50   ~ 0
B65_IO_21
Text Label 3200 4750 0    50   ~ 0
B65_IO_22
Text Label 3200 4850 0    50   ~ 0
B65_IO_23
Text Label 3200 4950 0    50   ~ 0
B65_IO_24
Text Label 3200 5050 0    50   ~ 0
B65_IO_25
Text Label 8350 2550 2    50   ~ 0
B65_IO_26
Text Label 8350 2650 2    50   ~ 0
B65_IO_27
Text Label 8350 2750 2    50   ~ 0
B65_IO_28
Text Label 8350 2850 2    50   ~ 0
B65_IO_29
Text Label 8350 2950 2    50   ~ 0
B65_IO_30
Text Label 8350 3050 2    50   ~ 0
B65_IO_31
Text Label 8350 3150 2    50   ~ 0
B65_IO_32
Text Label 8350 3250 2    50   ~ 0
B65_IO_33
Text Label 8350 3350 2    50   ~ 0
B65_IO_34
Text Label 8350 3450 2    50   ~ 0
B65_IO_35
Text Label 8350 3550 2    50   ~ 0
B65_IO_36
Text Label 8350 3650 2    50   ~ 0
B65_IO_37
Text Label 8350 3750 2    50   ~ 0
B65_IO_38
Text Label 8350 3850 2    50   ~ 0
B65_IO_39
Text Label 8350 3950 2    50   ~ 0
B65_IO_40
Text Label 8350 4050 2    50   ~ 0
B65_IO_41
Text Label 8350 4150 2    50   ~ 0
B65_IO_42
Text Label 8350 4250 2    50   ~ 0
B65_IO_43
Text Label 8350 4350 2    50   ~ 0
B65_IO_44
Text Label 8350 4450 2    50   ~ 0
B65_IO_45
Text Label 8350 4550 2    50   ~ 0
B65_IO_46
Text Label 8350 4650 2    50   ~ 0
B65_IO_47
Text Label 8350 4750 2    50   ~ 0
B65_IO_48
Text Label 8350 4850 2    50   ~ 0
B65_IO_49
Text Label 8350 4950 2    50   ~ 0
B65_IO_50
Text Label 8350 5050 2    50   ~ 0
B65_IO_51
Wire Wire Line
	3150 2550 3750 2550
Wire Wire Line
	3150 2650 3750 2650
Wire Wire Line
	3150 2750 3750 2750
Wire Wire Line
	3150 2850 3750 2850
Wire Wire Line
	3150 2950 3750 2950
Wire Wire Line
	3150 3050 3750 3050
Wire Wire Line
	3150 3150 3750 3150
Wire Wire Line
	3150 3250 3750 3250
Wire Wire Line
	3150 3350 3750 3350
Wire Wire Line
	3150 3450 3750 3450
Wire Wire Line
	3150 3550 3750 3550
Wire Wire Line
	3150 3650 3750 3650
Wire Wire Line
	3150 3750 3750 3750
Wire Wire Line
	3150 3850 3750 3850
Wire Wire Line
	3150 3950 3750 3950
Wire Wire Line
	3150 4050 3750 4050
Wire Wire Line
	3150 4150 3750 4150
Wire Wire Line
	3150 4250 3750 4250
Wire Wire Line
	3150 4350 3750 4350
Wire Wire Line
	3150 4450 3750 4450
Wire Wire Line
	3150 4550 3750 4550
Wire Wire Line
	3150 4650 3750 4650
Wire Wire Line
	3150 4750 3750 4750
Wire Wire Line
	3150 4850 3750 4850
Wire Wire Line
	3150 4950 3750 4950
Wire Wire Line
	3150 5050 3750 5050
Wire Wire Line
	8400 2550 7750 2550
Wire Wire Line
	8400 2650 7750 2650
Wire Wire Line
	8400 2750 7750 2750
Wire Wire Line
	8400 2850 7750 2850
Wire Wire Line
	8400 2950 7750 2950
Wire Wire Line
	8400 3050 7750 3050
Wire Wire Line
	8400 3150 7750 3150
Wire Wire Line
	8400 3250 7750 3250
Wire Wire Line
	8400 3350 7750 3350
Wire Wire Line
	8400 3450 7750 3450
Wire Wire Line
	8400 3550 7750 3550
Wire Wire Line
	8400 3650 7750 3650
Wire Wire Line
	8400 3750 7750 3750
Wire Wire Line
	8400 3850 7750 3850
Wire Wire Line
	8400 3950 7750 3950
Wire Wire Line
	8400 4050 7750 4050
Wire Wire Line
	8400 4150 7750 4150
Wire Wire Line
	8400 4250 7750 4250
Wire Wire Line
	8400 4350 7750 4350
Wire Wire Line
	8400 4450 7750 4450
Wire Wire Line
	8400 4550 7750 4550
Wire Wire Line
	8400 4650 7750 4650
Wire Wire Line
	8400 4750 7750 4750
Wire Wire Line
	8400 4850 7750 4850
Wire Wire Line
	8400 4950 7750 4950
Wire Wire Line
	8400 5050 7750 5050
Entry Wire Line
	8400 2550 8500 2650
Entry Wire Line
	8400 2650 8500 2750
Entry Wire Line
	8400 2750 8500 2850
Entry Wire Line
	8400 2850 8500 2950
Entry Wire Line
	8400 2950 8500 3050
Entry Wire Line
	8400 3050 8500 3150
Entry Wire Line
	8400 3150 8500 3250
Entry Wire Line
	8400 3250 8500 3350
Entry Wire Line
	8400 3350 8500 3450
Entry Wire Line
	8400 3450 8500 3550
Entry Wire Line
	8400 3550 8500 3650
Entry Wire Line
	8400 3650 8500 3750
Entry Wire Line
	8400 3750 8500 3850
Entry Wire Line
	8400 3850 8500 3950
Entry Wire Line
	8400 3950 8500 4050
Entry Wire Line
	8400 4050 8500 4150
Entry Wire Line
	8400 4150 8500 4250
Entry Wire Line
	8400 4250 8500 4350
Entry Wire Line
	8400 4350 8500 4450
Entry Wire Line
	8400 4450 8500 4550
Entry Wire Line
	8400 4550 8500 4650
Entry Wire Line
	8400 4650 8500 4750
Entry Wire Line
	8400 4750 8500 4850
Entry Wire Line
	8400 4850 8500 4950
Entry Wire Line
	8400 4950 8500 5050
Entry Wire Line
	8400 5050 8500 5150
Entry Wire Line
	3150 2550 3050 2650
Entry Wire Line
	3150 2650 3050 2750
Entry Wire Line
	3150 2750 3050 2850
Entry Wire Line
	3150 2850 3050 2950
Entry Wire Line
	3150 2950 3050 3050
Entry Wire Line
	3150 3050 3050 3150
Entry Wire Line
	3150 3150 3050 3250
Entry Wire Line
	3150 3250 3050 3350
Entry Wire Line
	3150 3350 3050 3450
Entry Wire Line
	3150 3450 3050 3550
Entry Wire Line
	3150 3550 3050 3650
Entry Wire Line
	3150 3650 3050 3750
Entry Wire Line
	3150 3750 3050 3850
Entry Wire Line
	3150 3850 3050 3950
Entry Wire Line
	3150 3950 3050 4050
Entry Wire Line
	3150 4050 3050 4150
Entry Wire Line
	3150 4150 3050 4250
Entry Wire Line
	3150 4250 3050 4350
Entry Wire Line
	3150 4350 3050 4450
Entry Wire Line
	3150 4450 3050 4550
Entry Wire Line
	3150 4550 3050 4650
Entry Wire Line
	3150 4650 3050 4750
Entry Wire Line
	3150 4750 3050 4850
Entry Wire Line
	3150 4850 3050 4950
Entry Wire Line
	3150 4950 3050 5050
Entry Wire Line
	3150 5050 3050 5150
Wire Bus Line
	8500 5700 3050 5700
Connection ~ 3050 5700
Wire Bus Line
	3050 5700 2500 5700
Text GLabel 2500 5700 0    50   BiDi ~ 0
B65_IO_[0..51]
Text Notes 2550 4750 2    50   ~ 0
GC\npins
Wire Notes Line
	5100 4900 2350 4900
Wire Notes Line
	2350 4900 2350 4500
Wire Notes Line
	2350 4500 5100 4500
Wire Notes Line
	5100 4500 5100 4900
Text Notes 8800 2750 0    50   ~ 0
GC\npins
Wire Notes Line
	6250 2900 9000 2900
Wire Notes Line
	9000 2900 9000 2500
Wire Notes Line
	9000 2500 6250 2500
Wire Notes Line
	6250 2500 6250 2900
$Comp
L Device:C C?
U 1 1 5F0A339D
P 1900 2000
AR Path="/5E09AE40/5F0A339D" Ref="C?"  Part="1" 
AR Path="/5F2E039A/5F0A339D" Ref="C276"  Part="1" 
F 0 "C276" H 2015 2046 50  0000 L CNN
F 1 "10uF" H 2015 1955 50  0000 L CNN
F 2 "Capacitor_SMD:C_0402_1005Metric" H 1938 1850 50  0001 C CNN
F 3 "~" H 1900 2000 50  0001 C CNN
F 4 "10µF ±20% 6.3V Ceramic Capacitor X6S 0402 (1005 Metric) " H 1900 2000 50  0001 C CNN "info"
F 5 "Murata" H 1900 2000 50  0001 C CNN "manf"
F 6 "GRM155C80J106ME11D" H 1900 2000 50  0001 C CNN "manf#"
	1    1900 2000
	1    0    0    -1  
$EndComp
Wire Wire Line
	2350 1800 1900 1800
Wire Wire Line
	1900 1800 1900 1850
Wire Wire Line
	1900 2200 2350 2200
Wire Wire Line
	1900 2150 1900 2200
Wire Wire Line
	3250 2200 2800 2200
Connection ~ 2350 2200
Connection ~ 2800 2200
Wire Wire Line
	2800 2200 2350 2200
Wire Wire Line
	1900 2250 1900 2200
Connection ~ 1900 2200
Connection ~ 1900 1800
Wire Bus Line
	8500 2650 8500 5700
Wire Bus Line
	3050 2650 3050 5700
$EndSCHEMATC
