EESchema Schematic File Version 4
EELAYER 30 0
EELAYER END
$Descr A4 11693 8268
encoding utf-8
Sheet 15 28
Title "ZynqMP Mezzanine FMC+ (BuZZyBoard)"
Date "2020-10-02"
Rev "1.0"
Comp "Karlsruhe Institute of Technology (KIT)"
Comment1 "Institute for Data Processing and Electronics (IPE)"
Comment2 "Luis Ardila"
Comment3 ""
Comment4 ""
$EndDescr
$Comp
L KIT_FPGA:ZU4EG-B900 U1
U 15 1 5EDEBCE2
P 7350 2200
F 0 "U1" H 8900 -1600 60  0000 C CNN
F 1 "ZU4EG-B900" H 8900 -1700 60  0000 C CNN
F 2 "KIT_Package_BGA:BGA-900_30x30_31.0x31.0mm" H 5650 2000 50  0001 C CNN
F 3 "" H 5650 2000 50  0001 C CNN
	15   7350 2200
	1    0    0    -1  
$EndComp
$Comp
L KIT_FPGA:ZU4EG-B900 U1
U 16 1 5EC82812
P 2950 2200
F 0 "U1" H 3750 -2900 60  0000 C CNN
F 1 "ZU4EG-B900" H 3750 -3000 60  0000 C CNN
F 2 "KIT_Package_BGA:BGA-900_30x30_31.0x31.0mm" H 1250 2000 50  0001 C CNN
F 3 "" H 1250 2000 50  0001 C CNN
	16   2950 2200
	1    0    0    -1  
$EndComp
NoConn ~ 4850 3200
NoConn ~ 4850 3300
NoConn ~ 4850 3400
NoConn ~ 4850 3500
NoConn ~ 4850 3600
NoConn ~ 4850 3700
NoConn ~ 4850 3800
NoConn ~ 4850 3900
NoConn ~ 4850 4000
NoConn ~ 4850 4100
NoConn ~ 4850 4200
NoConn ~ 4850 4300
NoConn ~ 4850 4400
NoConn ~ 4850 4500
NoConn ~ 4850 4600
NoConn ~ 4850 4700
NoConn ~ 4850 4800
NoConn ~ 4850 4900
NoConn ~ 4850 5000
NoConn ~ 4850 5100
NoConn ~ 4850 5200
NoConn ~ 4850 5300
NoConn ~ 4850 5400
NoConn ~ 4850 5500
NoConn ~ 4850 5600
NoConn ~ 4850 5700
NoConn ~ 4850 5800
NoConn ~ 4850 5900
NoConn ~ 4850 6000
NoConn ~ 4850 6100
NoConn ~ 4850 6200
NoConn ~ 4850 6300
NoConn ~ 4850 6400
NoConn ~ 4850 6500
NoConn ~ 4850 6600
NoConn ~ 4850 6700
NoConn ~ 4850 6800
NoConn ~ 4850 6900
NoConn ~ 4850 7000
NoConn ~ 4850 7100
Text Label 10150 2200 2    50   ~ 0
DDR_A0
Text Label 10150 2300 2    50   ~ 0
DDR_A1
Text Label 10150 2400 2    50   ~ 0
DDR_A2
Text Label 10150 2500 2    50   ~ 0
DDR_A3
Text Label 10150 2600 2    50   ~ 0
DDR_A4
Text Label 10150 2700 2    50   ~ 0
DDR_A5
Text Label 10150 2800 2    50   ~ 0
DDR_A6
Text Label 10150 2900 2    50   ~ 0
DDR_A7
Text Label 10150 3000 2    50   ~ 0
DDR_A8
Text Label 10150 3100 2    50   ~ 0
DDR_A9
Text Label 10150 3200 2    50   ~ 0
DDR_A10
Text Label 10150 3300 2    50   ~ 0
DDR_A11
Text Label 10150 3400 2    50   ~ 0
DDR_A12
Text Label 10150 3500 2    50   ~ 0
DDR_A13
Text Label 10150 3600 2    50   ~ 0
DDR_A14
Text Label 10150 3700 2    50   ~ 0
DDR_A15
Text Label 10150 3800 2    50   ~ 0
DDR_A16
Wire Wire Line
	10150 2200 9650 2200
Wire Wire Line
	10150 2300 9650 2300
Wire Wire Line
	10150 2400 9650 2400
Wire Wire Line
	10150 2500 9650 2500
Wire Wire Line
	10150 2600 9650 2600
Wire Wire Line
	10150 2700 9650 2700
Wire Wire Line
	10150 2800 9650 2800
Wire Wire Line
	10150 2900 9650 2900
Wire Wire Line
	10150 3000 9650 3000
Wire Wire Line
	10150 3100 9650 3100
Wire Wire Line
	10150 3200 9650 3200
Wire Wire Line
	10150 3300 9650 3300
Wire Wire Line
	10150 3400 9650 3400
Wire Wire Line
	10150 3500 9650 3500
Wire Wire Line
	10150 3600 9650 3600
Wire Wire Line
	10150 3700 9650 3700
Wire Wire Line
	10150 3800 9650 3800
Text Label 1850 2200 0    50   ~ 0
DDR_DQ0
Text Label 1850 2300 0    50   ~ 0
DDR_DQ1
Text Label 1850 2400 0    50   ~ 0
DDR_DQ2
Text Label 1850 2500 0    50   ~ 0
DDR_DQ3
Text Label 1850 2600 0    50   ~ 0
DDR_DQ4
Text Label 1850 2700 0    50   ~ 0
DDR_DQ5
Text Label 1850 2800 0    50   ~ 0
DDR_DQ6
Text Label 1850 2900 0    50   ~ 0
DDR_DQ7
Text Label 1850 3000 0    50   ~ 0
DDR_DQ8
Text Label 1850 3100 0    50   ~ 0
DDR_DQ9
Text Label 1850 3200 0    50   ~ 0
DDR_DQ10
Text Label 1850 3300 0    50   ~ 0
DDR_DQ11
Text Label 1850 3400 0    50   ~ 0
DDR_DQ12
Text Label 1850 3500 0    50   ~ 0
DDR_DQ13
Text Label 1850 3600 0    50   ~ 0
DDR_DQ14
Text Label 1850 3700 0    50   ~ 0
DDR_DQ15
Text Label 1850 3800 0    50   ~ 0
DDR_DQ16
Text Label 1850 3900 0    50   ~ 0
DDR_DQ17
Text Label 1850 4000 0    50   ~ 0
DDR_DQ18
Text Label 1850 4100 0    50   ~ 0
DDR_DQ19
Text Label 1850 4200 0    50   ~ 0
DDR_DQ20
Text Label 1850 4300 0    50   ~ 0
DDR_DQ21
Text Label 1850 4400 0    50   ~ 0
DDR_DQ22
Text Label 1850 4500 0    50   ~ 0
DDR_DQ23
Text Label 1850 4600 0    50   ~ 0
DDR_DQ24
Text Label 1850 4700 0    50   ~ 0
DDR_DQ25
Text Label 1850 4800 0    50   ~ 0
DDR_DQ26
Text Label 1850 4900 0    50   ~ 0
DDR_DQ27
Text Label 1850 5000 0    50   ~ 0
DDR_DQ28
Text Label 1850 5100 0    50   ~ 0
DDR_DQ29
Text Label 1850 5200 0    50   ~ 0
DDR_DQ30
Text Label 1850 5300 0    50   ~ 0
DDR_DQ31
Wire Wire Line
	1850 2200 2550 2200
Wire Wire Line
	1850 2300 2550 2300
Wire Wire Line
	1850 2400 2550 2400
Wire Wire Line
	1850 2500 2550 2500
Wire Wire Line
	1850 2600 2550 2600
Wire Wire Line
	1850 2700 2550 2700
Wire Wire Line
	1850 2800 2550 2800
Wire Wire Line
	1850 2900 2550 2900
Wire Wire Line
	1850 3000 2550 3000
Wire Wire Line
	1850 3100 2550 3100
Wire Wire Line
	1850 3200 2550 3200
Wire Wire Line
	1850 3300 2550 3300
Wire Wire Line
	1850 3400 2550 3400
Wire Wire Line
	1850 3500 2550 3500
Wire Wire Line
	1850 3600 2550 3600
Wire Wire Line
	1850 3700 2550 3700
Wire Wire Line
	1850 3800 2550 3800
Wire Wire Line
	1850 3900 2550 3900
Wire Wire Line
	1850 4000 2550 4000
Wire Wire Line
	1850 4100 2550 4100
Wire Wire Line
	1850 4200 2550 4200
Wire Wire Line
	1850 4300 2550 4300
Wire Wire Line
	1850 4400 2550 4400
Wire Wire Line
	1850 4500 2550 4500
Wire Wire Line
	1850 4600 2550 4600
Wire Wire Line
	1850 4700 2550 4700
Wire Wire Line
	1850 4800 2550 4800
Wire Wire Line
	1850 4900 2550 4900
Wire Wire Line
	1850 5000 2550 5000
Wire Wire Line
	1850 5100 2550 5100
Wire Wire Line
	1850 5200 2550 5200
Wire Wire Line
	1850 5300 2550 5300
NoConn ~ 9650 3900
NoConn ~ 9650 4500
Text Label 1850 5400 0    50   ~ 0
DDR_DQS_N0
Text Label 1850 5500 0    50   ~ 0
DDR_DQS_N1
Text Label 1850 5600 0    50   ~ 0
DDR_DQS_N2
Text Label 1850 5700 0    50   ~ 0
DDR_DQS_N3
Text Label 1850 6300 0    50   ~ 0
DDR_DQS_P0
Text Label 1850 6400 0    50   ~ 0
DDR_DQS_P1
Text Label 1850 6500 0    50   ~ 0
DDR_DQS_P2
Text Label 1850 6600 0    50   ~ 0
DDR_DQS_P3
Wire Wire Line
	1850 6300 2550 6300
Wire Wire Line
	1850 6400 2550 6400
Wire Wire Line
	1850 6500 2550 6500
Wire Wire Line
	1850 6600 2550 6600
Wire Wire Line
	1850 5400 2550 5400
Wire Wire Line
	1850 5500 2550 5500
Wire Wire Line
	1850 5600 2550 5600
Wire Wire Line
	1850 5700 2550 5700
NoConn ~ 2550 5800
NoConn ~ 2550 5900
NoConn ~ 2550 6000
NoConn ~ 2550 6100
NoConn ~ 2550 6200
NoConn ~ 2550 6700
NoConn ~ 2550 6800
NoConn ~ 2550 6900
NoConn ~ 2550 7000
NoConn ~ 2550 7100
Text Label 5400 2300 2    50   ~ 0
DDR_DM0
Text Label 5400 2400 2    50   ~ 0
DDR_DM1
Text Label 5400 2500 2    50   ~ 0
DDR_DM2
Text Label 5400 2600 2    50   ~ 0
DDR_DM3
Wire Wire Line
	5400 2300 4850 2300
Wire Wire Line
	5400 2400 4850 2400
Wire Wire Line
	5400 2500 4850 2500
Wire Wire Line
	5400 2600 4850 2600
NoConn ~ 4850 2700
NoConn ~ 4850 2800
NoConn ~ 4850 2900
NoConn ~ 4850 3000
NoConn ~ 4850 3100
Text Label 10300 5850 2    50   ~ 0
DDR_ZQ
NoConn ~ 9650 5300
NoConn ~ 9650 5100
NoConn ~ 9650 4900
NoConn ~ 9650 4700
NoConn ~ 9650 5500
$Comp
L KIT_Power:+1V2_STBY #PWR?
U 1 1 5EC827FA
P 9000 1700
F 0 "#PWR?" H 9000 1550 50  0001 C CNN
F 1 "+1V2_STBY" H 9015 1873 50  0000 C CNN
F 2 "" H 9000 1700 50  0001 C CNN
F 3 "" H 9000 1700 50  0001 C CNN
	1    9000 1700
	1    0    0    -1  
$EndComp
Wire Wire Line
	8100 1700 8100 1800
Wire Wire Line
	8100 1800 8400 1800
Wire Wire Line
	8400 1800 8400 1900
Wire Wire Line
	8800 1900 8800 1800
Wire Wire Line
	8800 1800 9000 1800
Wire Wire Line
	9000 1800 9000 1700
Wire Wire Line
	2600 1000 2600 950 
Wire Wire Line
	3050 1000 3050 950 
Wire Wire Line
	3500 1000 3500 950 
Wire Wire Line
	3950 1000 3950 950 
Wire Wire Line
	2600 1300 2600 1350
Wire Wire Line
	2600 1350 2150 1350
Wire Wire Line
	3050 1300 3050 1350
Connection ~ 3050 1350
Wire Wire Line
	3050 1350 2600 1350
Wire Wire Line
	3500 1300 3500 1350
Connection ~ 3500 1350
Wire Wire Line
	3500 1350 3050 1350
Wire Wire Line
	3950 1300 3950 1350
Wire Wire Line
	3950 1350 3500 1350
Connection ~ 2600 950 
Wire Wire Line
	2600 950  2150 950 
Connection ~ 3050 950 
Wire Wire Line
	3050 950  2600 950 
Connection ~ 3500 950 
Wire Wire Line
	3500 950  3050 950 
Wire Wire Line
	3950 950  3500 950 
Wire Wire Line
	1700 1000 1700 950 
Wire Wire Line
	2150 1000 2150 950 
Wire Wire Line
	2150 1300 2150 1350
Wire Wire Line
	2150 1350 1700 1350
Wire Wire Line
	1700 1300 1700 1350
Wire Wire Line
	2150 950  1700 950 
$Comp
L Device:C C73
U 1 1 5EE44BAC
P 3950 1150
F 0 "C73" H 3835 1196 50  0000 R CNN
F 1 "1uF" H 3835 1105 50  0000 R CNN
F 2 "Capacitor_SMD:C_0402_1005Metric" H 3988 1000 50  0001 C CNN
F 3 "~" H 3950 1150 50  0001 C CNN
F 4 "16 V" H 3950 1150 50  0001 C CNN "info"
F 5 "AVT-IPE" H 3950 1150 50  0001 C CNN "stock"
	1    3950 1150
	-1   0    0    -1  
$EndComp
$Comp
L Device:C C72
U 1 1 5EE67AA7
P 3500 1150
F 0 "C72" H 3385 1196 50  0000 R CNN
F 1 "1uF" H 3385 1105 50  0000 R CNN
F 2 "Capacitor_SMD:C_0402_1005Metric" H 3538 1000 50  0001 C CNN
F 3 "~" H 3500 1150 50  0001 C CNN
F 4 "16 V" H 3500 1150 50  0001 C CNN "info"
F 5 "AVT-IPE" H 3500 1150 50  0001 C CNN "stock"
	1    3500 1150
	-1   0    0    -1  
$EndComp
$Comp
L Device:C C71
U 1 1 5EC82815
P 3050 1150
F 0 "C71" H 2935 1196 50  0000 R CNN
F 1 "1uF" H 2935 1105 50  0000 R CNN
F 2 "Capacitor_SMD:C_0402_1005Metric" H 3088 1000 50  0001 C CNN
F 3 "~" H 3050 1150 50  0001 C CNN
F 4 "16 V" H 3050 1150 50  0001 C CNN "info"
F 5 "AVT-IPE" H 3050 1150 50  0001 C CNN "stock"
	1    3050 1150
	-1   0    0    -1  
$EndComp
$Comp
L Device:C C70
U 1 1 5EC82816
P 2600 1150
F 0 "C70" H 2485 1196 50  0000 R CNN
F 1 "1uF" H 2485 1105 50  0000 R CNN
F 2 "Capacitor_SMD:C_0402_1005Metric" H 2638 1000 50  0001 C CNN
F 3 "~" H 2600 1150 50  0001 C CNN
F 4 "16 V" H 2600 1150 50  0001 C CNN "info"
F 5 "AVT-IPE" H 2600 1150 50  0001 C CNN "stock"
	1    2600 1150
	-1   0    0    -1  
$EndComp
$Comp
L Device:C C69
U 1 1 5EC82817
P 2150 1150
F 0 "C69" H 2035 1196 50  0000 R CNN
F 1 "1uF" H 2035 1105 50  0000 R CNN
F 2 "Capacitor_SMD:C_0402_1005Metric" H 2188 1000 50  0001 C CNN
F 3 "~" H 2150 1150 50  0001 C CNN
F 4 "16 V" H 2150 1150 50  0001 C CNN "info"
F 5 "AVT-IPE" H 2150 1150 50  0001 C CNN "stock"
	1    2150 1150
	-1   0    0    -1  
$EndComp
$Comp
L Device:C C68
U 1 1 5EEF3396
P 1700 1150
F 0 "C68" H 1585 1196 50  0000 R CNN
F 1 "1uF" H 1585 1105 50  0000 R CNN
F 2 "Capacitor_SMD:C_0402_1005Metric" H 1738 1000 50  0001 C CNN
F 3 "~" H 1700 1150 50  0001 C CNN
F 4 "16 V" H 1700 1150 50  0001 C CNN "info"
F 5 "AVT-IPE" H 1700 1150 50  0001 C CNN "stock"
	1    1700 1150
	-1   0    0    -1  
$EndComp
Connection ~ 2150 1350
Connection ~ 2600 1350
$Comp
L KIT_Power:+0.85_STBY #PWR?
U 1 1 5EC8280A
P 8100 1700
F 0 "#PWR?" H 8100 1550 50  0001 C CNN
F 1 "+0.85_STBY" H 8115 1873 50  0000 C CNN
F 2 "" H 8100 1700 50  0001 C CNN
F 3 "" H 8100 1700 50  0001 C CNN
	1    8100 1700
	1    0    0    -1  
$EndComp
Connection ~ 2150 950 
Wire Wire Line
	6700 1000 6700 950 
Wire Wire Line
	7150 1000 7150 950 
Wire Wire Line
	7150 1300 7150 1350
Wire Wire Line
	7150 1350 6700 1350
Wire Wire Line
	6700 1300 6700 1350
Wire Wire Line
	7150 950  6700 950 
Wire Wire Line
	5200 900  5200 950 
Wire Wire Line
	6700 1350 5200 1350
Wire Wire Line
	5200 1400 5200 1350
Connection ~ 6700 1350
$Comp
L KIT_Power:+1V8_STBY #PWR?
U 1 1 5FB0CA7A
P 5200 900
F 0 "#PWR?" H 5200 750 50  0001 C CNN
F 1 "+1V8_STBY" H 5215 1073 50  0000 C CNN
F 2 "" H 5200 900 50  0001 C CNN
F 3 "" H 5200 900 50  0001 C CNN
	1    5200 900 
	1    0    0    -1  
$EndComp
$Comp
L power:GND #PWR?
U 1 1 5FB0D748
P 5200 1400
F 0 "#PWR?" H 5200 1150 50  0001 C CNN
F 1 "GND" H 5205 1227 50  0000 C CNN
F 2 "" H 5200 1400 50  0001 C CNN
F 3 "" H 5200 1400 50  0001 C CNN
	1    5200 1400
	1    0    0    -1  
$EndComp
$Comp
L Device:R R74
U 1 1 6194165B
P 10450 6100
F 0 "R74" H 10380 6054 50  0000 R CNN
F 1 "240" H 10380 6145 50  0000 R CNN
F 2 "Resistor_SMD:R_0402_1005Metric" V 10380 6100 50  0001 C CNN
F 3 "~" H 10450 6100 50  0001 C CNN
F 4 "AVT-IPE" H 10450 6100 50  0001 C CNN "stock"
	1    10450 6100
	-1   0    0    1   
$EndComp
$Comp
L power:GND #PWR?
U 1 1 61941661
P 10450 6250
F 0 "#PWR?" H 10450 6000 50  0001 C CNN
F 1 "GND" H 10455 6077 50  0000 C CNN
F 2 "" H 10450 6250 50  0001 C CNN
F 3 "" H 10450 6250 50  0001 C CNN
	1    10450 6250
	1    0    0    -1  
$EndComp
Wire Wire Line
	10450 5950 10450 5850
Wire Wire Line
	9700 5850 10450 5850
Entry Wire Line
	1750 2100 1850 2200
Entry Wire Line
	1750 2200 1850 2300
Entry Wire Line
	1750 2300 1850 2400
Entry Wire Line
	1750 2400 1850 2500
Entry Wire Line
	1750 2500 1850 2600
Entry Wire Line
	1750 2600 1850 2700
Entry Wire Line
	1750 2700 1850 2800
Entry Wire Line
	1750 2800 1850 2900
Entry Wire Line
	1750 2900 1850 3000
Entry Wire Line
	1750 3000 1850 3100
Entry Wire Line
	1750 3100 1850 3200
Entry Wire Line
	1750 3200 1850 3300
Entry Wire Line
	1750 3300 1850 3400
Entry Wire Line
	1750 3400 1850 3500
Entry Wire Line
	1750 3500 1850 3600
Entry Wire Line
	1750 3600 1850 3700
Entry Wire Line
	1750 3700 1850 3800
Entry Wire Line
	1750 3800 1850 3900
Entry Wire Line
	1750 3900 1850 4000
Entry Wire Line
	1750 4000 1850 4100
Entry Wire Line
	1750 4100 1850 4200
Entry Wire Line
	1750 4200 1850 4300
Entry Wire Line
	1750 4300 1850 4400
Entry Wire Line
	1750 4400 1850 4500
Entry Wire Line
	1750 4500 1850 4600
Entry Wire Line
	1750 4600 1850 4700
Entry Wire Line
	1750 4700 1850 4800
Entry Wire Line
	1750 4800 1850 4900
Entry Wire Line
	1750 4900 1850 5000
Entry Wire Line
	1750 5000 1850 5100
Entry Wire Line
	1750 5100 1850 5200
Entry Wire Line
	1750 5200 1850 5300
Entry Wire Line
	1750 5300 1850 5400
Entry Wire Line
	1750 5400 1850 5500
Entry Wire Line
	1750 5500 1850 5600
Entry Wire Line
	1750 5600 1850 5700
Wire Bus Line
	1750 2100 1500 2100
Wire Bus Line
	1750 5300 1500 5300
Entry Wire Line
	1750 6200 1850 6300
Entry Wire Line
	1750 6300 1850 6400
Entry Wire Line
	1750 6400 1850 6500
Entry Wire Line
	1750 6500 1850 6600
Wire Bus Line
	1750 6200 1500 6200
Entry Wire Line
	5400 2600 5500 2500
Entry Wire Line
	5400 2500 5500 2400
Entry Wire Line
	5400 2400 5500 2300
Entry Wire Line
	5400 2300 5500 2200
Wire Bus Line
	5500 2200 5700 2200
Entry Wire Line
	10150 3800 10250 3700
Entry Wire Line
	10150 3700 10250 3600
Entry Wire Line
	10150 3600 10250 3500
Entry Wire Line
	10150 3500 10250 3400
Entry Wire Line
	10150 3400 10250 3300
Entry Wire Line
	10150 3300 10250 3200
Entry Wire Line
	10150 3200 10250 3100
Entry Wire Line
	10150 3100 10250 3000
Entry Wire Line
	10150 3000 10250 2900
Entry Wire Line
	10150 2900 10250 2800
Entry Wire Line
	10150 2800 10250 2700
Entry Wire Line
	10150 2700 10250 2600
Entry Wire Line
	10150 2600 10250 2500
Entry Wire Line
	10150 2500 10250 2400
Entry Wire Line
	10150 2400 10250 2300
Entry Wire Line
	10150 2300 10250 2200
Entry Wire Line
	10150 2200 10250 2100
Wire Bus Line
	10250 2100 10400 2100
Text GLabel 1500 2100 0    50   BiDi ~ 0
DDR_DQ[0..31]
Text GLabel 1500 5300 0    50   Output ~ 0
DDR_DQS_N[0..3]
Text GLabel 1500 6200 0    50   Output ~ 0
DDR_DQS_P[0..3]
Text GLabel 5700 2200 2    50   Output ~ 0
DDR_DM[0..3]
Text GLabel 10400 2100 2    50   Output ~ 0
DDR_A[0..16]
Text GLabel 9800 5400 2    50   Output ~ 0
DDR_ODT
Text GLabel 9800 5200 2    50   Output ~ 0
DDR_CS_N
Text GLabel 9800 5000 2    50   Output ~ 0
DDR_CKE
Text GLabel 9800 4800 2    50   Output ~ 0
DDR_CK_N
Text GLabel 9800 4600 2    50   Output ~ 0
DDR_CK_P
Text GLabel 9800 4400 2    50   Output ~ 0
DDR_BG0
Text GLabel 9800 4300 2    50   Output ~ 0
DDR_BA1
Text GLabel 9800 4200 2    50   Output ~ 0
DDR_BA0
Text GLabel 9800 4100 2    50   Output ~ 0
DDR_ALERT_N
Text GLabel 9800 4000 2    50   Output ~ 0
DDR_ACT_N
Text GLabel 9800 5600 2    50   Output ~ 0
DDR_PAR
Text GLabel 9800 5700 2    50   Output ~ 0
DDR_RESET_N
Wire Wire Line
	9800 4000 9650 4000
Wire Wire Line
	9800 4100 9650 4100
Wire Wire Line
	9800 4200 9650 4200
Wire Wire Line
	9800 4300 9650 4300
Wire Wire Line
	9800 4400 9650 4400
Wire Wire Line
	9800 4600 9650 4600
Wire Wire Line
	9800 4800 9650 4800
Wire Wire Line
	9800 5000 9650 5000
Wire Wire Line
	9800 5200 9650 5200
Wire Wire Line
	9800 5400 9650 5400
Wire Wire Line
	9800 5600 9650 5600
Wire Wire Line
	9800 5700 9650 5700
Wire Wire Line
	9700 5850 9700 5800
Wire Wire Line
	9700 5800 9650 5800
Wire Wire Line
	8600 1500 8600 1900
Connection ~ 7150 950 
$Comp
L Device:Ferrite_Bead FB?
U 1 1 5F21DAC7
P 5850 950
AR Path="/5DEF958D/5F21DAC7" Ref="FB?"  Part="1" 
AR Path="/5EC80A2F/5F21DAC7" Ref="FB10"  Part="1" 
F 0 "FB10" V 5613 950 50  0000 C CNN
F 1 "120 Ohms @ 100MHz" V 5704 950 50  0000 C CNN
F 2 "Inductor_SMD:L_0402_1005Metric" V 5780 950 50  0001 C CNN
F 3 "https://www.murata.com/en-us/products/productdata/8796740059166/ENFA0018.pdf" H 5850 950 50  0001 C CNN
F 4 "120 Ohms @ 100MHz 1 Power Line Ferrite Bead 0402 (1005 Metric) 2A 55mOhm" V 5850 950 50  0001 C CNN "info"
F 5 "Murata" V 5850 950 50  0001 C CNN "manf"
F 6 "BLM15PX121SN1D" V 5850 950 50  0001 C CNN "manf#"
	1    5850 950 
	0    1    1    0   
$EndComp
Wire Wire Line
	6700 950  6500 950 
Connection ~ 6700 950 
Wire Wire Line
	5700 950  5200 950 
$Comp
L KIT_Power:+1V8_DDR_PLL #PWR?
U 1 1 5F2572E2
P 7150 900
F 0 "#PWR?" H 7150 750 50  0001 C CNN
F 1 "+1V8_DDR_PLL" H 7165 1073 50  0000 C CNN
F 2 "" H 7150 900 50  0001 C CNN
F 3 "" H 7150 900 50  0001 C CNN
	1    7150 900 
	1    0    0    -1  
$EndComp
Wire Wire Line
	7150 900  7150 950 
$Comp
L KIT_Power:+1V8_DDR_PLL #PWR?
U 1 1 5F311716
P 8600 1500
F 0 "#PWR?" H 8600 1350 50  0001 C CNN
F 1 "+1V8_DDR_PLL" H 8615 1673 50  0000 C CNN
F 2 "" H 8600 1500 50  0001 C CNN
F 3 "" H 8600 1500 50  0001 C CNN
	1    8600 1500
	1    0    0    -1  
$EndComp
$Comp
L Device:C C?
U 1 1 5F385765
P 6700 1150
AR Path="/5E09AE40/5F385765" Ref="C?"  Part="1" 
AR Path="/5EC80A2F/5F385765" Ref="C17"  Part="1" 
F 0 "C17" H 6815 1196 50  0000 L CNN
F 1 "10uF" H 6815 1105 50  0000 L CNN
F 2 "Capacitor_SMD:C_0402_1005Metric" H 6738 1000 50  0001 C CNN
F 3 "~" H 6700 1150 50  0001 C CNN
F 4 "10µF ±20% 6.3V Ceramic Capacitor X6S 0402 (1005 Metric) " H 6700 1150 50  0001 C CNN "info"
F 5 "Murata" H 6700 1150 50  0001 C CNN "manf"
F 6 "GRM155C80J106ME11D" H 6700 1150 50  0001 C CNN "manf#"
	1    6700 1150
	1    0    0    -1  
$EndComp
$Comp
L Device:C C?
U 1 1 5F3FFFAE
P 7150 1150
AR Path="/5F7AC3E6/5F3FFFAE" Ref="C?"  Part="1" 
AR Path="/5EC80A2F/5F3FFFAE" Ref="C19"  Part="1" 
F 0 "C19" H 7265 1241 50  0000 L CNN
F 1 "1uF" H 7265 1150 50  0000 L CNN
F 2 "Capacitor_SMD:C_0402_1005Metric" H 7188 1000 50  0001 C CNN
F 3 "~" H 7150 1150 50  0001 C CNN
F 4 "16 V" H 7265 1059 50  0000 L CNN "info"
F 5 "AVT-IPE" H 7150 1150 50  0001 C CNN "stock"
	1    7150 1150
	1    0    0    -1  
$EndComp
Text Notes 5450 6150 0    50   ~ 0
UG583:\nSkew constraints assume a propagation time \nof 169.5 ps/in based on the stackup shown in Table 2-1\n- DQ to DQS: ±5 ps, ±29 mil\n- CK_P and CK_N: 2ps, 12 mil\n- CK to DQS: –149 to 1796 ps, –879 to 10,600 mil
$Comp
L Device:C C?
U 1 1 5F0782DD
P 1250 1150
AR Path="/5E09AE40/5F0782DD" Ref="C?"  Part="1" 
AR Path="/5EC80A2F/5F0782DD" Ref="C63"  Part="1" 
F 0 "C63" H 1365 1196 50  0000 L CNN
F 1 "10uF" H 1365 1105 50  0000 L CNN
F 2 "Capacitor_SMD:C_0402_1005Metric" H 1288 1000 50  0001 C CNN
F 3 "~" H 1250 1150 50  0001 C CNN
F 4 "10µF ±20% 6.3V Ceramic Capacitor X6S 0402 (1005 Metric) " H 1250 1150 50  0001 C CNN "info"
F 5 "Murata" H 1250 1150 50  0001 C CNN "manf"
F 6 "GRM155C80J106ME11D" H 1250 1150 50  0001 C CNN "manf#"
	1    1250 1150
	1    0    0    -1  
$EndComp
Wire Wire Line
	1250 1000 1250 950 
Wire Wire Line
	1700 1350 1250 1350
Wire Wire Line
	1250 1300 1250 1350
Wire Wire Line
	1700 950  1250 950 
$Comp
L KIT_Power:+1V2_STBY #PWR?
U 1 1 5F08912A
P 1050 900
F 0 "#PWR?" H 1050 750 50  0001 C CNN
F 1 "+1V2_STBY" H 1065 1073 50  0000 C CNN
F 2 "" H 1050 900 50  0001 C CNN
F 3 "" H 1050 900 50  0001 C CNN
	1    1050 900 
	1    0    0    -1  
$EndComp
Wire Wire Line
	1250 950  1050 950 
Wire Wire Line
	1050 900  1050 950 
Connection ~ 1250 950 
Wire Wire Line
	1250 1350 1050 1350
$Comp
L power:GND #PWR?
U 1 1 5F08913C
P 1050 1400
F 0 "#PWR?" H 1050 1150 50  0001 C CNN
F 1 "GND" H 1055 1227 50  0000 C CNN
F 2 "" H 1050 1400 50  0001 C CNN
F 3 "" H 1050 1400 50  0001 C CNN
	1    1050 1400
	1    0    0    -1  
$EndComp
Wire Wire Line
	1050 1400 1050 1350
Connection ~ 1250 1350
Connection ~ 1700 950 
Connection ~ 1700 1350
$Comp
L power:PWR_FLAG #FLG?
U 1 1 5F187EC1
P 6500 900
AR Path="/5E09AE40/5F187EC1" Ref="#FLG?"  Part="1" 
AR Path="/5EC80A2F/5F187EC1" Ref="#FLG?"  Part="1" 
F 0 "#FLG?" H 6500 975 50  0001 C CNN
F 1 "PWR_FLAG" H 6500 1073 50  0000 C CNN
F 2 "" H 6500 900 50  0001 C CNN
F 3 "~" H 6500 900 50  0001 C CNN
	1    6500 900 
	1    0    0    -1  
$EndComp
Wire Wire Line
	6500 900  6500 950 
Connection ~ 6500 950 
Wire Wire Line
	6500 950  6000 950 
Wire Bus Line
	1750 5300 1750 5600
Wire Bus Line
	1750 6200 1750 6500
Wire Bus Line
	5500 2200 5500 2500
Wire Bus Line
	10250 2100 10250 3700
Wire Bus Line
	1750 2100 1750 5200
$EndSCHEMATC
