EESchema Schematic File Version 4
EELAYER 30 0
EELAYER END
$Descr A4 11693 8268
encoding utf-8
Sheet 28 28
Title "ZynqMP Mezzanine FMC+ (BuZZyBoard)"
Date "2020-10-02"
Rev "1.0"
Comp "Karlsruhe Institute of Technology (KIT)"
Comment1 "Institute for Data Processing and Electronics (IPE)"
Comment2 "Luis Ardila"
Comment3 ""
Comment4 ""
$EndDescr
Text GLabel 9200 1800 2    50   Output ~ 0
PMBUS_IRPS5401_SCL
Text GLabel 9200 1900 2    50   BiDi ~ 0
PMBUS_IRPS5401_SDA
Text GLabel 9200 2000 2    50   Input ~ 0
PMBUS_IRPS5401_INT_B
Wire Wire Line
	4850 2000 5750 2000
Wire Wire Line
	4850 1900 5400 1900
Wire Wire Line
	4850 1800 5050 1800
$Comp
L Device:R R?
U 1 1 5F0E0315
P 5750 1550
AR Path="/5F4D38EE/5F0E0315" Ref="R?"  Part="1" 
AR Path="/5EF3A6EF/5F0E0315" Ref="R?"  Part="1" 
AR Path="/5F0BF924/5F0E0315" Ref="R79"  Part="1" 
F 0 "R79" H 5680 1504 50  0000 R CNN
F 1 "10k" H 5680 1595 50  0000 R CNN
F 2 "Resistor_SMD:R_0402_1005Metric" V 5680 1550 50  0001 C CNN
F 3 "~" H 5750 1550 50  0001 C CNN
F 4 "AVT-IPE" H 5750 1550 50  0001 C CNN "stock"
	1    5750 1550
	1    0    0    1   
$EndComp
$Comp
L Device:R R?
U 1 1 5F0E031B
P 5400 1550
AR Path="/5F4D38EE/5F0E031B" Ref="R?"  Part="1" 
AR Path="/5EF3A6EF/5F0E031B" Ref="R?"  Part="1" 
AR Path="/5F0BF924/5F0E031B" Ref="R78"  Part="1" 
F 0 "R78" H 5330 1504 50  0000 R CNN
F 1 "10k" H 5330 1595 50  0000 R CNN
F 2 "Resistor_SMD:R_0402_1005Metric" V 5330 1550 50  0001 C CNN
F 3 "~" H 5400 1550 50  0001 C CNN
F 4 "AVT-IPE" H 5400 1550 50  0001 C CNN "stock"
	1    5400 1550
	1    0    0    1   
$EndComp
$Comp
L Device:R R?
U 1 1 5F0E0321
P 5050 1550
AR Path="/5F4D38EE/5F0E0321" Ref="R?"  Part="1" 
AR Path="/5EF3A6EF/5F0E0321" Ref="R?"  Part="1" 
AR Path="/5F0BF924/5F0E0321" Ref="R77"  Part="1" 
F 0 "R77" H 4980 1504 50  0000 R CNN
F 1 "10k" H 4980 1595 50  0000 R CNN
F 2 "Resistor_SMD:R_0402_1005Metric" V 4980 1550 50  0001 C CNN
F 3 "~" H 5050 1550 50  0001 C CNN
F 4 "AVT-IPE" H 5050 1550 50  0001 C CNN "stock"
	1    5050 1550
	1    0    0    1   
$EndComp
Wire Wire Line
	5750 1700 5750 2000
$Comp
L KIT_Power:+3V3_STBY #PWR?
U 1 1 5F0E0328
P 5750 1300
AR Path="/5F4D38EE/5F0E0328" Ref="#PWR?"  Part="1" 
AR Path="/5EF3A6EF/5F0E0328" Ref="#PWR?"  Part="1" 
AR Path="/5F0BF924/5F0E0328" Ref="#PWR?"  Part="1" 
F 0 "#PWR?" H 5750 1150 50  0001 C CNN
F 1 "+3V3_STBY" H 5765 1473 50  0000 C CNN
F 2 "" H 5750 1300 50  0001 C CNN
F 3 "" H 5750 1300 50  0001 C CNN
	1    5750 1300
	-1   0    0    -1  
$EndComp
Wire Wire Line
	5750 1300 5750 1350
Wire Wire Line
	5750 1350 5400 1350
Wire Wire Line
	5050 1350 5050 1400
Connection ~ 5750 1350
Wire Wire Line
	5750 1350 5750 1400
Wire Wire Line
	5400 1400 5400 1350
Connection ~ 5400 1350
Wire Wire Line
	5400 1350 5050 1350
Wire Wire Line
	5400 1700 5400 1900
Wire Wire Line
	5050 1700 5050 1800
$Comp
L Device:R R?
U 1 1 5F0E1D1F
P 6850 1550
AR Path="/5F4D38EE/5F0E1D1F" Ref="R?"  Part="1" 
AR Path="/5EF3A6EF/5F0E1D1F" Ref="R?"  Part="1" 
AR Path="/5F0BF924/5F0E1D1F" Ref="R82"  Part="1" 
F 0 "R82" H 6780 1504 50  0000 R CNN
F 1 "10k" H 6780 1595 50  0000 R CNN
F 2 "Resistor_SMD:R_0402_1005Metric" V 6780 1550 50  0001 C CNN
F 3 "~" H 6850 1550 50  0001 C CNN
F 4 "AVT-IPE" H 6850 1550 50  0001 C CNN "stock"
	1    6850 1550
	1    0    0    1   
$EndComp
$Comp
L Device:R R?
U 1 1 5F0E1D25
P 6500 1550
AR Path="/5F4D38EE/5F0E1D25" Ref="R?"  Part="1" 
AR Path="/5EF3A6EF/5F0E1D25" Ref="R?"  Part="1" 
AR Path="/5F0BF924/5F0E1D25" Ref="R81"  Part="1" 
F 0 "R81" H 6430 1504 50  0000 R CNN
F 1 "10k" H 6430 1595 50  0000 R CNN
F 2 "Resistor_SMD:R_0402_1005Metric" V 6430 1550 50  0001 C CNN
F 3 "~" H 6500 1550 50  0001 C CNN
F 4 "AVT-IPE" H 6500 1550 50  0001 C CNN "stock"
	1    6500 1550
	1    0    0    1   
$EndComp
$Comp
L Device:R R?
U 1 1 5F0E1D2B
P 6150 1550
AR Path="/5F4D38EE/5F0E1D2B" Ref="R?"  Part="1" 
AR Path="/5EF3A6EF/5F0E1D2B" Ref="R?"  Part="1" 
AR Path="/5F0BF924/5F0E1D2B" Ref="R80"  Part="1" 
F 0 "R80" H 6080 1504 50  0000 R CNN
F 1 "10k" H 6080 1595 50  0000 R CNN
F 2 "Resistor_SMD:R_0402_1005Metric" V 6080 1550 50  0001 C CNN
F 3 "~" H 6150 1550 50  0001 C CNN
F 4 "AVT-IPE" H 6150 1550 50  0001 C CNN "stock"
	1    6150 1550
	1    0    0    1   
$EndComp
$Comp
L KIT_Power:+3V3_STBY #PWR?
U 1 1 5F0E1D32
P 6850 1300
AR Path="/5F4D38EE/5F0E1D32" Ref="#PWR?"  Part="1" 
AR Path="/5EF3A6EF/5F0E1D32" Ref="#PWR?"  Part="1" 
AR Path="/5F0BF924/5F0E1D32" Ref="#PWR?"  Part="1" 
F 0 "#PWR?" H 6850 1150 50  0001 C CNN
F 1 "+3V3_STBY" H 6865 1473 50  0000 C CNN
F 2 "" H 6850 1300 50  0001 C CNN
F 3 "" H 6850 1300 50  0001 C CNN
	1    6850 1300
	-1   0    0    -1  
$EndComp
Wire Wire Line
	6850 1300 6850 1350
Wire Wire Line
	6850 1350 6500 1350
Wire Wire Line
	6150 1350 6150 1400
Connection ~ 6850 1350
Wire Wire Line
	6850 1350 6850 1400
Wire Wire Line
	6500 1400 6500 1350
Connection ~ 6500 1350
Wire Wire Line
	6500 1350 6150 1350
Wire Wire Line
	6850 1700 6850 2400
Wire Wire Line
	6500 1700 6500 2300
Wire Wire Line
	6150 1700 6150 2200
Connection ~ 5050 1800
Wire Wire Line
	5050 1800 7750 1800
Connection ~ 5400 1900
Wire Wire Line
	5400 1900 7850 1900
Connection ~ 5750 2000
Text GLabel 7250 2200 2    50   Output ~ 0
PMBUS_CONN_SCL
Text GLabel 7250 2300 2    50   BiDi ~ 0
PMBUS_CONN_SDA
Text GLabel 7250 2400 2    50   Input ~ 0
PMBUS_CONN_INT_B
Wire Wire Line
	4850 2200 6150 2200
Wire Wire Line
	4850 2300 6500 2300
Wire Wire Line
	4850 2400 6850 2400
Connection ~ 6150 2200
Wire Wire Line
	6150 2200 7250 2200
Connection ~ 6500 2300
Wire Wire Line
	6500 2300 7250 2300
Connection ~ 6850 2400
Wire Wire Line
	6850 2400 7250 2400
Text GLabel 1750 1800 0    50   Input ~ 0
PMBUS_SCL
Text GLabel 1750 1900 0    50   BiDi ~ 0
PMBUS_SDA
Text GLabel 1750 2000 0    50   Output ~ 0
PMBUS_INT_B
$Comp
L KIT_Interface_Expansion:TCA9543APWR U2
U 1 1 5F0C9490
P 4350 2300
F 0 "U2" H 4600 3150 50  0000 C CNN
F 1 "TCA9543APWR" H 4650 1850 50  0000 C CNN
F 2 "Package_SO:TSSOP-14_4.4x5mm_P0.65mm" H 5350 1400 50  0001 C CNN
F 3 "https://www.ti.com/lit/ds/symlink/tca9543a.pdf" H 4400 2550 50  0001 C CNN
	1    4350 2300
	1    0    0    -1  
$EndComp
Wire Wire Line
	1750 1800 3800 1800
Wire Wire Line
	1750 1900 3500 1900
Wire Wire Line
	1750 2000 3200 2000
Wire Wire Line
	3200 1700 3200 2000
Wire Wire Line
	3500 1700 3500 1900
Wire Wire Line
	3500 1350 3200 1350
Connection ~ 3200 1350
Wire Wire Line
	3500 1350 3500 1400
$Comp
L Device:R R?
U 1 1 5F135AD4
P 3500 1550
AR Path="/5F28C5AE/5F135AD4" Ref="R?"  Part="1" 
AR Path="/5F0BF924/5F135AD4" Ref="R13"  Part="1" 
F 0 "R13" H 3430 1504 50  0000 R CNN
F 1 "10k" H 3430 1595 50  0000 R CNN
F 2 "Resistor_SMD:R_0402_1005Metric" V 3430 1550 50  0001 C CNN
F 3 "~" H 3500 1550 50  0001 C CNN
F 4 "AVT-IPE" H 3500 1550 50  0001 C CNN "stock"
	1    3500 1550
	-1   0    0    1   
$EndComp
Wire Wire Line
	2900 1350 2900 1400
Connection ~ 2900 1350
Wire Wire Line
	3200 1350 3200 1400
Wire Wire Line
	2900 1350 3200 1350
Wire Wire Line
	2900 1300 2900 1350
$Comp
L Device:R R?
U 1 1 5F135AC2
P 3200 1550
AR Path="/5F28C5AE/5F135AC2" Ref="R?"  Part="1" 
AR Path="/5F0BF924/5F135AC2" Ref="R8"  Part="1" 
F 0 "R8" H 3130 1504 50  0000 R CNN
F 1 "10k" H 3130 1595 50  0000 R CNN
F 2 "Resistor_SMD:R_0402_1005Metric" V 3130 1550 50  0001 C CNN
F 3 "~" H 3200 1550 50  0001 C CNN
F 4 "AVT-IPE" H 3200 1550 50  0001 C CNN "stock"
	1    3200 1550
	-1   0    0    1   
$EndComp
$Comp
L Device:R R?
U 1 1 5F135ABB
P 2900 1550
AR Path="/5F28C5AE/5F135ABB" Ref="R?"  Part="1" 
AR Path="/5F0BF924/5F135ABB" Ref="R7"  Part="1" 
F 0 "R7" H 2830 1504 50  0000 R CNN
F 1 "10k" H 2830 1595 50  0000 R CNN
F 2 "Resistor_SMD:R_0402_1005Metric" V 2830 1550 50  0001 C CNN
F 3 "~" H 2900 1550 50  0001 C CNN
F 4 "AVT-IPE" H 2900 1550 50  0001 C CNN "stock"
	1    2900 1550
	-1   0    0    1   
$EndComp
Wire Wire Line
	3800 1700 3800 1800
Connection ~ 3500 1350
Wire Wire Line
	3800 1350 3500 1350
Wire Wire Line
	3800 1350 3800 1400
$Comp
L Device:R R?
U 1 1 5F135ADB
P 3800 1550
AR Path="/5F28C5AE/5F135ADB" Ref="R?"  Part="1" 
AR Path="/5F0BF924/5F135ADB" Ref="R73"  Part="1" 
F 0 "R73" H 3730 1504 50  0000 R CNN
F 1 "10k" H 3730 1595 50  0000 R CNN
F 2 "Resistor_SMD:R_0402_1005Metric" V 3730 1550 50  0001 C CNN
F 3 "~" H 3800 1550 50  0001 C CNN
F 4 "AVT-IPE" H 3800 1550 50  0001 C CNN "stock"
	1    3800 1550
	-1   0    0    1   
$EndComp
Connection ~ 3200 2000
Wire Wire Line
	3200 2000 3950 2000
Connection ~ 3500 1900
Wire Wire Line
	3500 1900 3950 1900
Connection ~ 3800 1800
Wire Wire Line
	3800 1800 3950 1800
Text GLabel 1750 2200 0    50   Input ~ 0
PMBUS_RST_B
Wire Wire Line
	1750 2200 2900 2200
Wire Wire Line
	2900 1700 2900 2200
Connection ~ 2900 2200
Wire Wire Line
	2900 2200 3500 2200
$Comp
L power:GND #PWR?
U 1 1 5F18A0DF
P 4350 2950
F 0 "#PWR?" H 4350 2700 50  0001 C CNN
F 1 "GND" H 4355 2777 50  0000 C CNN
F 2 "" H 4350 2950 50  0001 C CNN
F 3 "" H 4350 2950 50  0001 C CNN
	1    4350 2950
	1    0    0    -1  
$EndComp
$Comp
L power:GND #PWR?
U 1 1 5F18A2DF
P 2400 2850
F 0 "#PWR?" H 2400 2600 50  0001 C CNN
F 1 "GND" H 2405 2677 50  0000 C CNN
F 2 "" H 2400 2850 50  0001 C CNN
F 3 "" H 2400 2850 50  0001 C CNN
	1    2400 2850
	1    0    0    -1  
$EndComp
Wire Wire Line
	4350 2850 4350 2950
$Comp
L KIT_Power:+3V3_STBY #PWR?
U 1 1 5F195AF2
P 4350 1300
AR Path="/5F4D38EE/5F195AF2" Ref="#PWR?"  Part="1" 
AR Path="/5EF3A6EF/5F195AF2" Ref="#PWR?"  Part="1" 
AR Path="/5F0BF924/5F195AF2" Ref="#PWR?"  Part="1" 
F 0 "#PWR?" H 4350 1150 50  0001 C CNN
F 1 "+3V3_STBY" H 4365 1473 50  0000 C CNN
F 2 "" H 4350 1300 50  0001 C CNN
F 3 "" H 4350 1300 50  0001 C CNN
	1    4350 1300
	-1   0    0    -1  
$EndComp
Wire Wire Line
	4350 1300 4350 1400
$Comp
L power:GND #PWR?
U 1 1 5F27F9F5
P 3950 1000
AR Path="/5F4D391C/5F27F9F5" Ref="#PWR?"  Part="1" 
AR Path="/5F0BF924/5F27F9F5" Ref="#PWR?"  Part="1" 
F 0 "#PWR?" H 3950 750 50  0001 C CNN
F 1 "GND" H 3955 827 50  0000 C CNN
F 2 "" H 3950 1000 50  0001 C CNN
F 3 "" H 3950 1000 50  0001 C CNN
	1    3950 1000
	1    0    0    -1  
$EndComp
$Comp
L Device:C C?
U 1 1 5F27F9FB
P 3950 850
AR Path="/5F4D391C/5F27F9FB" Ref="C?"  Part="1" 
AR Path="/5F0BF924/5F27F9FB" Ref="C64"  Part="1" 
F 0 "C64" H 4065 896 50  0000 L CNN
F 1 "0.1uF" H 4065 805 50  0000 L CNN
F 2 "Capacitor_SMD:C_0402_1005Metric" H 3988 700 50  0001 C CNN
F 3 "~" H 3950 850 50  0001 C CNN
F 4 "16 V" H 3950 850 50  0001 C CNN "info"
F 5 "AVT-IPE" H 3950 850 50  0001 C CNN "stock"
	1    3950 850 
	1    0    0    -1  
$EndComp
$Comp
L KIT_Power:+3V3_STBY #PWR?
U 1 1 5F2903D2
P 3950 700
AR Path="/5F4D38EE/5F2903D2" Ref="#PWR?"  Part="1" 
AR Path="/5EF3A6EF/5F2903D2" Ref="#PWR?"  Part="1" 
AR Path="/5F0BF924/5F2903D2" Ref="#PWR?"  Part="1" 
F 0 "#PWR?" H 3950 550 50  0001 C CNN
F 1 "+3V3_STBY" H 3965 873 50  0000 C CNN
F 2 "" H 3950 700 50  0001 C CNN
F 3 "" H 3950 700 50  0001 C CNN
	1    3950 700 
	-1   0    0    -1  
$EndComp
$Comp
L Connector:Conn_01x04_Male J3
U 1 1 5F2EB287
P 8450 1250
F 0 "J3" H 8422 1132 50  0000 R CNN
F 1 "Ext_Prog_IRPS5401" H 8422 1223 50  0000 R CNN
F 2 "Connector_PinHeader_2.54mm:PinHeader_1x04_P2.54mm_Vertical" H 8450 1250 50  0001 C CNN
F 3 "https://www.infineon.com/dgdl/ug-usb005.pdf?fileId=5546d462533600a40153568485d32985" H 8450 1250 50  0001 C CNN
F 4 "Infineon" H 8450 1250 50  0001 C CNN "manf"
F 5 "USB005" H 8450 1250 50  0001 C CNN "manf#"
	1    8450 1250
	-1   0    0    1   
$EndComp
$Comp
L power:GND #PWR?
U 1 1 5F2F55C9
P 8150 1400
F 0 "#PWR?" H 8150 1150 50  0001 C CNN
F 1 "GND" H 8155 1227 50  0000 C CNN
F 2 "" H 8150 1400 50  0001 C CNN
F 3 "" H 8150 1400 50  0001 C CNN
	1    8150 1400
	1    0    0    -1  
$EndComp
Wire Wire Line
	8150 1400 8150 1350
Wire Wire Line
	8150 1350 8250 1350
Wire Wire Line
	8250 1250 7850 1250
Wire Wire Line
	7850 1250 7850 1900
Connection ~ 7850 1900
Wire Wire Line
	7850 1900 9200 1900
Wire Wire Line
	8250 1150 7750 1150
Wire Wire Line
	7750 1150 7750 1800
Connection ~ 7750 1800
Wire Wire Line
	7750 1800 9200 1800
Wire Wire Line
	5750 2000 7650 2000
Wire Wire Line
	8250 1050 7650 1050
Wire Wire Line
	7650 1050 7650 2000
Connection ~ 7650 2000
Wire Wire Line
	7650 2000 9200 2000
Text Notes 7250 3500 0    50   ~ 0
PMBUS CONN 3V3 8 bit Addresses\nPMB I/O Expander   0x44\nPIM400          0x2F\nBarracuda      0x36\nMGTAVTT1.2V    0x40\nFF Nord3.3V    0x43\nFF South3.3V    0x4D\nFRU EEPROM 0x50\nVCORE0.85V 0x5C\n\n
Text Notes 9200 2600 0    50   ~ 0
ADDR_PROT\n10k ==> +13  I2C Address Offset\n           7 BIT I2C ADDR = 0x1D\n           7 BIT PMBUS = 0x4D\nMTP Resistor\n10k ==> +13 MTP segment selected
Text Notes 9200 3200 0    50   ~ 0
ADDR_PROT\n11k ==> +14  I2C Address Offset\n           7 BIT I2C ADDR = 0x1E\n           7 BIT PMBUS = 0x4E\nMTP Resistor\n11k ==> +14 MTP segment selected
$Comp
L KIT_Interface_Expansion:PCA9557RGYR U4
U 1 1 5EFF1087
P 4350 5850
AR Path="/5EFF1087" Ref="U4"  Part="1" 
AR Path="/5F0BF924/5EFF1087" Ref="U4"  Part="1" 
F 0 "U4" H 4550 5250 50  0000 C CNN
F 1 "PCA9557RGYR" H 4650 6350 50  0000 C CNN
F 2 "KIT_Package_DFN_QFN:PCA9557RGYR" H 5300 5300 50  0001 C CNN
F 3 "https://www.ti.com/lit/ds/symlink/pca9557.pdf?ts=1593358156733&ref_url=https%253A%252F%252Fwww.ti.com%252Fstore%252Fti%252Fen%252Fp%252Fproduct%252F%253Fp%253DPCA9557RGYR" H 4450 5750 50  0001 C CNN
	1    4350 5850
	1    0    0    -1  
$EndComp
$Comp
L power:GND #PWR?
U 1 1 5F00C06D
P 4350 6550
F 0 "#PWR?" H 4350 6300 50  0001 C CNN
F 1 "GND" H 4355 6377 50  0000 C CNN
F 2 "" H 4350 6550 50  0001 C CNN
F 3 "" H 4350 6550 50  0001 C CNN
	1    4350 6550
	1    0    0    -1  
$EndComp
Text GLabel 3700 5550 0    50   Input ~ 0
MO_SCL
Text GLabel 3700 5650 0    50   BiDi ~ 0
MO_SDA
Wire Wire Line
	3700 5550 3950 5550
Wire Wire Line
	3950 5650 3700 5650
Text GLabel 3700 5750 0    50   Input ~ 0
MO_RESET_N
Wire Wire Line
	3700 5750 3950 5750
$Comp
L power:GND #PWR?
U 1 1 5F0358AB
P 3750 6550
F 0 "#PWR?" H 3750 6300 50  0001 C CNN
F 1 "GND" H 3755 6377 50  0000 C CNN
F 2 "" H 3750 6550 50  0001 C CNN
F 3 "" H 3750 6550 50  0001 C CNN
	1    3750 6550
	1    0    0    -1  
$EndComp
Wire Wire Line
	3950 6050 3750 6050
Wire Wire Line
	3750 6050 3750 6150
Wire Wire Line
	3950 6150 3750 6150
Wire Wire Line
	3950 6250 3750 6250
Connection ~ 3750 6250
Wire Wire Line
	3750 6250 3750 6550
Connection ~ 3750 6150
Wire Wire Line
	3750 6150 3750 6250
$Comp
L KIT_Power:+1V8_STBY #PWR?
U 1 1 5F045A16
P 4350 5250
AR Path="/5F28C5AE/5F045A16" Ref="#PWR?"  Part="1" 
AR Path="/5F0BF924/5F045A16" Ref="#PWR?"  Part="1" 
F 0 "#PWR?" H 4350 5100 50  0001 C CNN
F 1 "+1V8_STBY" H 4365 5423 50  0000 C CNN
F 2 "" H 4350 5250 50  0001 C CNN
F 3 "" H 4350 5250 50  0001 C CNN
	1    4350 5250
	-1   0    0    -1  
$EndComp
Text GLabel 6250 5550 2    50   Output ~ 0
Si5395_RSTb
Text GLabel 6250 5650 2    50   Output ~ 0
Si5395_OE0b
Text GLabel 6250 5750 2    50   Output ~ 0
Si5395_IN_SEL1
Text GLabel 6250 5850 2    50   Output ~ 0
Si5395_IN_SEL0
Text GLabel 6250 5950 2    50   Input ~ 0
Si5395_INTRb
Text GLabel 6250 6050 2    50   Input ~ 0
Si5395_LOLb
Wire Wire Line
	6250 5550 5350 5550
Wire Wire Line
	6250 5750 5700 5750
Wire Wire Line
	6250 5850 6050 5850
Wire Wire Line
	6250 5950 4750 5950
Wire Wire Line
	6250 6050 4750 6050
NoConn ~ 4750 6150
NoConn ~ 4750 6250
$Comp
L power:GND #PWR?
U 1 1 5F102D26
P 3750 5100
AR Path="/5F4D391C/5F102D26" Ref="#PWR?"  Part="1" 
AR Path="/5F0BF924/5F102D26" Ref="#PWR?"  Part="1" 
F 0 "#PWR?" H 3750 4850 50  0001 C CNN
F 1 "GND" H 3755 4927 50  0000 C CNN
F 2 "" H 3750 5100 50  0001 C CNN
F 3 "" H 3750 5100 50  0001 C CNN
	1    3750 5100
	1    0    0    -1  
$EndComp
$Comp
L Device:C C?
U 1 1 5F102D2C
P 3750 4950
AR Path="/5F4D391C/5F102D2C" Ref="C?"  Part="1" 
AR Path="/5F0BF924/5F102D2C" Ref="C285"  Part="1" 
F 0 "C285" H 3865 4996 50  0000 L CNN
F 1 "0.1uF" H 3865 4905 50  0000 L CNN
F 2 "Capacitor_SMD:C_0402_1005Metric" H 3788 4800 50  0001 C CNN
F 3 "~" H 3750 4950 50  0001 C CNN
F 4 "16 V" H 3750 4950 50  0001 C CNN "info"
F 5 "AVT-IPE" H 3750 4950 50  0001 C CNN "stock"
	1    3750 4950
	1    0    0    -1  
$EndComp
$Comp
L Device:R R?
U 1 1 5F181B67
P 5700 5300
AR Path="/5F4D38EE/5F181B67" Ref="R?"  Part="1" 
AR Path="/5EF3A6EF/5F181B67" Ref="R?"  Part="1" 
AR Path="/5F0BF924/5F181B67" Ref="R88"  Part="1" 
F 0 "R88" H 5630 5209 50  0000 R CNN
F 1 "10k" H 5630 5300 50  0000 R CNN
F 2 "KIT_Resistor_SMD:R_0402_1005Metric_DNP" V 5630 5300 50  0001 C CNN
F 3 "~" H 5700 5300 50  0001 C CNN
F 4 "DNP" H 5630 5391 50  0000 R CNN "DNP"
F 5 "AVT-IPE" H 5700 5300 50  0001 C CNN "stock"
	1    5700 5300
	1    0    0    1   
$EndComp
$Comp
L Device:R R?
U 1 1 5F181B73
P 5350 5300
AR Path="/5F4D38EE/5F181B73" Ref="R?"  Part="1" 
AR Path="/5EF3A6EF/5F181B73" Ref="R?"  Part="1" 
AR Path="/5F0BF924/5F181B73" Ref="R86"  Part="1" 
F 0 "R86" H 5280 5254 50  0000 R CNN
F 1 "10k" H 5280 5345 50  0000 R CNN
F 2 "Resistor_SMD:R_0402_1005Metric" V 5280 5300 50  0001 C CNN
F 3 "~" H 5350 5300 50  0001 C CNN
F 4 "AVT-IPE" H 5350 5300 50  0001 C CNN "stock"
	1    5350 5300
	1    0    0    1   
$EndComp
Wire Wire Line
	5700 5450 5700 5750
Wire Wire Line
	5700 5050 5700 5100
Wire Wire Line
	5350 5100 5350 5150
Connection ~ 5700 5100
Wire Wire Line
	5700 5100 5700 5150
Wire Wire Line
	5350 5450 5350 5550
$Comp
L Device:R R?
U 1 1 5F1863B6
P 6050 5300
AR Path="/5F4D38EE/5F1863B6" Ref="R?"  Part="1" 
AR Path="/5EF3A6EF/5F1863B6" Ref="R?"  Part="1" 
AR Path="/5F0BF924/5F1863B6" Ref="R90"  Part="1" 
F 0 "R90" H 5980 5209 50  0000 R CNN
F 1 "10k" H 5980 5300 50  0000 R CNN
F 2 "KIT_Resistor_SMD:R_0402_1005Metric_DNP" V 5980 5300 50  0001 C CNN
F 3 "~" H 6050 5300 50  0001 C CNN
F 4 "DNP" H 5980 5391 50  0000 R CNN "DNP"
F 5 "AVT-IPE" H 6050 5300 50  0001 C CNN "stock"
	1    6050 5300
	1    0    0    1   
$EndComp
Wire Wire Line
	6050 5100 6050 5150
Wire Wire Line
	6050 5450 6050 5850
Wire Wire Line
	6050 5100 5700 5100
$Comp
L KIT_Power:+1V8_STBY #PWR?
U 1 1 5F18E551
P 5700 5050
AR Path="/5F28C5AE/5F18E551" Ref="#PWR?"  Part="1" 
AR Path="/5F0BF924/5F18E551" Ref="#PWR?"  Part="1" 
F 0 "#PWR?" H 5700 4900 50  0001 C CNN
F 1 "+1V8_STBY" H 5715 5223 50  0000 C CNN
F 2 "" H 5700 5050 50  0001 C CNN
F 3 "" H 5700 5050 50  0001 C CNN
	1    5700 5050
	-1   0    0    -1  
$EndComp
Connection ~ 5350 5550
Wire Wire Line
	5350 5550 4750 5550
Connection ~ 5700 5750
Wire Wire Line
	5700 5750 4750 5750
Connection ~ 6050 5850
Wire Wire Line
	6050 5850 4750 5850
$Comp
L KIT_Power:+1V8_STBY #PWR?
U 1 1 5F1FDFBB
P 3750 4800
AR Path="/5F28C5AE/5F1FDFBB" Ref="#PWR?"  Part="1" 
AR Path="/5F0BF924/5F1FDFBB" Ref="#PWR?"  Part="1" 
F 0 "#PWR?" H 3750 4650 50  0001 C CNN
F 1 "+1V8_STBY" H 3765 4973 50  0000 C CNN
F 2 "" H 3750 4800 50  0001 C CNN
F 3 "" H 3750 4800 50  0001 C CNN
	1    3750 4800
	-1   0    0    -1  
$EndComp
$Comp
L Connector:Conn_01x02_Male J?
U 1 1 5F233E9A
P 1200 5650
AR Path="/5EF3A6E9/5F233E9A" Ref="J?"  Part="1" 
AR Path="/5F7AC3E6/5F233E9A" Ref="J?"  Part="1" 
AR Path="/5F0BF924/5F233E9A" Ref="J6"  Part="1" 
F 0 "J6" H 1173 5532 50  0000 R CNN
F 1 "Ext_I2C_MO" H 1173 5623 50  0000 R CNN
F 2 "Connector_PinHeader_2.54mm:PinHeader_1x02_P2.54mm_Vertical" H 1200 5650 50  0001 C CNN
F 3 "~" H 1200 5650 50  0001 C CNN
	1    1200 5650
	1    0    0    1   
$EndComp
Text GLabel 1400 5550 2    50   Input ~ 0
MO_SCL
Text GLabel 1400 5650 2    50   BiDi ~ 0
MO_SDA
Wire Wire Line
	4750 5650 6250 5650
Wire Wire Line
	5350 5100 5700 5100
Text Notes 7050 5700 0    50   ~ 0
OE0b -> This pin disables all outputs when held high. This pin is internallypulled low
Text Notes 7050 5850 0    50   ~ 0
IN_SEL[0..1] -> These pins are in-ternally pulled low
Text Notes 2300 6000 0    50   ~ 0
MO_RESET_N is pulled low by default,\n resistors in IPMI sheet
Text GLabel 7250 2500 2    50   Input ~ 0
PMBUS_CONN_RST_B
$Comp
L KIT_Logic_LevelTranslator:SN74AVC1T45DRLR U?
U 1 1 60878E58
P 5200 3700
AR Path="/5DEF958D/60878E58" Ref="U?"  Part="1" 
AR Path="/5FFD078E/60878E58" Ref="U?"  Part="1" 
AR Path="/5F0BF924/60878E58" Ref="U30"  Part="1" 
F 0 "U30" H 5700 3990 60  0000 C CNN
F 1 "SN74AVC1T45DRLR" H 5700 3884 60  0000 C CNN
F 2 "Package_TO_SOT_SMD:SOT-666" H 5750 3300 50  0001 C CNN
F 3 "https://www.ti.com/lit/ds/symlink/sn74avc1t45.pdf" H 5200 3700 50  0001 C CNN
F 4 "296-21022-1-ND" H 5200 3700 50  0001 C CNN "digikey#"
	1    5200 3700
	1    0    0    -1  
$EndComp
Wire Wire Line
	6200 3900 6950 3900
Wire Wire Line
	5200 3800 5100 3800
Wire Wire Line
	5100 3800 5100 4100
$Comp
L power:GND #PWR?
U 1 1 60878E62
P 5100 4100
AR Path="/5DEF958D/60878E62" Ref="#PWR?"  Part="1" 
AR Path="/5FFD078E/60878E62" Ref="#PWR?"  Part="1" 
AR Path="/5F0BF924/60878E62" Ref="#PWR?"  Part="1" 
F 0 "#PWR?" H 5100 3850 50  0001 C CNN
F 1 "GND" H 5105 3927 50  0000 C CNN
F 2 "" H 5100 4100 50  0001 C CNN
F 3 "" H 5100 4100 50  0001 C CNN
	1    5100 4100
	1    0    0    -1  
$EndComp
Wire Wire Line
	6300 3200 6300 3250
Wire Wire Line
	6300 3700 6200 3700
Wire Wire Line
	5200 3700 5100 3700
Wire Wire Line
	5100 3700 5100 3250
$Comp
L KIT_Power:+1V8_STBY #PWR?
U 1 1 60878E6C
P 5100 3200
AR Path="/5DEF958D/60878E6C" Ref="#PWR?"  Part="1" 
AR Path="/5FFD078E/60878E6C" Ref="#PWR?"  Part="1" 
AR Path="/5F0BF924/60878E6C" Ref="#PWR?"  Part="1" 
F 0 "#PWR?" H 5100 3050 50  0001 C CNN
F 1 "+1V8_STBY" H 5115 3373 50  0000 C CNN
F 2 "" H 5100 3200 50  0001 C CNN
F 3 "" H 5100 3200 50  0001 C CNN
	1    5100 3200
	1    0    0    -1  
$EndComp
Wire Wire Line
	6200 3800 6300 3800
Wire Wire Line
	6300 3800 6300 3700
Connection ~ 6300 3700
Text Notes 5500 4150 0    50   ~ 0
A --> B\n
$Comp
L Device:C C?
U 1 1 60878E76
P 4700 3450
AR Path="/5DEF958D/60878E76" Ref="C?"  Part="1" 
AR Path="/5FFD078E/60878E76" Ref="C?"  Part="1" 
AR Path="/5F0BF924/60878E76" Ref="C305"  Part="1" 
F 0 "C305" H 4815 3496 50  0000 L CNN
F 1 "0.1uF" H 4815 3405 50  0000 L CNN
F 2 "Capacitor_SMD:C_0402_1005Metric" H 4738 3300 50  0001 C CNN
F 3 "~" H 4700 3450 50  0001 C CNN
F 4 "16 V" H 4700 3450 50  0001 C CNN "info"
F 5 "AVT-IPE" H 4700 3450 50  0001 C CNN "stock"
	1    4700 3450
	1    0    0    -1  
$EndComp
$Comp
L power:GND #PWR?
U 1 1 60878E7C
P 4700 3600
AR Path="/5DEF958D/60878E7C" Ref="#PWR?"  Part="1" 
AR Path="/5FFD078E/60878E7C" Ref="#PWR?"  Part="1" 
AR Path="/5F0BF924/60878E7C" Ref="#PWR?"  Part="1" 
F 0 "#PWR?" H 4700 3350 50  0001 C CNN
F 1 "GND" H 4705 3427 50  0000 C CNN
F 2 "" H 4700 3600 50  0001 C CNN
F 3 "" H 4700 3600 50  0001 C CNN
	1    4700 3600
	1    0    0    -1  
$EndComp
$Comp
L Device:C C?
U 1 1 60878E82
P 6600 3500
AR Path="/5DEF958D/60878E82" Ref="C?"  Part="1" 
AR Path="/5FFD078E/60878E82" Ref="C?"  Part="1" 
AR Path="/5F0BF924/60878E82" Ref="C306"  Part="1" 
F 0 "C306" H 6715 3546 50  0000 L CNN
F 1 "0.1uF" H 6715 3455 50  0000 L CNN
F 2 "Capacitor_SMD:C_0402_1005Metric" H 6638 3350 50  0001 C CNN
F 3 "~" H 6600 3500 50  0001 C CNN
F 4 "16 V" H 6600 3500 50  0001 C CNN "info"
F 5 "AVT-IPE" H 6600 3500 50  0001 C CNN "stock"
	1    6600 3500
	1    0    0    -1  
$EndComp
$Comp
L power:GND #PWR?
U 1 1 60878E88
P 6600 3650
AR Path="/5DEF958D/60878E88" Ref="#PWR?"  Part="1" 
AR Path="/5FFD078E/60878E88" Ref="#PWR?"  Part="1" 
AR Path="/5F0BF924/60878E88" Ref="#PWR?"  Part="1" 
F 0 "#PWR?" H 6600 3400 50  0001 C CNN
F 1 "GND" H 6605 3477 50  0000 C CNN
F 2 "" H 6600 3650 50  0001 C CNN
F 3 "" H 6600 3650 50  0001 C CNN
	1    6600 3650
	1    0    0    -1  
$EndComp
Wire Wire Line
	4700 3300 4700 3250
Wire Wire Line
	4700 3250 5100 3250
Connection ~ 5100 3250
Wire Wire Line
	5100 3250 5100 3200
Wire Wire Line
	6600 3350 6600 3250
Wire Wire Line
	6600 3250 6300 3250
Connection ~ 6300 3250
Wire Wire Line
	6300 3250 6300 3700
$Comp
L KIT_Power:+3V3_STBY #PWR?
U 1 1 60878E96
P 6300 3200
AR Path="/5DEF958D/60878E96" Ref="#PWR?"  Part="1" 
AR Path="/5FFD078E/60878E96" Ref="#PWR?"  Part="1" 
AR Path="/5F0BF924/60878E96" Ref="#PWR?"  Part="1" 
F 0 "#PWR?" H 6300 3050 50  0001 C CNN
F 1 "+3V3_STBY" H 6315 3373 50  0000 C CNN
F 2 "" H 6300 3200 50  0001 C CNN
F 3 "" H 6300 3200 50  0001 C CNN
	1    6300 3200
	1    0    0    -1  
$EndComp
Wire Wire Line
	3500 3900 3500 2200
Wire Wire Line
	3500 3900 5200 3900
Connection ~ 3500 2200
Wire Wire Line
	3500 2200 3950 2200
Wire Wire Line
	7250 2500 6950 2500
Wire Wire Line
	6950 2500 6950 3900
$Comp
L Device:R R?
U 1 1 5FDE6403
P 2400 2700
AR Path="/5F28C5AE/5FDE6403" Ref="R?"  Part="1" 
AR Path="/5F0BF924/5FDE6403" Ref="R174"  Part="1" 
F 0 "R174" H 2330 2654 50  0000 R CNN
F 1 "0" H 2330 2745 50  0000 R CNN
F 2 "Resistor_SMD:R_0402_1005Metric" V 2330 2700 50  0001 C CNN
F 3 "~" H 2400 2700 50  0001 C CNN
F 4 "AVT-IPE" H 2400 2700 50  0001 C CNN "stock"
	1    2400 2700
	-1   0    0    1   
$EndComp
$Comp
L KIT_Power:+1V8_STBY #PWR?
U 1 1 5F135AC8
P 2900 1300
AR Path="/5F28C5AE/5F135AC8" Ref="#PWR?"  Part="1" 
AR Path="/5F0BF924/5F135AC8" Ref="#PWR?"  Part="1" 
F 0 "#PWR?" H 2900 1150 50  0001 C CNN
F 1 "+1V8_STBY" H 2915 1473 50  0000 C CNN
F 2 "" H 2900 1300 50  0001 C CNN
F 3 "" H 2900 1300 50  0001 C CNN
	1    2900 1300
	-1   0    0    -1  
$EndComp
$Comp
L KIT_Power:+3V3_STBY #PWR?
U 1 1 5FDEA96B
P 2250 1300
AR Path="/5F4D38EE/5FDEA96B" Ref="#PWR?"  Part="1" 
AR Path="/5EF3A6EF/5FDEA96B" Ref="#PWR?"  Part="1" 
AR Path="/5F0BF924/5FDEA96B" Ref="#PWR?"  Part="1" 
F 0 "#PWR?" H 2250 1150 50  0001 C CNN
F 1 "+3V3_STBY" H 2265 1473 50  0000 C CNN
F 2 "" H 2250 1300 50  0001 C CNN
F 3 "" H 2250 1300 50  0001 C CNN
	1    2250 1300
	-1   0    0    -1  
$EndComp
$Comp
L Device:R R?
U 1 1 5FE0DFC4
P 2400 1550
AR Path="/5EB76D90/5FE0DFC4" Ref="R?"  Part="1" 
AR Path="/5F0BF924/5FE0DFC4" Ref="R173"  Part="1" 
F 0 "R173" H 2470 1641 50  0000 L CNN
F 1 "0" H 2470 1550 50  0000 L CNN
F 2 "KIT_Resistor_SMD:R_0402_1005Metric_DNP" V 2330 1550 50  0001 C CNN
F 3 "~" H 2400 1550 50  0001 C CNN
F 4 "AVT-IPE" H 2400 1550 50  0001 C CNN "stock"
F 5 "DNP" H 2470 1459 50  0000 L CNN "DNP"
	1    2400 1550
	1    0    0    -1  
$EndComp
$Comp
L Device:R R?
U 1 1 5FE155E6
P 2100 1550
AR Path="/5EB76D90/5FE155E6" Ref="R?"  Part="1" 
AR Path="/5F0BF924/5FE155E6" Ref="R171"  Part="1" 
F 0 "R171" H 2170 1641 50  0000 L CNN
F 1 "0" H 2170 1550 50  0000 L CNN
F 2 "KIT_Resistor_SMD:R_0402_1005Metric_DNP" V 2030 1550 50  0001 C CNN
F 3 "~" H 2100 1550 50  0001 C CNN
F 4 "AVT-IPE" H 2100 1550 50  0001 C CNN "stock"
F 5 "DNP" H 2170 1459 50  0000 L CNN "DNP"
	1    2100 1550
	1    0    0    -1  
$EndComp
Wire Wire Line
	3950 2400 2400 2400
Wire Wire Line
	2400 1700 2400 2400
Connection ~ 2400 2400
Wire Wire Line
	2400 2400 2400 2550
Wire Wire Line
	2400 1400 2400 1350
Wire Wire Line
	2400 1350 2250 1350
Wire Wire Line
	2100 1350 2100 1400
Wire Wire Line
	2250 1300 2250 1350
Connection ~ 2250 1350
Wire Wire Line
	2250 1350 2100 1350
Wire Wire Line
	2100 1700 2100 2300
Wire Wire Line
	2100 2300 3950 2300
$Comp
L power:GND #PWR?
U 1 1 5FE3B343
P 2100 2850
F 0 "#PWR?" H 2100 2600 50  0001 C CNN
F 1 "GND" H 2105 2677 50  0000 C CNN
F 2 "" H 2100 2850 50  0001 C CNN
F 3 "" H 2100 2850 50  0001 C CNN
	1    2100 2850
	1    0    0    -1  
$EndComp
$Comp
L Device:R R?
U 1 1 5FE3B34A
P 2100 2700
AR Path="/5F28C5AE/5FE3B34A" Ref="R?"  Part="1" 
AR Path="/5F0BF924/5FE3B34A" Ref="R172"  Part="1" 
F 0 "R172" H 2030 2654 50  0000 R CNN
F 1 "0" H 2030 2745 50  0000 R CNN
F 2 "Resistor_SMD:R_0402_1005Metric" V 2030 2700 50  0001 C CNN
F 3 "~" H 2100 2700 50  0001 C CNN
F 4 "AVT-IPE" H 2100 2700 50  0001 C CNN "stock"
	1    2100 2700
	-1   0    0    1   
$EndComp
Wire Wire Line
	2100 2550 2100 2300
Connection ~ 2100 2300
Wire Notes Line
	9100 1650 10750 1650
Wire Notes Line
	10750 1650 10750 3300
Wire Notes Line
	10750 3300 9100 3300
Wire Notes Line
	9100 3300 9100 1650
Wire Notes Line
	7150 2100 8650 2100
Wire Notes Line
	8650 2100 8650 3500
Wire Notes Line
	8650 3500 7150 3500
Wire Notes Line
	7150 3500 7150 2100
$EndSCHEMATC
