EESchema Schematic File Version 4
EELAYER 30 0
EELAYER END
$Descr A3 16535 11693
encoding utf-8
Sheet 14 28
Title "ZynqMP Mezzanine FMC+ (BuZZyBoard)"
Date "2020-10-02"
Rev "1.0"
Comp "Karlsruhe Institute of Technology (KIT)"
Comment1 "Institute for Data Processing and Electronics (IPE)"
Comment2 "Luis Ardila"
Comment3 ""
Comment4 ""
$EndDescr
$Comp
L Interface_Ethernet:KSZ9031RNXCA U44
U 1 1 5EBCD9B8
P 8900 5900
F 0 "U44" H 10000 4350 50  0000 C CNN
F 1 "KSZ9031RNXCA" H 8000 4350 50  0000 C CNN
F 2 "KIT_Package_DFN_QFN:KSZ9031RNXCA_QFN-48-1EP_7x7mm_P0.5mm_EP5.15x5.15mm_ThermalVias" H 9350 4350 50  0001 L CNN
F 3 "https://ww1.microchip.com/downloads/en/DeviceDoc/00002117F.pdf" H 8900 4250 50  0001 C CNN
F 4 " 177-3847" H 8900 5900 50  0001 C CNN "rs#"
F 5 "KSZ9031RNXCA" H 8900 5900 50  0001 C CNN "manf#"
F 6 "Microchip Technology" H 8900 5900 50  0001 C CNN "manf"
F 7 "576-4040-ND" H 8900 5900 50  0001 C CNN "digikey#"
	1    8900 5900
	1    0    0    -1  
$EndComp
Text GLabel 10400 6600 2    50   BiDi ~ 0
GBE_A_N
Text GLabel 10400 6300 2    50   BiDi ~ 0
GBE_B_N
Text GLabel 10400 6000 2    50   BiDi ~ 0
GBE_C_N
Text GLabel 10400 5700 2    50   BiDi ~ 0
GBE_D_N
Text GLabel 10400 6700 2    50   BiDi ~ 0
GBE_A_P
Text GLabel 10400 6400 2    50   BiDi ~ 0
GBE_B_P
Text GLabel 10400 6100 2    50   BiDi ~ 0
GBE_C_P
Text GLabel 10400 5800 2    50   BiDi ~ 0
GBE_D_P
Wire Wire Line
	10400 5700 10200 5700
Wire Wire Line
	10400 5800 10200 5800
Wire Wire Line
	10400 6000 10200 6000
Wire Wire Line
	10400 6100 10200 6100
Wire Wire Line
	10400 6300 10200 6300
Wire Wire Line
	10400 6400 10200 6400
Wire Wire Line
	10400 6600 10200 6600
Wire Wire Line
	10400 6700 10200 6700
Wire Wire Line
	3650 5300 7600 5300
Wire Wire Line
	3650 5400 7600 5400
Wire Wire Line
	3650 5500 7600 5500
Wire Wire Line
	3650 5600 7600 5600
Wire Wire Line
	4750 5700 7600 5700
Text Label 3650 6000 0    50   ~ 0
RGMII_RX_D0
Text Label 3650 6100 0    50   ~ 0
RGMII_RX_D1
Text Label 3650 6200 0    50   ~ 0
RGMII_RX_D2
Text Label 3650 6300 0    50   ~ 0
RGMII_RX_D3
Text GLabel 4750 6400 0    50   Output ~ 0
RGMII_RX_CLK
Text GLabel 4750 5900 0    50   Output ~ 0
RGMII_RX_CTL
Entry Wire Line
	3650 6300 3550 6200
Entry Wire Line
	3650 6200 3550 6100
Entry Wire Line
	3650 6100 3550 6000
Entry Wire Line
	3650 6000 3550 5900
Wire Bus Line
	3550 5900 3450 5900
Text GLabel 3450 5900 0    50   Output ~ 0
RGMII_RX_D[0..3]
Text Label 3650 5300 0    50   ~ 0
RGMII_TX_D0
Text Label 3650 5400 0    50   ~ 0
RGMII_TX_D1
Text Label 3650 5500 0    50   ~ 0
RGMII_TX_D2
Text Label 3650 5600 0    50   ~ 0
RGMII_TX_D3
Text GLabel 4750 5700 0    50   Input ~ 0
RGMII_TX_CLK
Entry Wire Line
	3650 5600 3550 5500
Entry Wire Line
	3650 5500 3550 5400
Entry Wire Line
	3650 5400 3550 5300
Entry Wire Line
	3650 5300 3550 5200
Wire Bus Line
	3550 5200 3450 5200
Text GLabel 3450 5200 0    50   Input ~ 0
RGMII_TX_D[0..3]
Text Label 10350 7000 2    50   ~ 0
XI
Text Label 10350 7100 2    50   ~ 0
XO
$Comp
L Device:R R141
U 1 1 5EC2D651
P 4050 4500
F 0 "R141" H 4120 4546 50  0000 L CNN
F 1 "10k" H 4120 4455 50  0000 L CNN
F 2 "Resistor_SMD:R_0402_1005Metric" V 3980 4500 50  0001 C CNN
F 3 "~" H 4050 4500 50  0001 C CNN
F 4 "AVT-IPE" H 4050 4500 50  0001 C CNN "stock"
	1    4050 4500
	1    0    0    -1  
$EndComp
$Comp
L Device:R R142
U 1 1 5EC2D661
P 4350 4500
F 0 "R142" H 4420 4591 50  0000 L CNN
F 1 "10k" H 4420 4500 50  0000 L CNN
F 2 "KIT_Resistor_SMD:R_0402_1005Metric_DNP" V 4280 4500 50  0001 C CNN
F 3 "~" H 4350 4500 50  0001 C CNN
F 4 "AVT-IPE" H 4350 4500 50  0001 C CNN "stock"
F 5 "DNP" H 4420 4409 50  0000 L CNN "DNP"
	1    4350 4500
	1    0    0    -1  
$EndComp
Wire Wire Line
	4350 4650 4350 4900
Wire Wire Line
	4350 4250 4350 4350
Wire Wire Line
	4050 4350 4050 4250
Wire Wire Line
	4050 4200 4050 4250
Wire Wire Line
	4050 4650 4050 5000
$Comp
L Device:R R160
U 1 1 5EC4CE4B
P 9300 7800
F 0 "R160" H 9230 7709 50  0000 R CNN
F 1 "12.1k" H 9230 7800 50  0000 R CNN
F 2 "Resistor_SMD:R_0402_1005Metric" V 9230 7800 50  0001 C CNN
F 3 "~" H 9300 7800 50  0001 C CNN
F 4 "1%" H 9230 7891 50  0000 R CNN "info"
	1    9300 7800
	-1   0    0    1   
$EndComp
Wire Wire Line
	9300 7650 9300 7500
$Comp
L power:GND #PWR?
U 1 1 5EC4E3FC
P 9300 8100
F 0 "#PWR?" H 9300 7850 50  0001 C CNN
F 1 "GND" H 9305 7927 50  0000 C CNN
F 2 "" H 9300 8100 50  0001 C CNN
F 3 "" H 9300 8100 50  0001 C CNN
	1    9300 8100
	1    0    0    -1  
$EndComp
Wire Wire Line
	9300 8100 9300 7950
Text Label 4650 6700 0    50   ~ 0
LED1
Wire Wire Line
	4650 6700 7600 6700
Text Label 4650 6600 0    50   ~ 0
LED2
Wire Wire Line
	4650 6600 7600 6600
$Comp
L Device:LED D10
U 1 1 5ECC8D34
P 15100 4900
F 0 "D10" V 15139 4783 50  0000 R CNN
F 1 "GRN" V 15048 4783 50  0000 R CNN
F 2 "LED_SMD:LED_0603_1608Metric" H 15100 4900 50  0001 C CNN
F 3 "~" H 15100 4900 50  0001 C CNN
F 4 "HSME-C191" H 15100 4900 50  0001 C CNN "manf#"
F 5 "Broadcom" H 15100 4900 50  0001 C CNN "manf"
F 6 "" H 15100 4900 50  0001 C CNN "stock"
F 7 "691-0408" H 15100 4900 50  0001 C CNN "rs#"
	1    15100 4900
	0    -1   -1   0   
$EndComp
$Comp
L power:GND #PWR?
U 1 1 5ECC8D3A
P 15100 5600
F 0 "#PWR?" H 15100 5350 50  0001 C CNN
F 1 "GND" H 15105 5427 50  0000 C CNN
F 2 "" H 15100 5600 50  0001 C CNN
F 3 "" H 15100 5600 50  0001 C CNN
	1    15100 5600
	1    0    0    -1  
$EndComp
Text Label 14250 5150 0    50   ~ 0
LED1
$Comp
L KIT_Power:+3V3_STBY #PWR?
U 1 1 5ECC8D55
P 15100 4700
F 0 "#PWR?" H 15100 4550 50  0001 C CNN
F 1 "+3V3_STBY" H 15115 4873 50  0000 C CNN
F 2 "" H 15100 4700 50  0001 C CNN
F 3 "" H 15100 4700 50  0001 C CNN
	1    15100 4700
	1    0    0    -1  
$EndComp
Wire Wire Line
	15100 4750 15100 4700
$Comp
L Device:R R161
U 1 1 5ECC8D5F
P 15100 5400
F 0 "R161" H 15169 5354 50  0000 L CNN
F 1 "2k" H 15169 5445 50  0000 L CNN
F 2 "Resistor_SMD:R_0402_1005Metric" V 15030 5400 50  0001 C CNN
F 3 "~" H 15100 5400 50  0001 C CNN
F 4 "" V 15100 5400 50  0001 C CNN "manf"
F 5 "" V 15100 5400 50  0001 C CNN "manf#"
F 6 "AVT-IPE" V 15100 5400 50  0001 C CNN "stock"
	1    15100 5400
	-1   0    0    1   
$EndComp
$Comp
L Device:LED D11
U 1 1 5ECD7B24
P 15100 7050
F 0 "D11" V 15139 6933 50  0000 R CNN
F 1 "GRN" V 15048 6933 50  0000 R CNN
F 2 "LED_SMD:LED_0603_1608Metric" H 15100 7050 50  0001 C CNN
F 3 "~" H 15100 7050 50  0001 C CNN
F 4 "HSME-C191" H 15100 7050 50  0001 C CNN "manf#"
F 5 "Broadcom" H 15100 7050 50  0001 C CNN "manf"
F 6 "" H 15100 7050 50  0001 C CNN "stock"
F 7 "691-0408" H 15100 7050 50  0001 C CNN "rs#"
	1    15100 7050
	0    -1   -1   0   
$EndComp
$Comp
L power:GND #PWR?
U 1 1 5ECD7B2A
P 15100 7750
F 0 "#PWR?" H 15100 7500 50  0001 C CNN
F 1 "GND" H 15105 7577 50  0000 C CNN
F 2 "" H 15100 7750 50  0001 C CNN
F 3 "" H 15100 7750 50  0001 C CNN
	1    15100 7750
	1    0    0    -1  
$EndComp
Text Label 14250 7300 0    50   ~ 0
LED2
$Comp
L KIT_Power:+3V3_STBY #PWR?
U 1 1 5ECD7B45
P 15100 6850
F 0 "#PWR?" H 15100 6700 50  0001 C CNN
F 1 "+3V3_STBY" H 15115 7023 50  0000 C CNN
F 2 "" H 15100 6850 50  0001 C CNN
F 3 "" H 15100 6850 50  0001 C CNN
	1    15100 6850
	1    0    0    -1  
$EndComp
Wire Wire Line
	15100 6900 15100 6850
$Comp
L Device:R R162
U 1 1 5ECD7B4F
P 15100 7550
F 0 "R162" H 15169 7504 50  0000 L CNN
F 1 "2k" H 15169 7595 50  0000 L CNN
F 2 "Resistor_SMD:R_0402_1005Metric" V 15030 7550 50  0001 C CNN
F 3 "~" H 15100 7550 50  0001 C CNN
F 4 "" V 15100 7550 50  0001 C CNN "manf"
F 5 "" V 15100 7550 50  0001 C CNN "manf#"
F 6 "AVT-IPE" V 15100 7550 50  0001 C CNN "stock"
	1    15100 7550
	-1   0    0    1   
$EndComp
$Comp
L power:GND #PWR?
U 1 1 5ECE54C7
P 8900 8100
F 0 "#PWR?" H 8900 7850 50  0001 C CNN
F 1 "GND" H 8905 7927 50  0000 C CNN
F 2 "" H 8900 8100 50  0001 C CNN
F 3 "" H 8900 8100 50  0001 C CNN
	1    8900 8100
	1    0    0    -1  
$EndComp
Wire Wire Line
	8900 8100 8900 7650
Wire Wire Line
	8900 7650 9000 7650
Wire Wire Line
	9000 7650 9000 7500
Wire Wire Line
	8900 7500 8900 7650
Connection ~ 8900 7650
NoConn ~ 10200 5100
$Comp
L power:GND #PWR?
U 1 1 5ED30EDB
P 3100 2050
F 0 "#PWR?" H 3100 1800 50  0001 C CNN
F 1 "GND" H 3105 1877 50  0000 C CNN
F 2 "" H 3100 2050 50  0001 C CNN
F 3 "" H 3100 2050 50  0001 C CNN
	1    3100 2050
	1    0    0    -1  
$EndComp
Wire Wire Line
	3100 1600 3250 1600
Wire Wire Line
	3250 1650 3250 1600
Connection ~ 3250 1600
Wire Wire Line
	3250 1600 3850 1600
Wire Wire Line
	3850 2000 3250 2000
Wire Wire Line
	3250 2000 3250 1950
Wire Wire Line
	3100 2000 3100 2050
Wire Wire Line
	3850 1950 3850 2000
Wire Wire Line
	3850 1600 3850 1650
$Comp
L Device:C C226
U 1 1 5ED30EF4
P 3850 1800
F 0 "C226" H 3735 1846 50  0000 R CNN
F 1 "0.1uF" H 3735 1755 50  0000 R CNN
F 2 "Capacitor_SMD:C_0402_1005Metric" H 3888 1650 50  0001 C CNN
F 3 "~" H 3850 1800 50  0001 C CNN
F 4 "16 V" H 3850 1800 50  0001 C CNN "info"
F 5 "AVT-IPE" H 3850 1800 50  0001 C CNN "stock"
	1    3850 1800
	-1   0    0    -1  
$EndComp
Wire Wire Line
	3850 1600 4450 1600
Wire Wire Line
	4450 2000 3850 2000
Wire Wire Line
	4450 1950 4450 2000
Wire Wire Line
	4450 1600 4450 1650
$Comp
L Device:C C230
U 1 1 5ED30F00
P 4450 1800
F 0 "C230" H 4335 1846 50  0000 R CNN
F 1 "0.1uF" H 4335 1755 50  0000 R CNN
F 2 "Capacitor_SMD:C_0402_1005Metric" H 4488 1650 50  0001 C CNN
F 3 "~" H 4450 1800 50  0001 C CNN
F 4 "16 V" H 4450 1800 50  0001 C CNN "info"
F 5 "AVT-IPE" H 4450 1800 50  0001 C CNN "stock"
	1    4450 1800
	-1   0    0    -1  
$EndComp
Connection ~ 3850 1600
Connection ~ 3850 2000
Wire Wire Line
	3100 1550 3100 1600
Wire Wire Line
	3250 2000 3100 2000
Connection ~ 3250 2000
$Comp
L KIT_Power:+3V3_STBY #PWR?
U 1 1 5ED422E2
P 8500 4000
F 0 "#PWR?" H 8500 3850 50  0001 C CNN
F 1 "+3V3_STBY" H 8515 4173 50  0000 C CNN
F 2 "" H 8500 4000 50  0001 C CNN
F 3 "" H 8500 4000 50  0001 C CNN
	1    8500 4000
	1    0    0    -1  
$EndComp
$Comp
L power:GND #PWR?
U 1 1 5ED4B905
P 5100 2050
F 0 "#PWR?" H 5100 1800 50  0001 C CNN
F 1 "GND" H 5105 1877 50  0000 C CNN
F 2 "" H 5100 2050 50  0001 C CNN
F 3 "" H 5100 2050 50  0001 C CNN
	1    5100 2050
	1    0    0    -1  
$EndComp
Wire Wire Line
	5100 1600 5250 1600
Wire Wire Line
	5250 1650 5250 1600
Connection ~ 5250 1600
Wire Wire Line
	5250 1600 5850 1600
Wire Wire Line
	5850 2000 5250 2000
Wire Wire Line
	5250 2000 5250 1950
Wire Wire Line
	5100 2000 5100 2050
Wire Wire Line
	5850 1950 5850 2000
Wire Wire Line
	5850 1600 5850 1650
$Comp
L Device:C C262
U 1 1 5ED4B91E
P 5850 1800
F 0 "C262" H 5735 1846 50  0000 R CNN
F 1 "0.1uF" H 5735 1755 50  0000 R CNN
F 2 "Capacitor_SMD:C_0402_1005Metric" H 5888 1650 50  0001 C CNN
F 3 "~" H 5850 1800 50  0001 C CNN
F 4 "16 V" H 5850 1800 50  0001 C CNN "info"
F 5 "AVT-IPE" H 5850 1800 50  0001 C CNN "stock"
	1    5850 1800
	-1   0    0    -1  
$EndComp
$Comp
L Device:C C256
U 1 1 5ED4B92A
P 5250 1800
F 0 "C256" H 5135 1846 50  0000 R CNN
F 1 "0.1uF" H 5135 1755 50  0000 R CNN
F 2 "Capacitor_SMD:C_0402_1005Metric" H 5288 1650 50  0001 C CNN
F 3 "~" H 5250 1800 50  0001 C CNN
F 4 "16 V" H 5250 1800 50  0001 C CNN "info"
F 5 "AVT-IPE" H 5250 1800 50  0001 C CNN "stock"
	1    5250 1800
	-1   0    0    -1  
$EndComp
$Comp
L KIT_Power:+3V3_STBY #PWR?
U 1 1 5ED4B932
P 5100 1550
F 0 "#PWR?" H 5100 1400 50  0001 C CNN
F 1 "+3V3_STBY" H 5115 1723 50  0000 C CNN
F 2 "" H 5100 1550 50  0001 C CNN
F 3 "" H 5100 1550 50  0001 C CNN
	1    5100 1550
	1    0    0    -1  
$EndComp
Wire Wire Line
	5100 1550 5100 1600
Wire Wire Line
	5250 2000 5100 2000
Connection ~ 5250 2000
$Comp
L power:GND #PWR?
U 1 1 5ED55F89
P 6450 2050
F 0 "#PWR?" H 6450 1800 50  0001 C CNN
F 1 "GND" H 6455 1877 50  0000 C CNN
F 2 "" H 6450 2050 50  0001 C CNN
F 3 "" H 6450 2050 50  0001 C CNN
	1    6450 2050
	1    0    0    -1  
$EndComp
Wire Wire Line
	6450 1600 6600 1600
Wire Wire Line
	6600 1650 6600 1600
Connection ~ 6600 1600
Wire Wire Line
	6600 1600 7200 1600
Wire Wire Line
	7200 2000 6600 2000
Wire Wire Line
	6600 2000 6600 1950
Wire Wire Line
	6450 2000 6450 2050
Wire Wire Line
	7200 1950 7200 2000
Wire Wire Line
	7200 1600 7200 1650
$Comp
L Device:C C264
U 1 1 5ED55FA2
P 7200 1800
F 0 "C264" H 7085 1846 50  0000 R CNN
F 1 "0.1uF" H 7085 1755 50  0000 R CNN
F 2 "Capacitor_SMD:C_0402_1005Metric" H 7238 1650 50  0001 C CNN
F 3 "~" H 7200 1800 50  0001 C CNN
F 4 "16 V" H 7200 1800 50  0001 C CNN "info"
F 5 "AVT-IPE" H 7200 1800 50  0001 C CNN "stock"
	1    7200 1800
	-1   0    0    -1  
$EndComp
Wire Wire Line
	7200 1600 7800 1600
Wire Wire Line
	7800 2000 7200 2000
Wire Wire Line
	7800 1950 7800 2000
Wire Wire Line
	7800 1600 7800 1650
$Comp
L Device:C C265
U 1 1 5ED55FAE
P 7800 1800
F 0 "C265" H 7685 1846 50  0000 R CNN
F 1 "0.1uF" H 7685 1755 50  0000 R CNN
F 2 "Capacitor_SMD:C_0402_1005Metric" H 7838 1650 50  0001 C CNN
F 3 "~" H 7800 1800 50  0001 C CNN
F 4 "16 V" H 7800 1800 50  0001 C CNN "info"
F 5 "AVT-IPE" H 7800 1800 50  0001 C CNN "stock"
	1    7800 1800
	-1   0    0    -1  
$EndComp
Connection ~ 7200 1600
Connection ~ 7200 2000
Wire Wire Line
	6450 1550 6450 1600
Wire Wire Line
	6600 2000 6450 2000
Connection ~ 6600 2000
Wire Wire Line
	8400 1650 8400 1600
Wire Wire Line
	8400 1600 9000 1600
Wire Wire Line
	9000 2000 8400 2000
Wire Wire Line
	8400 2000 8400 1950
Wire Wire Line
	9000 1950 9000 2000
Wire Wire Line
	9000 1600 9000 1650
$Comp
L Device:C C267
U 1 1 5ED5AD70
P 8400 1800
F 0 "C267" H 8285 1846 50  0000 R CNN
F 1 "0.1uF" H 8285 1755 50  0000 R CNN
F 2 "Capacitor_SMD:C_0402_1005Metric" H 8438 1650 50  0001 C CNN
F 3 "~" H 8400 1800 50  0001 C CNN
F 4 "16 V" H 8400 1800 50  0001 C CNN "info"
F 5 "AVT-IPE" H 8400 1800 50  0001 C CNN "stock"
	1    8400 1800
	-1   0    0    -1  
$EndComp
$Comp
L Device:C C268
U 1 1 5ED5AD7C
P 9000 1800
F 0 "C268" H 8885 1846 50  0000 R CNN
F 1 "0.1uF" H 8885 1755 50  0000 R CNN
F 2 "Capacitor_SMD:C_0402_1005Metric" H 9038 1650 50  0001 C CNN
F 3 "~" H 9000 1800 50  0001 C CNN
F 4 "16 V" H 9000 1800 50  0001 C CNN "info"
F 5 "AVT-IPE" H 9000 1800 50  0001 C CNN "stock"
	1    9000 1800
	-1   0    0    -1  
$EndComp
Wire Wire Line
	7800 1600 8400 1600
Wire Wire Line
	7800 2000 8400 2000
$Comp
L Device:C C263
U 1 1 5EDCB262
P 6600 1800
F 0 "C263" H 6485 1846 50  0000 R CNN
F 1 "0.1uF" H 6485 1755 50  0000 R CNN
F 2 "Capacitor_SMD:C_0402_1005Metric" H 6638 1650 50  0001 C CNN
F 3 "~" H 6600 1800 50  0001 C CNN
F 4 "16 V" H 6600 1800 50  0001 C CNN "info"
F 5 "AVT-IPE" H 6600 1800 50  0001 C CNN "stock"
	1    6600 1800
	-1   0    0    -1  
$EndComp
$Comp
L power:GND #PWR?
U 1 1 5EDD79C6
P 10200 2050
F 0 "#PWR?" H 10200 1800 50  0001 C CNN
F 1 "GND" H 10205 1877 50  0000 C CNN
F 2 "" H 10200 2050 50  0001 C CNN
F 3 "" H 10200 2050 50  0001 C CNN
	1    10200 2050
	1    0    0    -1  
$EndComp
Wire Wire Line
	10200 1600 10350 1600
Wire Wire Line
	10350 1650 10350 1600
Connection ~ 10350 1600
Wire Wire Line
	10350 1600 10950 1600
Wire Wire Line
	10950 2000 10350 2000
Wire Wire Line
	10350 2000 10350 1950
Wire Wire Line
	10200 2000 10200 2050
Wire Wire Line
	10950 1950 10950 2000
Wire Wire Line
	10950 1600 10950 1650
$Comp
L Device:C C270
U 1 1 5EDD79D7
P 10950 1800
F 0 "C270" H 10835 1846 50  0000 R CNN
F 1 "0.1uF" H 10835 1755 50  0000 R CNN
F 2 "Capacitor_SMD:C_0402_1005Metric" H 10988 1650 50  0001 C CNN
F 3 "~" H 10950 1800 50  0001 C CNN
F 4 "16 V" H 10950 1800 50  0001 C CNN "info"
F 5 "AVT-IPE" H 10950 1800 50  0001 C CNN "stock"
	1    10950 1800
	-1   0    0    -1  
$EndComp
$Comp
L Device:C C269
U 1 1 5EDD79DF
P 10350 1800
F 0 "C269" H 10235 1846 50  0000 R CNN
F 1 "0.1uF" H 10235 1755 50  0000 R CNN
F 2 "Capacitor_SMD:C_0402_1005Metric" H 10388 1650 50  0001 C CNN
F 3 "~" H 10350 1800 50  0001 C CNN
F 4 "16 V" H 10350 1800 50  0001 C CNN "info"
F 5 "AVT-IPE" H 10350 1800 50  0001 C CNN "stock"
	1    10350 1800
	-1   0    0    -1  
$EndComp
Wire Wire Line
	10200 1550 10200 1600
Wire Wire Line
	10350 2000 10200 2000
Connection ~ 10350 2000
$Comp
L power:GND #PWR?
U 1 1 5EDE1D19
P 11650 2050
F 0 "#PWR?" H 11650 1800 50  0001 C CNN
F 1 "GND" H 11655 1877 50  0000 C CNN
F 2 "" H 11650 2050 50  0001 C CNN
F 3 "" H 11650 2050 50  0001 C CNN
	1    11650 2050
	1    0    0    -1  
$EndComp
$Comp
L Device:C C271
U 1 1 5EDE1D21
P 11800 1800
F 0 "C271" H 11915 1891 50  0000 L CNN
F 1 "4.7uF" H 11915 1800 50  0000 L CNN
F 2 "Capacitor_SMD:C_0603_1608Metric" H 11838 1650 50  0001 C CNN
F 3 "~" H 11800 1800 50  0001 C CNN
F 4 "25 V" H 11915 1709 50  0000 L CNN "info"
F 5 "AVT-IPE" H 11800 1800 50  0001 C CNN "stock"
	1    11800 1800
	1    0    0    -1  
$EndComp
Wire Wire Line
	11650 1600 11800 1600
Wire Wire Line
	11800 1650 11800 1600
Connection ~ 11800 1600
Wire Wire Line
	11800 1600 12400 1600
Wire Wire Line
	12400 2000 11800 2000
Wire Wire Line
	11800 2000 11800 1950
Wire Wire Line
	11650 2000 11650 2050
Wire Wire Line
	12400 1950 12400 2000
Wire Wire Line
	12400 1600 12400 1650
$Comp
L Device:C C272
U 1 1 5EDE1D32
P 12400 1800
F 0 "C272" H 12285 1846 50  0000 R CNN
F 1 "0.1uF" H 12285 1755 50  0000 R CNN
F 2 "Capacitor_SMD:C_0402_1005Metric" H 12438 1650 50  0001 C CNN
F 3 "~" H 12400 1800 50  0001 C CNN
F 4 "16 V" H 12400 1800 50  0001 C CNN "info"
F 5 "AVT-IPE" H 12400 1800 50  0001 C CNN "stock"
	1    12400 1800
	-1   0    0    -1  
$EndComp
Wire Wire Line
	12400 1600 13000 1600
Wire Wire Line
	13000 2000 12400 2000
Wire Wire Line
	13000 1950 13000 2000
Wire Wire Line
	13000 1600 13000 1650
$Comp
L Device:C C273
U 1 1 5EDE1D3E
P 13000 1800
F 0 "C273" H 12885 1846 50  0000 R CNN
F 1 "0.1uF" H 12885 1755 50  0000 R CNN
F 2 "Capacitor_SMD:C_0402_1005Metric" H 13038 1650 50  0001 C CNN
F 3 "~" H 13000 1800 50  0001 C CNN
F 4 "16 V" H 13000 1800 50  0001 C CNN "info"
F 5 "AVT-IPE" H 13000 1800 50  0001 C CNN "stock"
	1    13000 1800
	-1   0    0    -1  
$EndComp
Connection ~ 12400 1600
Connection ~ 12400 2000
Wire Wire Line
	11800 2000 11650 2000
Connection ~ 11800 2000
$Comp
L Device:C C98
U 1 1 5EDE8E87
P 3250 1800
F 0 "C98" H 3135 1846 50  0000 R CNN
F 1 "0.1uF" H 3135 1755 50  0000 R CNN
F 2 "Capacitor_SMD:C_0402_1005Metric" H 3288 1650 50  0001 C CNN
F 3 "~" H 3250 1800 50  0001 C CNN
F 4 "16 V" H 3250 1800 50  0001 C CNN "info"
F 5 "AVT-IPE" H 3250 1800 50  0001 C CNN "stock"
	1    3250 1800
	-1   0    0    -1  
$EndComp
$Comp
L KIT_Power:+1V2_STBY #PWR?
U 1 1 5EDECB52
P 9050 4000
F 0 "#PWR?" H 9050 3850 50  0001 C CNN
F 1 "+1V2_STBY" H 9065 4173 50  0000 C CNN
F 2 "" H 9050 4000 50  0001 C CNN
F 3 "" H 9050 4000 50  0001 C CNN
	1    9050 4000
	1    0    0    -1  
$EndComp
$Comp
L KIT_Power:+1V2_STBY #PWR?
U 1 1 5EDF359E
P 9550 4000
F 0 "#PWR?" H 9550 3850 50  0001 C CNN
F 1 "+1V2_STBY" H 9565 4173 50  0000 C CNN
F 2 "" H 9550 4000 50  0001 C CNN
F 3 "" H 9550 4000 50  0001 C CNN
	1    9550 4000
	1    0    0    -1  
$EndComp
$Comp
L KIT_Power:+1V2_STBY #PWR?
U 1 1 5EDF9024
P 11150 4000
F 0 "#PWR?" H 11150 3850 50  0001 C CNN
F 1 "+1V2_STBY" H 11165 4173 50  0000 C CNN
F 2 "" H 11150 4000 50  0001 C CNN
F 3 "" H 11150 4000 50  0001 C CNN
	1    11150 4000
	1    0    0    -1  
$EndComp
$Comp
L KIT_Power:+1V2_STBY #PWR?
U 1 1 5EE00B94
P 6450 1550
F 0 "#PWR?" H 6450 1400 50  0001 C CNN
F 1 "+1V2_STBY" H 6465 1723 50  0000 C CNN
F 2 "" H 6450 1550 50  0001 C CNN
F 3 "" H 6450 1550 50  0001 C CNN
	1    6450 1550
	1    0    0    -1  
$EndComp
$Comp
L KIT_Power:+1V2_STBY #PWR?
U 1 1 5EE0665B
P 10200 1550
F 0 "#PWR?" H 10200 1400 50  0001 C CNN
F 1 "+1V2_STBY" H 10215 1723 50  0000 C CNN
F 2 "" H 10200 1550 50  0001 C CNN
F 3 "" H 10200 1550 50  0001 C CNN
	1    10200 1550
	1    0    0    -1  
$EndComp
Wire Wire Line
	9800 4300 9800 4150
Wire Wire Line
	9800 4150 9900 4150
Wire Wire Line
	11150 4000 11150 4150
Wire Wire Line
	11150 4150 10700 4150
Wire Wire Line
	9600 4300 9600 4150
Wire Wire Line
	9600 4150 9550 4150
Wire Wire Line
	9500 4150 9500 4300
Wire Wire Line
	9300 4300 9300 4150
Wire Wire Line
	9300 4150 9200 4150
Wire Wire Line
	8800 4150 8800 4300
Wire Wire Line
	8900 4300 8900 4150
Connection ~ 8900 4150
Wire Wire Line
	8900 4150 8800 4150
Wire Wire Line
	9000 4300 9000 4150
Connection ~ 9000 4150
Wire Wire Line
	9000 4150 8900 4150
Wire Wire Line
	9100 4150 9100 4300
Connection ~ 9100 4150
Wire Wire Line
	9100 4150 9050 4150
Wire Wire Line
	9200 4150 9200 4300
Connection ~ 9200 4150
Wire Wire Line
	9200 4150 9100 4150
Wire Wire Line
	9050 4150 9050 4000
Connection ~ 9050 4150
Wire Wire Line
	9050 4150 9000 4150
Wire Wire Line
	8600 4300 8600 4150
Wire Wire Line
	8600 4150 8500 4150
Wire Wire Line
	8500 4150 8500 4000
Wire Wire Line
	8500 4300 8500 4150
Connection ~ 8500 4150
Wire Wire Line
	8300 4300 8300 4150
Wire Wire Line
	8300 4150 8200 4150
Wire Wire Line
	8050 4150 8050 4000
Wire Wire Line
	8100 4300 8100 4150
Connection ~ 8100 4150
Wire Wire Line
	8100 4150 8050 4150
Wire Wire Line
	8200 4300 8200 4150
Connection ~ 8200 4150
Wire Wire Line
	8200 4150 8100 4150
Wire Wire Line
	9550 4000 9550 4150
Connection ~ 9550 4150
Wire Wire Line
	9550 4150 9500 4150
Wire Wire Line
	4750 5200 7600 5200
$Comp
L Device:R R150
U 1 1 5F18A6FD
P 6200 4500
F 0 "R150" H 6270 4546 50  0000 L CNN
F 1 "10k" H 6270 4455 50  0000 L CNN
F 2 "Resistor_SMD:R_0402_1005Metric" V 6130 4500 50  0001 C CNN
F 3 "~" H 6200 4500 50  0001 C CNN
F 4 "AVT-IPE" H 6200 4500 50  0001 C CNN "stock"
	1    6200 4500
	1    0    0    -1  
$EndComp
$Comp
L Device:R R152
U 1 1 5F18AA72
P 6500 4500
F 0 "R152" H 6570 4546 50  0000 L CNN
F 1 "10k" H 6570 4455 50  0000 L CNN
F 2 "Resistor_SMD:R_0402_1005Metric" V 6430 4500 50  0001 C CNN
F 3 "~" H 6500 4500 50  0001 C CNN
F 4 "AVT-IPE" H 6500 4500 50  0001 C CNN "stock"
	1    6500 4500
	1    0    0    -1  
$EndComp
$Comp
L Device:R R154
U 1 1 5F18ADAF
P 6800 4500
F 0 "R154" H 6870 4546 50  0000 L CNN
F 1 "10k" H 6870 4455 50  0000 L CNN
F 2 "Resistor_SMD:R_0402_1005Metric" V 6730 4500 50  0001 C CNN
F 3 "~" H 6800 4500 50  0001 C CNN
F 4 "AVT-IPE" H 6800 4500 50  0001 C CNN "stock"
	1    6800 4500
	1    0    0    -1  
$EndComp
$Comp
L Device:R R156
U 1 1 5F18B0F0
P 7100 4500
F 0 "R156" H 7170 4546 50  0000 L CNN
F 1 "10k" H 7170 4455 50  0000 L CNN
F 2 "Resistor_SMD:R_0402_1005Metric" V 7030 4500 50  0001 C CNN
F 3 "~" H 7100 4500 50  0001 C CNN
F 4 "AVT-IPE" H 7100 4500 50  0001 C CNN "stock"
	1    7100 4500
	1    0    0    -1  
$EndComp
Wire Wire Line
	7100 4650 7100 6000
Wire Wire Line
	6800 4650 6800 6100
Wire Wire Line
	6500 4650 6500 6200
Wire Wire Line
	6200 4650 6200 6300
Wire Wire Line
	7100 4250 7100 4350
Wire Wire Line
	6800 4350 6800 4250
Connection ~ 6800 4250
Wire Wire Line
	6800 4250 7100 4250
Wire Wire Line
	6500 4250 6500 4350
Wire Wire Line
	6200 4350 6200 4250
$Comp
L Device:R R159
U 1 1 5F1F383B
P 7400 7700
F 0 "R159" H 7470 7746 50  0000 L CNN
F 1 "10k" H 7470 7655 50  0000 L CNN
F 2 "Resistor_SMD:R_0402_1005Metric" V 7330 7700 50  0001 C CNN
F 3 "~" H 7400 7700 50  0001 C CNN
F 4 "AVT-IPE" H 7400 7700 50  0001 C CNN "stock"
	1    7400 7700
	1    0    0    -1  
$EndComp
Wire Wire Line
	7400 4650 7400 5900
Wire Wire Line
	7400 4250 7400 4350
Wire Wire Line
	7100 4250 7400 4250
Connection ~ 7100 4250
Connection ~ 6800 6100
Wire Wire Line
	6800 6100 7600 6100
Connection ~ 7100 6000
Wire Wire Line
	7100 6000 7600 6000
Connection ~ 7400 5900
Wire Wire Line
	7400 5900 7600 5900
Wire Wire Line
	3650 6000 7100 6000
Wire Wire Line
	3650 6100 6800 6100
Wire Wire Line
	4750 5900 7400 5900
$Comp
L Device:R R149
U 1 1 5F239C6F
P 5900 7700
F 0 "R149" H 5970 7746 50  0000 L CNN
F 1 "10k" H 5970 7655 50  0000 L CNN
F 2 "Resistor_SMD:R_0402_1005Metric" V 5830 7700 50  0001 C CNN
F 3 "~" H 5900 7700 50  0001 C CNN
F 4 "AVT-IPE" H 5900 7700 50  0001 C CNN "stock"
	1    5900 7700
	1    0    0    -1  
$EndComp
Wire Wire Line
	5900 4650 5900 6400
Wire Wire Line
	5900 4350 5900 4250
$Comp
L Device:R R146
U 1 1 5F2AFDE4
P 5600 4500
F 0 "R146" H 5530 4454 50  0000 R CNN
F 1 "10k" H 5530 4545 50  0000 R CNN
F 2 "Resistor_SMD:R_0402_1005Metric" V 5530 4500 50  0001 C CNN
F 3 "~" H 5600 4500 50  0001 C CNN
F 4 "AVT-IPE" H 5600 4500 50  0001 C CNN "stock"
	1    5600 4500
	-1   0    0    1   
$EndComp
Text GLabel 4300 7100 0    50   Input ~ 0
RGMII_RSTn
$Comp
L Device:R R144
U 1 1 5EC2D658
P 5300 4500
F 0 "R144" H 5230 4454 50  0000 R CNN
F 1 "10k" H 5230 4545 50  0000 R CNN
F 2 "Resistor_SMD:R_0402_1005Metric" V 5230 4500 50  0001 C CNN
F 3 "~" H 5300 4500 50  0001 C CNN
F 4 "AVT-IPE" H 5300 4500 50  0001 C CNN "stock"
	1    5300 4500
	-1   0    0    1   
$EndComp
$Comp
L Device:R R148
U 1 1 5F3E735D
P 5900 4500
F 0 "R148" H 5970 4591 50  0000 L CNN
F 1 "10k" H 5970 4500 50  0000 L CNN
F 2 "KIT_Resistor_SMD:R_0402_1005Metric_DNP" V 5830 4500 50  0001 C CNN
F 3 "~" H 5900 4500 50  0001 C CNN
F 4 "AVT-IPE" H 5900 4500 50  0001 C CNN "stock"
F 5 "DNP" H 5970 4409 50  0000 L CNN "DNP"
	1    5900 4500
	1    0    0    -1  
$EndComp
Wire Wire Line
	7400 7550 7400 5900
Wire Wire Line
	7100 7550 7100 6000
Wire Wire Line
	6800 7550 6800 6100
Wire Wire Line
	6500 6200 6500 7550
Wire Wire Line
	6200 7550 6200 6300
Wire Wire Line
	5900 7550 5900 6400
$Comp
L Device:R R151
U 1 1 5F4433CD
P 6200 7700
F 0 "R151" H 6270 7791 50  0000 L CNN
F 1 "10k" H 6270 7700 50  0000 L CNN
F 2 "KIT_Resistor_SMD:R_0402_1005Metric_DNP" V 6130 7700 50  0001 C CNN
F 3 "~" H 6200 7700 50  0001 C CNN
F 4 "AVT-IPE" H 6200 7700 50  0001 C CNN "stock"
F 5 "DNP" H 6270 7609 50  0000 L CNN "DNP"
	1    6200 7700
	1    0    0    -1  
$EndComp
$Comp
L Device:R R153
U 1 1 5F450771
P 6500 7700
F 0 "R153" H 6570 7791 50  0000 L CNN
F 1 "10k" H 6570 7700 50  0000 L CNN
F 2 "KIT_Resistor_SMD:R_0402_1005Metric_DNP" V 6430 7700 50  0001 C CNN
F 3 "~" H 6500 7700 50  0001 C CNN
F 4 "AVT-IPE" H 6500 7700 50  0001 C CNN "stock"
F 5 "DNP" H 6570 7609 50  0000 L CNN "DNP"
	1    6500 7700
	1    0    0    -1  
$EndComp
$Comp
L Device:R R155
U 1 1 5F45DAFA
P 6800 7700
F 0 "R155" H 6870 7791 50  0000 L CNN
F 1 "10k" H 6870 7700 50  0000 L CNN
F 2 "KIT_Resistor_SMD:R_0402_1005Metric_DNP" V 6730 7700 50  0001 C CNN
F 3 "~" H 6800 7700 50  0001 C CNN
F 4 "AVT-IPE" H 6800 7700 50  0001 C CNN "stock"
F 5 "DNP" H 6870 7609 50  0000 L CNN "DNP"
	1    6800 7700
	1    0    0    -1  
$EndComp
$Comp
L Device:R R157
U 1 1 5F46ADC9
P 7100 7700
F 0 "R157" H 7170 7791 50  0000 L CNN
F 1 "10k" H 7170 7700 50  0000 L CNN
F 2 "KIT_Resistor_SMD:R_0402_1005Metric_DNP" V 7030 7700 50  0001 C CNN
F 3 "~" H 7100 7700 50  0001 C CNN
F 4 "AVT-IPE" H 7100 7700 50  0001 C CNN "stock"
F 5 "DNP" H 7170 7609 50  0000 L CNN "DNP"
	1    7100 7700
	1    0    0    -1  
$EndComp
$Comp
L Device:R R158
U 1 1 5F477F8D
P 7400 4500
F 0 "R158" H 7470 4591 50  0000 L CNN
F 1 "10k" H 7470 4500 50  0000 L CNN
F 2 "KIT_Resistor_SMD:R_0402_1005Metric_DNP" V 7330 4500 50  0001 C CNN
F 3 "~" H 7400 4500 50  0001 C CNN
F 4 "AVT-IPE" H 7400 4500 50  0001 C CNN "stock"
F 5 "DNP" H 7470 4409 50  0000 L CNN "DNP"
	1    7400 4500
	1    0    0    -1  
$EndComp
Connection ~ 6500 4250
Wire Wire Line
	6500 4250 6800 4250
Connection ~ 6500 6200
Wire Wire Line
	6500 6200 7600 6200
Wire Wire Line
	3650 6200 6500 6200
Connection ~ 6200 4250
Wire Wire Line
	6200 4250 6500 4250
Connection ~ 6200 6300
Wire Wire Line
	6200 6300 7600 6300
Connection ~ 5900 4250
Wire Wire Line
	5900 4250 6200 4250
Connection ~ 5900 6400
Wire Wire Line
	5900 6400 7600 6400
Wire Wire Line
	3650 6300 6200 6300
Wire Wire Line
	4750 6400 5900 6400
$Comp
L Device:R R143
U 1 1 5F62AD66
P 5000 4500
F 0 "R143" H 4930 4454 50  0000 R CNN
F 1 "10k" H 4930 4545 50  0000 R CNN
F 2 "Resistor_SMD:R_0402_1005Metric" V 4930 4500 50  0001 C CNN
F 3 "~" H 5000 4500 50  0001 C CNN
F 4 "AVT-IPE" H 5000 4500 50  0001 C CNN "stock"
	1    5000 4500
	-1   0    0    1   
$EndComp
Connection ~ 4350 4250
Wire Wire Line
	4350 4250 4700 4250
Connection ~ 4350 4900
Wire Wire Line
	4350 4900 7600 4900
Wire Wire Line
	3800 4900 4350 4900
Connection ~ 4050 4250
Wire Wire Line
	4050 4250 4350 4250
Connection ~ 4050 5000
Wire Wire Line
	4050 5000 7600 5000
Wire Wire Line
	3800 5000 4050 5000
Wire Wire Line
	5000 4350 5000 4250
Connection ~ 5000 4250
Wire Wire Line
	5000 4250 5300 4250
Wire Wire Line
	5300 4350 5300 4250
Connection ~ 5300 4250
Wire Wire Line
	5300 4250 5600 4250
Wire Wire Line
	5600 4350 5600 4250
Connection ~ 5600 4250
Wire Wire Line
	5600 4250 5900 4250
Wire Wire Line
	5600 6800 7600 6800
Wire Wire Line
	7600 7000 5300 7000
Wire Wire Line
	5300 7000 5300 4650
Wire Wire Line
	7600 7100 5000 7100
Wire Wire Line
	5000 7100 5000 4800
Wire Wire Line
	4300 7100 4500 7100
Connection ~ 5000 7100
Text GLabel 4750 6800 0    50   Output ~ 0
RGMII_INTn
Wire Wire Line
	4750 6800 5600 6800
Connection ~ 5600 6800
Wire Wire Line
	5600 4650 5600 6800
Wire Notes Line
	6150 4800 6150 3850
Wire Notes Line
	6150 3850 7300 3850
Wire Notes Line
	7300 3850 7300 4800
Wire Notes Line
	7300 4800 6150 4800
Text Notes 6250 4200 0    50   ~ 0
MODE[3:0] = 1111  \nAdvertise all capabilities \n(10/100/1000 speed \nhalf-/full-duplex)
Text Notes 6250 3700 0    50   ~ 0
PHYAD[2:0] = 000
Wire Notes Line
	6100 4800 6100 3800
Wire Notes Line
	6100 3800 7300 3800
Wire Notes Line
	7300 3800 7300 3550
Wire Notes Line
	7300 3550 5850 3550
Wire Notes Line
	5850 3550 5850 4800
Wire Notes Line
	5850 4800 6100 4800
Text Notes 7400 3450 0    50   ~ 0
Pull-down (0) = Disable 125 MHz clock output
Wire Notes Line
	7350 4800 7350 3300
Wire Notes Line
	7350 3300 9350 3300
Wire Notes Line
	9350 3300 9350 3550
Wire Notes Line
	9350 3550 7650 3550
Wire Notes Line
	7650 3550 7650 4800
Wire Notes Line
	7650 4800 7350 4800
$Comp
L Device:R R147
U 1 1 5F78E55B
P 5600 7700
F 0 "R147" H 5670 7791 50  0000 L CNN
F 1 "10k" H 5670 7700 50  0000 L CNN
F 2 "KIT_Resistor_SMD:R_0402_1005Metric_DNP" V 5530 7700 50  0001 C CNN
F 3 "~" H 5600 7700 50  0001 C CNN
F 4 "AVT-IPE" H 5600 7700 50  0001 C CNN "stock"
F 5 "DNP" H 5670 7609 50  0000 L CNN "DNP"
	1    5600 7700
	1    0    0    -1  
$EndComp
$Comp
L Device:R R145
U 1 1 5F79DAAD
P 5300 7700
F 0 "R145" H 5370 7791 50  0000 L CNN
F 1 "10k" H 5370 7700 50  0000 L CNN
F 2 "KIT_Resistor_SMD:R_0402_1005Metric_DNP" V 5230 7700 50  0001 C CNN
F 3 "~" H 5300 7700 50  0001 C CNN
F 4 "AVT-IPE" H 5300 7700 50  0001 C CNN "stock"
F 5 "DNP" H 5370 7609 50  0000 L CNN "DNP"
	1    5300 7700
	1    0    0    -1  
$EndComp
Wire Wire Line
	5300 7000 5300 7550
Connection ~ 5300 7000
Wire Wire Line
	5600 6800 5600 7550
Connection ~ 7800 1600
Connection ~ 7800 2000
Connection ~ 8400 1600
Connection ~ 8400 2000
Text Notes 4000 3850 0    50   ~ 0
Pull-up (1) = Single-LED mode
Wire Notes Line
	5500 4800 5250 4800
Wire Notes Line
	5250 4800 5250 3950
Wire Notes Line
	5250 3950 3950 3950
Wire Notes Line
	3950 3950 3950 3700
Wire Notes Line
	3950 3700 5500 3700
Wire Notes Line
	5500 3700 5500 4800
$Comp
L power:GND #PWR?
U 1 1 5F817C8D
P 5300 8100
F 0 "#PWR?" H 5300 7850 50  0001 C CNN
F 1 "GND" H 5305 7927 50  0000 C CNN
F 2 "" H 5300 8100 50  0001 C CNN
F 3 "" H 5300 8100 50  0001 C CNN
	1    5300 8100
	1    0    0    -1  
$EndComp
Wire Wire Line
	5300 7850 5300 7950
Wire Wire Line
	5300 7950 5600 7950
Wire Wire Line
	7400 7950 7400 7850
Connection ~ 5300 7950
Wire Wire Line
	5300 7950 5300 8100
Wire Wire Line
	7100 7850 7100 7950
Connection ~ 7100 7950
Wire Wire Line
	7100 7950 7400 7950
Wire Wire Line
	6800 7850 6800 7950
Connection ~ 6800 7950
Wire Wire Line
	6800 7950 7100 7950
Wire Wire Line
	6500 7850 6500 7950
Connection ~ 6500 7950
Wire Wire Line
	6500 7950 6800 7950
Wire Wire Line
	6200 7850 6200 7950
Connection ~ 6200 7950
Wire Wire Line
	6200 7950 6500 7950
Wire Wire Line
	5900 7850 5900 7950
Connection ~ 5900 7950
Wire Wire Line
	5900 7950 6200 7950
Wire Wire Line
	5600 7850 5600 7950
Connection ~ 5600 7950
Wire Wire Line
	5600 7950 5900 7950
$Comp
L Device:C C274
U 1 1 5F9333D8
P 10600 7850
F 0 "C274" H 10485 7896 50  0000 R CNN
F 1 "22pF" H 10485 7805 50  0000 R CNN
F 2 "Capacitor_SMD:C_0402_1005Metric" H 10638 7700 50  0001 C CNN
F 3 "~" H 10600 7850 50  0001 C CNN
	1    10600 7850
	-1   0    0    -1  
$EndComp
$Comp
L Device:C C275
U 1 1 5F978C9A
P 12000 7850
F 0 "C275" H 11885 7896 50  0000 R CNN
F 1 "22pF" H 11885 7805 50  0000 R CNN
F 2 "Capacitor_SMD:C_0402_1005Metric" H 12038 7700 50  0001 C CNN
F 3 "~" H 12000 7850 50  0001 C CNN
	1    12000 7850
	-1   0    0    -1  
$EndComp
Wire Wire Line
	11450 7650 12000 7650
Wire Wire Line
	12000 7650 12000 7700
Wire Wire Line
	11150 7650 10600 7650
Wire Wire Line
	10600 7650 10600 7700
Wire Wire Line
	10600 7650 10600 7100
Wire Wire Line
	10200 7100 10600 7100
Connection ~ 10600 7650
Wire Wire Line
	12000 7650 12000 7000
Wire Wire Line
	10200 7000 12000 7000
Connection ~ 12000 7650
$Comp
L power:GND #PWR?
U 1 1 5F9DC10F
P 11300 8100
F 0 "#PWR?" H 11300 7850 50  0001 C CNN
F 1 "GND" H 11305 7927 50  0000 C CNN
F 2 "" H 11300 8100 50  0001 C CNN
F 3 "" H 11300 8100 50  0001 C CNN
	1    11300 8100
	1    0    0    -1  
$EndComp
Wire Wire Line
	11300 8100 11300 7900
$Comp
L power:GND #PWR?
U 1 1 5F9ED483
P 12000 8100
F 0 "#PWR?" H 12000 7850 50  0001 C CNN
F 1 "GND" H 12005 7927 50  0000 C CNN
F 2 "" H 12000 8100 50  0001 C CNN
F 3 "" H 12000 8100 50  0001 C CNN
	1    12000 8100
	1    0    0    -1  
$EndComp
$Comp
L power:GND #PWR?
U 1 1 5F9ED6B3
P 10600 8100
F 0 "#PWR?" H 10600 7850 50  0001 C CNN
F 1 "GND" H 10605 7927 50  0000 C CNN
F 2 "" H 10600 8100 50  0001 C CNN
F 3 "" H 10600 8100 50  0001 C CNN
	1    10600 8100
	1    0    0    -1  
$EndComp
Wire Wire Line
	10600 8100 10600 8000
Wire Wire Line
	12000 8100 12000 8000
Wire Wire Line
	11300 7450 11300 7400
Wire Wire Line
	11300 7400 11100 7400
Wire Wire Line
	11100 7400 11100 7900
Wire Wire Line
	11100 7900 11300 7900
Connection ~ 11300 7900
Wire Wire Line
	11300 7900 11300 7850
Text Label 9950 4150 0    50   ~ 0
AVDDL_PLL
Text Label 12100 1500 2    50   ~ 0
AVDDL_PLL
Wire Wire Line
	12100 1500 11650 1500
Wire Wire Line
	11650 1500 11650 1600
Text Label 4350 7000 0    50   ~ 0
LED_MODE
Wire Wire Line
	4350 7000 5300 7000
$Comp
L Device:Crystal_GND24 Y2
U 1 1 5EC13AB0
P 11300 7650
F 0 "Y2" H 11300 7150 50  0000 C CNN
F 1 "CX2016DB_25MHz" H 11300 7250 50  0000 C CNN
F 2 "KIT_Crystal:Crystal_SMD_2016-4Pin_2.0x1.6mm" H 11300 7650 50  0001 C CNN
F 3 "https://global.kyocera.com/prdct/electro/product/pdf/cx2016db_e.pdf" H 11300 7650 50  0001 C CNN
F 4 "Kyocera International Inc. Electronic Components" H 11300 7650 50  0001 C CNN "manf"
F 5 "CX2016DB25000H0FLJC1" H 11300 7650 50  0001 C CNN "manf#"
F 6 "25MHz ±10ppm Crystal 12pF 150 Ohms 4-SMD, No Lead" H 11300 7250 50  0001 C CNN "info"
F 7 "Notch in Pin 2 & Silkscreen Pin 1" H 11300 7350 50  0000 C CNN "note"
F 8 "1253-1709-1-ND" H 11300 7650 50  0001 C CNN "digikey#"
	1    11300 7650
	1    0    0    1   
$EndComp
$Comp
L Device:D D6
U 1 1 5F23D710
P 4700 4500
F 0 "D6" V 4600 4500 50  0000 L CNN
F 1 "1N4148" H 4650 4600 50  0000 L CNN
F 2 "Diode_SMD:D_0402_1005Metric" H 4700 4500 50  0001 C CNN
F 3 "https://www.mccsemi.com/pdf/Products/1N4148WL2(DFN1006-2L)-A.pdf" H 4700 4500 50  0001 C CNN
F 4 "Micro Commercial Co" V 4700 4500 50  0001 C CNN "manf"
F 5 "1N4148WL2-TP" V 4700 4500 50  0001 C CNN "manf#"
F 6 "1N4148WL2-TPMSCT-ND" V 4700 4500 50  0001 C CNN "digikey#"
	1    4700 4500
	0    1    1    0   
$EndComp
Wire Wire Line
	4700 4350 4700 4250
Connection ~ 4700 4250
Wire Wire Line
	4700 4250 5000 4250
Wire Wire Line
	4700 4650 4700 4800
Wire Wire Line
	4700 4800 5000 4800
Connection ~ 5000 4800
Wire Wire Line
	5000 4800 5000 4650
$Comp
L Device:D D5
U 1 1 5F280F69
P 4650 7100
F 0 "D5" H 4650 6976 50  0000 C CNN
F 1 "1N4148" H 4650 6885 50  0000 C CNN
F 2 "Diode_SMD:D_0402_1005Metric" H 4650 7100 50  0001 C CNN
F 3 "https://www.mccsemi.com/pdf/Products/1N4148WL2(DFN1006-2L)-A.pdf" H 4650 7100 50  0001 C CNN
F 4 "Micro Commercial Co" V 4650 7100 50  0001 C CNN "manf"
F 5 "1N4148WL2-TP" V 4650 7100 50  0001 C CNN "manf#"
F 6 "1N4148WL2-TPMSCT-ND" V 4650 7100 50  0001 C CNN "digikey#"
	1    4650 7100
	1    0    0    -1  
$EndComp
Wire Wire Line
	4800 7100 5000 7100
$Comp
L Device:C C154
U 1 1 5F2E9C4A
P 5000 7700
F 0 "C154" H 5114 7791 50  0000 L CNN
F 1 "10uF" H 5114 7700 50  0000 L CNN
F 2 "Capacitor_SMD:C_0603_1608Metric" H 5038 7550 50  0001 C CNN
F 3 "~" H 5000 7700 50  0001 C CNN
F 4 "AVT-IPE" H 5000 7700 50  0001 C CNN "stock"
F 5 "25V" H 5114 7609 50  0000 L CNN "info"
	1    5000 7700
	-1   0    0    -1  
$EndComp
Wire Wire Line
	5300 7950 5000 7950
Wire Wire Line
	5000 7950 5000 7850
Wire Wire Line
	5000 7550 5000 7100
Text Notes 10600 4950 0    50   ~ 0
1000BASE-T Full-Duplex at  100% Utilization =>\n1.2V Core (DVDDL, AVDDL,  AVDDL_PLL) = 221 mA \n3.3V Transceiver  (AVDDH) = 66.3 mA \n1.8V Digital I/O (DVDDH) = 23.6 mA\nTotal Chip Power = 526 mW 
Wire Notes Line
	10550 4500 12700 4500
Wire Notes Line
	12700 4500 12700 5000
Wire Notes Line
	12700 5000 10550 5000
Wire Notes Line
	10550 5000 10550 4500
$Comp
L power:PWR_FLAG #FLG?
U 1 1 5F478972
P 9900 4100
F 0 "#FLG?" H 9900 4175 50  0001 C CNN
F 1 "PWR_FLAG" H 9900 4273 50  0000 C CNN
F 2 "" H 9900 4100 50  0001 C CNN
F 3 "~" H 9900 4100 50  0001 C CNN
	1    9900 4100
	1    0    0    -1  
$EndComp
Wire Wire Line
	9900 4100 9900 4150
Connection ~ 9900 4150
Wire Wire Line
	9900 4150 10400 4150
Text GLabel 4750 5200 0    50   Input ~ 0
RGMII_TX_CTL
Text GLabel 3800 5000 0    50   BiDi ~ 0
RGMII_MDIO
Text GLabel 3800 4900 0    50   Input ~ 0
RGMII_MDC
Wire Wire Line
	15100 5550 15100 5600
Wire Wire Line
	15100 5050 15100 5150
Wire Wire Line
	14250 5150 15100 5150
Wire Wire Line
	15100 5250 15100 5150
Connection ~ 15100 5150
Wire Wire Line
	15100 7700 15100 7750
Wire Wire Line
	15100 7200 15100 7300
Wire Wire Line
	14250 7300 15100 7300
Wire Wire Line
	15100 7300 15100 7400
Connection ~ 15100 7300
$Comp
L Device:Ferrite_Bead FB?
U 1 1 5F789ABB
P 10550 4150
AR Path="/5DEF958D/5F789ABB" Ref="FB?"  Part="1" 
AR Path="/5FA2C9D2/5F789ABB" Ref="FB?"  Part="1" 
AR Path="/5EB76D90/5F789ABB" Ref="FB6"  Part="1" 
F 0 "FB6" V 10276 4150 50  0000 C CNN
F 1 "220 Ohms @ 100MHz" V 10367 4150 50  0000 C CNN
F 2 "Inductor_SMD:L_0603_1608Metric" V 10480 4150 50  0001 C CNN
F 3 "https://product.tdk.com/info/en/catalog/datasheets/beads_automotive_power_mpz1608_en.pdf" H 10550 4150 50  0001 C CNN
F 4 "220 Ohms @ 100MHz 1 Power Line Ferrite Bead 0603 (1608 Metric) 2.2A 50mOhm " V 10550 4150 50  0001 C CNN "info"
F 5 "TDK" V 10550 4150 50  0001 C CNN "manf"
F 6 "MPZ1608S221ATD25" V 10550 4150 50  0001 C CNN "manf#"
	1    10550 4150
	0    1    1    0   
$EndComp
$Comp
L KIT_Power:+1V8_STBY #PWR?
U 1 1 5FD8BDAA
P 8050 4000
AR Path="/5FFD078E/5FD8BDAA" Ref="#PWR?"  Part="1" 
AR Path="/5EB76D90/5FD8BDAA" Ref="#PWR?"  Part="1" 
F 0 "#PWR?" H 8050 3850 50  0001 C CNN
F 1 "+1V8_STBY" H 8065 4173 50  0000 C CNN
F 2 "" H 8050 4000 50  0001 C CNN
F 3 "" H 8050 4000 50  0001 C CNN
	1    8050 4000
	1    0    0    -1  
$EndComp
$Comp
L KIT_Power:+1V8_STBY #PWR?
U 1 1 5FD9BE6D
P 3100 1550
AR Path="/5FFD078E/5FD9BE6D" Ref="#PWR?"  Part="1" 
AR Path="/5EB76D90/5FD9BE6D" Ref="#PWR?"  Part="1" 
F 0 "#PWR?" H 3100 1400 50  0001 C CNN
F 1 "+1V8_STBY" H 3115 1723 50  0000 C CNN
F 2 "" H 3100 1550 50  0001 C CNN
F 3 "" H 3100 1550 50  0001 C CNN
	1    3100 1550
	1    0    0    -1  
$EndComp
$Comp
L KIT_Power:+1V8_STBY #PWR?
U 1 1 5FDDD9CB
P 4050 4200
F 0 "#PWR?" H 4050 4050 50  0001 C CNN
F 1 "+1V8_STBY" H 4065 4373 50  0000 C CNN
F 2 "" H 4050 4200 50  0001 C CNN
F 3 "" H 4050 4200 50  0001 C CNN
	1    4050 4200
	1    0    0    -1  
$EndComp
Text Label 5100 7100 0    50   ~ 0
ETH_PHY_RESET_N
Wire Bus Line
	3550 5900 3550 6200
Wire Bus Line
	3550 5200 3550 5500
$EndSCHEMATC
