EESchema Schematic File Version 4
EELAYER 30 0
EELAYER END
$Descr A4 11693 8268
encoding utf-8
Sheet 19 28
Title "ZynqMP Mezzanine FMC+ (BuZZyBoard)"
Date "2020-10-02"
Rev "1.0"
Comp "Karlsruhe Institute of Technology (KIT)"
Comment1 "Institute for Data Processing and Electronics (IPE)"
Comment2 "Luis Ardila"
Comment3 ""
Comment4 ""
$EndDescr
$Comp
L KIT_FPGA:ZU4EG-B900 U1
U 3 1 5E4884C5
P 4500 3150
F 0 "U1" H 5500 3440 60  0000 C CNN
F 1 "ZU4EG-B900" H 5500 3334 60  0000 C CNN
F 2 "KIT_Package_BGA:BGA-900_30x30_31.0x31.0mm" H 2800 2950 50  0001 C CNN
F 3 "" H 2800 2950 50  0001 C CNN
	3    4500 3150
	1    0    0    -1  
$EndComp
Wire Wire Line
	2800 2450 2800 2500
$Comp
L Device:C C61
U 1 1 5FF0450A
P 3250 2700
F 0 "C61" H 3365 2746 50  0000 L CNN
F 1 "0.1uF" H 3365 2655 50  0000 L CNN
F 2 "Capacitor_SMD:C_0402_1005Metric" H 3288 2550 50  0001 C CNN
F 3 "~" H 3250 2700 50  0001 C CNN
F 4 "16 V" H 3250 2700 50  0001 C CNN "info"
F 5 "AVT-IPE" H 3250 2700 50  0001 C CNN "stock"
	1    3250 2700
	1    0    0    -1  
$EndComp
$Comp
L power:GND #PWR?
U 1 1 5F4D3A8D
P 3250 2900
F 0 "#PWR?" H 3250 2650 50  0001 C CNN
F 1 "GND" H 3255 2727 50  0000 C CNN
F 2 "" H 3250 2900 50  0001 C CNN
F 3 "" H 3250 2900 50  0001 C CNN
	1    3250 2900
	1    0    0    -1  
$EndComp
Wire Wire Line
	3250 2900 3250 2850
Wire Wire Line
	3250 2550 3250 2500
$Comp
L Device:C C59
U 1 1 5FF1F47C
P 2800 2700
F 0 "C59" H 2915 2746 50  0000 L CNN
F 1 "0.1uF" H 2915 2655 50  0000 L CNN
F 2 "Capacitor_SMD:C_0402_1005Metric" H 2838 2550 50  0001 C CNN
F 3 "~" H 2800 2700 50  0001 C CNN
F 4 "16 V" H 2800 2700 50  0001 C CNN "info"
F 5 "AVT-IPE" H 2800 2700 50  0001 C CNN "stock"
	1    2800 2700
	1    0    0    -1  
$EndComp
$Comp
L power:GND #PWR?
U 1 1 5FF1F482
P 2800 2900
F 0 "#PWR?" H 2800 2650 50  0001 C CNN
F 1 "GND" H 2805 2727 50  0000 C CNN
F 2 "" H 2800 2900 50  0001 C CNN
F 3 "" H 2800 2900 50  0001 C CNN
	1    2800 2900
	1    0    0    -1  
$EndComp
Wire Wire Line
	2800 2900 2800 2850
Wire Wire Line
	2800 2550 2800 2500
Wire Wire Line
	2800 2500 3250 2500
Connection ~ 2800 2500
$Comp
L KIT_Power:+3V3_STBY #PWR?
U 1 1 5F508E06
P 2800 2450
F 0 "#PWR?" H 2800 2300 50  0001 C CNN
F 1 "+3V3_STBY" H 2815 2623 50  0000 C CNN
F 2 "" H 2800 2450 50  0001 C CNN
F 3 "" H 2800 2450 50  0001 C CNN
	1    2800 2450
	1    0    0    -1  
$EndComp
Wire Wire Line
	3900 3150 3700 3150
Wire Wire Line
	3700 3150 3700 2500
Wire Wire Line
	3700 2500 3250 2500
Connection ~ 3250 2500
Text Label 3400 3250 0    50   ~ 0
B46_IO_0
Text Label 3400 3350 0    50   ~ 0
B46_IO_1
Text Label 3400 3450 0    50   ~ 0
B46_IO_2
Text Label 3400 3550 0    50   ~ 0
B46_IO_3
Text Label 3400 3650 0    50   ~ 0
B46_IO_4
Text Label 3400 3750 0    50   ~ 0
B46_IO_5
Text Label 3400 3850 0    50   ~ 0
B46_IO_6
Text Label 3400 3950 0    50   ~ 0
B46_IO_7
Text Label 3400 4050 0    50   ~ 0
B46_IO_8
Text Label 3400 4150 0    50   ~ 0
B46_IO_9
Text Label 3400 4250 0    50   ~ 0
B46_IO_10
Text Label 3400 4350 0    50   ~ 0
B46_IO_11
Text Label 7650 3250 2    50   ~ 0
B46_IO_12
Text Label 7650 3350 2    50   ~ 0
B46_IO_13
Text Label 7650 3450 2    50   ~ 0
B46_IO_14
Text Label 7650 3550 2    50   ~ 0
B46_IO_15
Text Label 7650 3650 2    50   ~ 0
B46_IO_16
Text Label 7650 3750 2    50   ~ 0
B46_IO_17
Text Label 7650 3850 2    50   ~ 0
B46_IO_18
Text Label 7650 3950 2    50   ~ 0
B46_IO_19
Text Label 7650 4050 2    50   ~ 0
B46_IO_20
Text Label 7650 4150 2    50   ~ 0
B46_IO_21
Text Label 7650 4250 2    50   ~ 0
B46_IO_22
Text Label 7650 4350 2    50   ~ 0
B46_IO_23
Wire Wire Line
	3400 3250 3900 3250
Wire Wire Line
	3400 3350 3900 3350
Wire Wire Line
	3400 3450 3900 3450
Wire Wire Line
	3400 3550 3900 3550
Wire Wire Line
	3400 3650 3900 3650
Wire Wire Line
	3400 3750 3900 3750
Wire Wire Line
	3400 3850 3900 3850
Wire Wire Line
	3400 3950 3900 3950
Wire Wire Line
	3400 4050 3900 4050
Wire Wire Line
	3400 4150 3900 4150
Wire Wire Line
	3400 4250 3900 4250
Wire Wire Line
	3400 4350 3900 4350
Wire Wire Line
	7650 3250 7100 3250
Wire Wire Line
	7650 3350 7100 3350
Wire Wire Line
	7650 3450 7100 3450
Wire Wire Line
	7650 3550 7100 3550
Wire Wire Line
	7650 3650 7100 3650
Wire Wire Line
	7650 3750 7100 3750
Wire Wire Line
	7650 3850 7100 3850
Wire Wire Line
	7650 3950 7100 3950
Wire Wire Line
	7650 4050 7100 4050
Wire Wire Line
	7650 4150 7100 4150
Wire Wire Line
	7650 4250 7100 4250
Wire Wire Line
	7650 4350 7100 4350
Entry Wire Line
	7650 3250 7750 3350
Entry Wire Line
	7650 3350 7750 3450
Entry Wire Line
	7650 3450 7750 3550
Entry Wire Line
	7650 3550 7750 3650
Entry Wire Line
	7650 3650 7750 3750
Entry Wire Line
	7650 3750 7750 3850
Entry Wire Line
	7650 3850 7750 3950
Entry Wire Line
	7650 3950 7750 4050
Entry Wire Line
	7650 4050 7750 4150
Entry Wire Line
	7650 4150 7750 4250
Entry Wire Line
	7650 4250 7750 4350
Entry Wire Line
	7650 4350 7750 4450
Entry Wire Line
	3400 3250 3300 3350
Entry Wire Line
	3400 3350 3300 3450
Entry Wire Line
	3400 3450 3300 3550
Entry Wire Line
	3400 3550 3300 3650
Entry Wire Line
	3400 3650 3300 3750
Entry Wire Line
	3400 3750 3300 3850
Entry Wire Line
	3400 3850 3300 3950
Entry Wire Line
	3400 3950 3300 4050
Entry Wire Line
	3400 4050 3300 4150
Entry Wire Line
	3400 4150 3300 4250
Entry Wire Line
	3400 4250 3300 4350
Entry Wire Line
	3400 4350 3300 4450
Wire Bus Line
	7750 4750 3300 4750
Connection ~ 3300 4750
Wire Bus Line
	3300 4750 2800 4750
Text GLabel 2800 4750 0    50   BiDi ~ 0
B46_IO_[0..23]
Text Notes 8000 3450 0    50   ~ 0
GC\npins
Wire Notes Line
	5900 3600 8200 3600
Wire Notes Line
	8200 3600 8200 3200
Wire Notes Line
	8200 3200 5900 3200
Text Notes 3000 4250 2    50   ~ 0
GC\npins
Wire Notes Line
	5100 4400 2800 4400
Wire Notes Line
	2800 4400 2800 4000
Wire Notes Line
	2800 4000 5100 4000
Wire Notes Line
	5100 4000 5100 4400
Wire Notes Line
	5900 3600 5900 3200
Wire Bus Line
	7750 3350 7750 4750
Wire Bus Line
	3300 3350 3300 4750
$EndSCHEMATC
