EESchema Schematic File Version 4
EELAYER 30 0
EELAYER END
$Descr A4 11693 8268
encoding utf-8
Sheet 7 28
Title "ZynqMP Mezzanine FMC+ (BuZZyBoard)"
Date "2020-10-02"
Rev "1.0"
Comp "Karlsruhe Institute of Technology (KIT)"
Comment1 "Institute for Data Processing and Electronics (IPE)"
Comment2 "Luis Ardila"
Comment3 ""
Comment4 ""
$EndDescr
$Comp
L KIT_FPGA:ZU4EG-B900 U1
U 11 1 5F7B877E
P 4050 850
F 0 "U1" H 5000 1140 60  0000 C CNN
F 1 "ZU4EG-B900" H 5000 1034 60  0000 C CNN
F 2 "KIT_Package_BGA:BGA-900_30x30_31.0x31.0mm" H 2350 650 50  0001 C CNN
F 3 "" H 2350 650 50  0001 C CNN
	11   4050 850 
	1    0    0    -1  
$EndComp
$Comp
L KIT_FPGA:ZU4EG-B900 U1
U 12 1 5F7B8784
P 4050 3050
F 0 "U1" H 5000 3340 60  0000 C CNN
F 1 "ZU4EG-B900" H 5000 3234 60  0000 C CNN
F 2 "KIT_Package_BGA:BGA-900_30x30_31.0x31.0mm" H 2350 2850 50  0001 C CNN
F 3 "" H 2350 2850 50  0001 C CNN
	12   4050 3050
	1    0    0    -1  
$EndComp
Text GLabel 3750 3650 0    50   Input ~ 0
PG_PL_VCCCINT_STBY
Text GLabel 3750 4250 0    50   Output ~ 0
SOFT_RST_OUT
Text GLabel 3750 3250 0    50   Output ~ 0
MO_SCL
Text GLabel 3750 3350 0    50   BiDi ~ 0
MO_SDA
Wire Wire Line
	6100 3750 5950 3750
Wire Wire Line
	6100 3150 5950 3150
$Comp
L KIT_FPGA:ZU4EG-B900 U1
U 13 1 5F7E3076
P 4050 5250
F 0 "U1" H 5000 5540 60  0000 C CNN
F 1 "ZU4EG-B900" H 5000 5434 60  0000 C CNN
F 2 "KIT_Package_BGA:BGA-900_30x30_31.0x31.0mm" H 2350 5050 50  0001 C CNN
F 3 "" H 2350 5050 50  0001 C CNN
	13   4050 5250
	1    0    0    -1  
$EndComp
NoConn ~ 4050 1650
Wire Wire Line
	3900 5450 4050 5450
Wire Wire Line
	3900 5550 4050 5550
Wire Wire Line
	3900 5750 4050 5750
Text GLabel 6100 3150 2    50   Output ~ 0
SD_SEL
Text GLabel 6100 3750 2    50   Input ~ 0
SD_CD
Text GLabel 7850 3850 2    50   BiDi ~ 0
SD_DATA0
Text GLabel 7850 3950 2    50   BiDi ~ 0
SD_DATA1
Text GLabel 7850 4050 2    50   BiDi ~ 0
SD_DATA2
Text GLabel 7850 4150 2    50   BiDi ~ 0
SD_DATA3
Text GLabel 7850 4250 2    50   BiDi ~ 0
SD_CMD
Text GLabel 7850 4350 2    50   Output ~ 0
SD_CLK
Wire Wire Line
	5950 1150 6100 1150
Wire Wire Line
	5950 1250 6100 1250
Wire Wire Line
	5950 1350 6100 1350
Wire Wire Line
	5950 1450 6100 1450
Wire Wire Line
	5950 1550 6100 1550
Wire Wire Line
	5950 1650 6100 1650
Wire Wire Line
	5950 1750 6100 1750
Wire Wire Line
	5950 1850 6100 1850
Wire Wire Line
	5950 1950 6100 1950
Wire Wire Line
	5950 2050 6100 2050
Wire Wire Line
	5950 2150 6100 2150
Wire Wire Line
	5950 2250 6100 2250
Wire Wire Line
	5950 3050 6100 3050
Text GLabel 6100 1550 2    50   Input ~ 0
UART0_RX
Text GLabel 6100 1650 2    50   Input ~ 0
UART0_TX
Text GLabel 6100 1750 2    50   Input ~ 0
UART1_TX
Text GLabel 6100 1850 2    50   Input ~ 0
UART1_RX
Text GLabel 6100 1150 2    50   Output ~ 0
IMPB_A_SCL
Text GLabel 6100 1250 2    50   BiDi ~ 0
IMPB_A_SDA
Text GLabel 6100 1350 2    50   Output ~ 0
IMPB_B_SCL
Text GLabel 6100 1450 2    50   BiDi ~ 0
IPMB_B_SDA
Text GLabel 6100 1950 2    50   Input ~ 0
IPMB_A_ENABLE
Text GLabel 6100 2050 2    50   Input ~ 0
IMPB_A_READY
Text GLabel 6100 2150 2    50   Input ~ 0
IPMB_B_ENABLE
Text GLabel 6100 2250 2    50   Input ~ 0
IPMB_B_READY
Wire Wire Line
	3900 750  3900 850 
Wire Wire Line
	3900 850  4050 850 
Wire Wire Line
	3900 2950 3900 3050
Wire Wire Line
	3900 3050 4050 3050
$Comp
L KIT_Power:+3V3_STBY #PWR?
U 1 1 6146B7AD
P 3900 750
F 0 "#PWR?" H 3900 600 50  0001 C CNN
F 1 "+3V3_STBY" H 3915 923 50  0000 C CNN
F 2 "" H 3900 750 50  0001 C CNN
F 3 "" H 3900 750 50  0001 C CNN
	1    3900 750 
	1    0    0    -1  
$EndComp
Wire Wire Line
	3950 5150 3950 5250
Wire Wire Line
	3950 5250 4050 5250
Text GLabel 3900 1050 0    50   Input ~ 0
QSPI_0_SCLK
Text GLabel 3900 1550 0    50   Input ~ 0
QSPI_0_CS_B
Text GLabel 3900 1750 0    50   Input ~ 0
QSPI_1_CS_B
Text GLabel 3900 2250 0    50   Input ~ 0
QSPI_1_SCLK
Wire Wire Line
	3900 1050 4050 1050
Wire Wire Line
	3900 1550 4050 1550
Wire Wire Line
	3900 1750 4050 1750
Wire Wire Line
	3900 2250 4050 2250
Text GLabel 3900 5450 0    50   Input ~ 0
USB_CLK_IN
Text GLabel 3900 5550 0    50   Input ~ 0
USB_DIR
Text GLabel 3900 5750 0    50   Input ~ 0
USB_NXT
Text GLabel 6100 3050 2    50   Output ~ 0
USB_RESET_B
Text GLabel 3750 3450 0    50   Output ~ 0
MO_RESET_N
Text GLabel 3750 3550 0    50   BiDi ~ 0
MO_INT_N
Wire Notes Line
	4700 3800 1950 3800
Wire Notes Line
	1950 3150 4700 3150
Text Notes 2000 3250 0    50   ~ 0
PMU Inputs\n
Wire Notes Line
	4700 4400 1950 4400
Text Notes 2000 3900 0    50   ~ 0
PMU Outputs\n
Wire Notes Line
	1950 4400 1950 3150
Wire Notes Line
	4700 3150 4700 4400
$Comp
L KIT_Power:+1V8_STBY #PWR?
U 1 1 5FC882BD
P 3950 5150
F 0 "#PWR?" H 3950 5000 50  0001 C CNN
F 1 "+1V8_STBY" H 3965 5323 50  0000 C CNN
F 2 "" H 3950 5150 50  0001 C CNN
F 3 "" H 3950 5150 50  0001 C CNN
	1    3950 5150
	1    0    0    -1  
$EndComp
$Comp
L KIT_Power:+1V8_STBY #PWR?
U 1 1 5FC901DE
P 3900 2950
F 0 "#PWR?" H 3900 2800 50  0001 C CNN
F 1 "+1V8_STBY" H 3915 3123 50  0000 C CNN
F 2 "" H 3900 2950 50  0001 C CNN
F 3 "" H 3900 2950 50  0001 C CNN
	1    3900 2950
	1    0    0    -1  
$EndComp
Wire Wire Line
	6050 5250 5950 5250
Wire Wire Line
	6050 5750 5950 5750
Text Label 7150 5950 2    50   ~ 0
RGMII_RX_D0
Text Label 7150 6050 2    50   ~ 0
RGMII_RX_D1
Text Label 7150 6150 2    50   ~ 0
RGMII_RX_D2
Text Label 7150 6250 2    50   ~ 0
RGMII_RX_D3
Entry Wire Line
	7150 6250 7250 6150
Entry Wire Line
	7150 6150 7250 6050
Entry Wire Line
	7150 6050 7250 5950
Entry Wire Line
	7150 5950 7250 5850
Wire Bus Line
	7250 5850 7350 5850
Text Label 7150 5350 2    50   ~ 0
RGMII_TX_D0
Text Label 7150 5450 2    50   ~ 0
RGMII_TX_D1
Text Label 7150 5550 2    50   ~ 0
RGMII_TX_D2
Text Label 7150 5650 2    50   ~ 0
RGMII_TX_D3
Entry Wire Line
	7150 5650 7250 5550
Entry Wire Line
	7150 5550 7250 5450
Entry Wire Line
	7150 5450 7250 5350
Entry Wire Line
	7150 5350 7250 5250
Wire Bus Line
	7250 5250 7350 5250
Text GLabel 6100 3550 2    50   Output ~ 0
RGMII_RSTn
Wire Wire Line
	6100 3550 5950 3550
Wire Wire Line
	6050 6550 5950 6550
Wire Wire Line
	6050 6450 5950 6450
Wire Wire Line
	6050 5850 5950 5850
Wire Wire Line
	5950 6350 6050 6350
Wire Wire Line
	6100 3650 5950 3650
Wire Wire Line
	5950 5350 7150 5350
Wire Wire Line
	5950 5450 7150 5450
Wire Wire Line
	5950 5550 7150 5550
Wire Wire Line
	5950 5650 7150 5650
Wire Wire Line
	5950 5950 7150 5950
Wire Wire Line
	5950 6050 7150 6050
Wire Wire Line
	5950 6150 7150 6150
Wire Wire Line
	5950 6250 7150 6250
Text GLabel 6050 6550 2    50   BiDi ~ 0
RGMII_MDIO
Text GLabel 6050 6450 2    50   Output ~ 0
RGMII_MDC
Text GLabel 6050 6350 2    50   Input ~ 0
RGMII_RX_CTL
Text GLabel 7350 5850 2    50   Input ~ 0
RGMII_RX_D[0..3]
Text GLabel 6050 5850 2    50   Input ~ 0
RGMII_RX_CLK
Text GLabel 6050 5750 2    50   Output ~ 0
RGMII_TX_CTL
Text GLabel 7350 5250 2    50   Output ~ 0
RGMII_TX_D[0..3]
Text GLabel 6050 5250 2    50   Output ~ 0
RGMII_TX_CLK
Text GLabel 6100 3650 2    50   Input ~ 0
RGMII_INTn
Text GLabel 3750 3850 0    50   Output ~ 0
PMBUS_SCL
Text GLabel 3750 3950 0    50   BiDi ~ 0
PMBUS_SDA
Text GLabel 3750 3750 0    50   Input ~ 0
PMBUS_INT_B
Text GLabel 2500 1750 0    50   BiDi ~ 0
QSPI_1_IO[0..3]
Entry Wire Line
	2700 1850 2600 1750
Entry Wire Line
	2700 2150 2600 2050
Entry Wire Line
	2700 2050 2600 1950
Entry Wire Line
	2700 1950 2600 1850
Wire Bus Line
	2600 1750 2500 1750
Text Label 3300 1850 2    50   ~ 0
QSPI_1_IO0
Text Label 3300 1950 2    50   ~ 0
QSPI_1_IO1
Text Label 3300 2050 2    50   ~ 0
QSPI_1_IO2
Text Label 3300 2150 2    50   ~ 0
QSPI_1_IO3
Text GLabel 2500 1050 0    50   BiDi ~ 0
QSPI_0_IO[0..3]
Text Label 3250 1150 2    50   ~ 0
QSPI_0_IO1
Text Label 3250 1250 2    50   ~ 0
QSPI_0_IO2
Text Label 3250 1350 2    50   ~ 0
QSPI_0_IO3
Text Label 3250 1450 2    50   ~ 0
QSPI_0_IO0
Entry Wire Line
	2700 1150 2600 1050
Entry Wire Line
	2700 1450 2600 1350
Entry Wire Line
	2700 1350 2600 1250
Entry Wire Line
	2700 1250 2600 1150
Wire Bus Line
	2600 1050 2500 1050
Wire Wire Line
	2700 1150 4050 1150
Wire Wire Line
	2700 1250 4050 1250
Wire Wire Line
	2700 1350 4050 1350
Wire Wire Line
	2700 1450 4050 1450
Wire Wire Line
	2700 1850 4050 1850
Wire Wire Line
	2700 1950 4050 1950
Wire Wire Line
	2700 2050 4050 2050
Wire Wire Line
	2700 2150 4050 2150
Wire Wire Line
	3750 3250 4050 3250
Wire Wire Line
	3750 3350 4050 3350
Wire Wire Line
	3750 3450 4050 3450
Wire Wire Line
	3750 3550 4050 3550
Wire Wire Line
	3750 3650 4050 3650
Wire Wire Line
	3750 3750 4050 3750
Wire Wire Line
	3750 3850 4050 3850
Wire Wire Line
	3750 3950 4050 3950
Wire Wire Line
	3750 4250 4050 4250
Text GLabel 3750 4050 0    50   Output ~ 0
EN_PL_VCCCINT_STBY
Wire Wire Line
	3750 4050 4050 4050
Text Notes 8650 4250 0    50   ~ 0
UG583:\n- A 30Ω series resistor should be placed on the CLK, CMD, \nand DATA lines, as close to the MIO pins as possible.
Text Notes 1550 7300 0    50   ~ 0
UG583:\n- ULPI Interface (60 MHz)\n- PCB and package delays should be kept to 1.30 ns or below.\n- PCB and package delay skews for DATA[7:0]/DIR/NXT/STP and CLK should be within ±100 ps.\n- For optimum signal integrity, add a 30Ω series resistor to the DATA and STP lines near the Zynq UltraScale+ MPSoC.
Wire Notes Line
	1450 6800 6300 6800
Wire Notes Line
	6300 6800 6300 7400
Wire Notes Line
	6300 7400 1450 7400
Wire Notes Line
	1450 7400 1450 6800
Wire Notes Line
	8550 3900 8550 4350
Wire Notes Line
	8550 4350 11100 4350
Wire Notes Line
	11100 4350 11100 3900
Wire Notes Line
	11100 3900 8550 3900
$Comp
L Device:R R116
U 1 1 5F182A42
P 7350 3850
F 0 "R116" V 7300 4050 50  0000 C CNN
F 1 "33" V 7300 3650 50  0000 C CNN
F 2 "Resistor_SMD:R_0402_1005Metric" V 7280 3850 50  0001 C CNN
F 3 "~" H 7350 3850 50  0001 C CNN
F 4 "AVT-IPE" H 7350 3850 50  0001 C CNN "stock"
	1    7350 3850
	0    1    1    0   
$EndComp
$Comp
L Device:R R119
U 1 1 5F1960BC
P 7350 3950
F 0 "R119" V 7300 4150 50  0000 C CNN
F 1 "33" V 7300 3750 50  0000 C CNN
F 2 "Resistor_SMD:R_0402_1005Metric" V 7280 3950 50  0001 C CNN
F 3 "~" H 7350 3950 50  0001 C CNN
F 4 "AVT-IPE" H 7350 3950 50  0001 C CNN "stock"
	1    7350 3950
	0    1    1    0   
$EndComp
$Comp
L Device:R R120
U 1 1 5F1961CD
P 7350 4050
F 0 "R120" V 7300 4250 50  0000 C CNN
F 1 "33" V 7300 3850 50  0000 C CNN
F 2 "Resistor_SMD:R_0402_1005Metric" V 7280 4050 50  0001 C CNN
F 3 "~" H 7350 4050 50  0001 C CNN
F 4 "AVT-IPE" H 7350 4050 50  0001 C CNN "stock"
	1    7350 4050
	0    1    1    0   
$EndComp
$Comp
L Device:R R121
U 1 1 5F1962A9
P 7350 4150
F 0 "R121" V 7300 4350 50  0000 C CNN
F 1 "33" V 7300 3950 50  0000 C CNN
F 2 "Resistor_SMD:R_0402_1005Metric" V 7280 4150 50  0001 C CNN
F 3 "~" H 7350 4150 50  0001 C CNN
F 4 "AVT-IPE" H 7350 4150 50  0001 C CNN "stock"
	1    7350 4150
	0    1    1    0   
$EndComp
$Comp
L Device:R R122
U 1 1 5F196356
P 7350 4250
F 0 "R122" V 7300 4450 50  0000 C CNN
F 1 "33" V 7300 4050 50  0000 C CNN
F 2 "Resistor_SMD:R_0402_1005Metric" V 7280 4250 50  0001 C CNN
F 3 "~" H 7350 4250 50  0001 C CNN
F 4 "AVT-IPE" H 7350 4250 50  0001 C CNN "stock"
	1    7350 4250
	0    1    1    0   
$EndComp
$Comp
L Device:R R123
U 1 1 5F196461
P 7350 4350
F 0 "R123" V 7300 4550 50  0000 C CNN
F 1 "33" V 7300 4150 50  0000 C CNN
F 2 "Resistor_SMD:R_0402_1005Metric" V 7280 4350 50  0001 C CNN
F 3 "~" H 7350 4350 50  0001 C CNN
F 4 "AVT-IPE" H 7350 4350 50  0001 C CNN "stock"
	1    7350 4350
	0    1    1    0   
$EndComp
Text Label 6500 4150 0    50   ~ 0
SD_DATA_R_3
Text Label 6500 4250 0    50   ~ 0
SD_CMD_R
Text Label 6500 4350 0    50   ~ 0
SD_CLK_R
Text Label 6500 4050 0    50   ~ 0
SD_DATA_R_2
Text Label 6500 3950 0    50   ~ 0
SD_DATA_R_1
Text Label 6500 3850 0    50   ~ 0
SD_DATA_R_0
Wire Wire Line
	5950 3850 7200 3850
Wire Wire Line
	7500 3850 7850 3850
Wire Wire Line
	7850 3950 7500 3950
Wire Wire Line
	5950 3950 7200 3950
Wire Wire Line
	7850 4050 7500 4050
Wire Wire Line
	7850 4150 7500 4150
Wire Wire Line
	7850 4250 7500 4250
Wire Wire Line
	7850 4350 7500 4350
Wire Wire Line
	5950 4050 7200 4050
Wire Wire Line
	5950 4150 7200 4150
Wire Wire Line
	5950 4250 7200 4250
Wire Wire Line
	5950 4350 7200 4350
$Comp
L Device:R R115
U 1 1 5F1F4F39
P 3500 6050
F 0 "R115" V 3450 6250 50  0000 C CNN
F 1 "33" V 3450 5850 50  0000 C CNN
F 2 "Resistor_SMD:R_0402_1005Metric" V 3430 6050 50  0001 C CNN
F 3 "~" H 3500 6050 50  0001 C CNN
F 4 "AVT-IPE" H 3500 6050 50  0001 C CNN "stock"
	1    3500 6050
	0    1    1    0   
$EndComp
Wire Wire Line
	3650 6050 4050 6050
Wire Wire Line
	2700 5650 4050 5650
Wire Wire Line
	2700 5850 4050 5850
Wire Wire Line
	2700 5950 4050 5950
Wire Wire Line
	2700 6150 4050 6150
Wire Wire Line
	2700 6250 4050 6250
Wire Wire Line
	2700 6350 4050 6350
Wire Wire Line
	2700 6450 4050 6450
Wire Wire Line
	2700 6550 4050 6550
Text Label 3800 6050 0    20   ~ 0
USB_STP_R
Text Label 3800 6550 0    20   ~ 0
USB_DATA_R_7
Text Label 3800 6450 0    20   ~ 0
USB_DATA_R_6
Text Label 3800 6350 0    20   ~ 0
USB_DATA_R_5
Text Label 3800 6250 0    20   ~ 0
USB_DATA_R_4
Text Label 3800 6150 0    20   ~ 0
USB_DATA_R_3
Text Label 3800 5950 0    20   ~ 0
USB_DATA_R_1
Text Label 3800 5850 0    20   ~ 0
USB_DATA_R_0
Wire Wire Line
	3250 6050 3350 6050
Text GLabel 3250 6050 0    50   Output ~ 0
USB_STP
Text Label 3800 5650 0    20   ~ 0
USB_DATA_R_2
$Comp
L Device:R R114
U 1 1 5F1F639C
P 2550 6550
F 0 "R114" V 2500 6750 50  0000 C CNN
F 1 "33" V 2500 6350 50  0000 C CNN
F 2 "Resistor_SMD:R_0402_1005Metric" V 2480 6550 50  0001 C CNN
F 3 "~" H 2550 6550 50  0001 C CNN
F 4 "AVT-IPE" H 2550 6550 50  0001 C CNN "stock"
	1    2550 6550
	0    1    1    0   
$EndComp
$Comp
L Device:R R113
U 1 1 5F1F62A7
P 2550 6450
F 0 "R113" V 2500 6650 50  0000 C CNN
F 1 "33" V 2500 6250 50  0000 C CNN
F 2 "Resistor_SMD:R_0402_1005Metric" V 2480 6450 50  0001 C CNN
F 3 "~" H 2550 6450 50  0001 C CNN
F 4 "AVT-IPE" H 2550 6450 50  0001 C CNN "stock"
	1    2550 6450
	0    1    1    0   
$EndComp
$Comp
L Device:R R112
U 1 1 5F1F615F
P 2550 6350
F 0 "R112" V 2500 6550 50  0000 C CNN
F 1 "33" V 2500 6150 50  0000 C CNN
F 2 "Resistor_SMD:R_0402_1005Metric" V 2480 6350 50  0001 C CNN
F 3 "~" H 2550 6350 50  0001 C CNN
F 4 "AVT-IPE" H 2550 6350 50  0001 C CNN "stock"
	1    2550 6350
	0    1    1    0   
$EndComp
$Comp
L Device:R R111
U 1 1 5F1F6031
P 2550 6250
F 0 "R111" V 2500 6450 50  0000 C CNN
F 1 "33" V 2500 6050 50  0000 C CNN
F 2 "Resistor_SMD:R_0402_1005Metric" V 2480 6250 50  0001 C CNN
F 3 "~" H 2550 6250 50  0001 C CNN
F 4 "AVT-IPE" H 2550 6250 50  0001 C CNN "stock"
	1    2550 6250
	0    1    1    0   
$EndComp
$Comp
L Device:R R110
U 1 1 5F1F5D36
P 2550 6150
F 0 "R110" V 2500 6350 50  0000 C CNN
F 1 "33" V 2500 5950 50  0000 C CNN
F 2 "Resistor_SMD:R_0402_1005Metric" V 2480 6150 50  0001 C CNN
F 3 "~" H 2550 6150 50  0001 C CNN
F 4 "AVT-IPE" H 2550 6150 50  0001 C CNN "stock"
	1    2550 6150
	0    1    1    0   
$EndComp
$Comp
L Device:R R109
U 1 1 5F1F5C4C
P 2550 5950
F 0 "R109" V 2500 6150 50  0000 C CNN
F 1 "33" V 2500 5750 50  0000 C CNN
F 2 "Resistor_SMD:R_0402_1005Metric" V 2480 5950 50  0001 C CNN
F 3 "~" H 2550 5950 50  0001 C CNN
F 4 "AVT-IPE" H 2550 5950 50  0001 C CNN "stock"
	1    2550 5950
	0    1    1    0   
$EndComp
$Comp
L Device:R R108
U 1 1 5F1F5A52
P 2550 5850
F 0 "R108" V 2500 6050 50  0000 C CNN
F 1 "33" V 2500 5650 50  0000 C CNN
F 2 "Resistor_SMD:R_0402_1005Metric" V 2480 5850 50  0001 C CNN
F 3 "~" H 2550 5850 50  0001 C CNN
F 4 "AVT-IPE" H 2550 5850 50  0001 C CNN "stock"
	1    2550 5850
	0    1    1    0   
$EndComp
$Comp
L Device:R R107
U 1 1 5F1F572B
P 2550 5650
F 0 "R107" V 2500 5850 50  0000 C CNN
F 1 "33" V 2500 5450 50  0000 C CNN
F 2 "Resistor_SMD:R_0402_1005Metric" V 2480 5650 50  0001 C CNN
F 3 "~" H 2550 5650 50  0001 C CNN
F 4 "AVT-IPE" H 2550 5650 50  0001 C CNN "stock"
	1    2550 5650
	0    1    1    0   
$EndComp
Entry Wire Line
	1700 5550 1800 5650
Text Label 1800 5650 0    50   ~ 0
USB_DATA_2
Wire Bus Line
	1600 5550 1700 5550
Entry Wire Line
	1700 6450 1800 6550
Entry Wire Line
	1700 6350 1800 6450
Entry Wire Line
	1700 6250 1800 6350
Entry Wire Line
	1700 6150 1800 6250
Entry Wire Line
	1700 6050 1800 6150
Entry Wire Line
	1700 5850 1800 5950
Entry Wire Line
	1700 5750 1800 5850
Text GLabel 1600 5550 0    50   BiDi ~ 0
USB_DATA_[0..7]
Text Label 1800 5950 0    50   ~ 0
USB_DATA_1
Text Label 1800 5850 0    50   ~ 0
USB_DATA_0
Wire Wire Line
	1800 6550 2400 6550
Wire Wire Line
	1800 6450 2400 6450
Wire Wire Line
	1800 6350 2400 6350
Wire Wire Line
	1800 6250 2400 6250
Wire Wire Line
	1800 6150 2400 6150
Wire Wire Line
	1800 5950 2400 5950
Wire Wire Line
	1800 5850 2400 5850
Wire Wire Line
	1800 5650 2400 5650
Text Label 1800 6150 0    50   ~ 0
USB_DATA_3
Text Label 1800 6250 0    50   ~ 0
USB_DATA_4
Text Label 1800 6350 0    50   ~ 0
USB_DATA_5
Text Label 1800 6450 0    50   ~ 0
USB_DATA_6
Text Label 1800 6550 0    50   ~ 0
USB_DATA_7
Wire Wire Line
	6100 3250 5950 3250
Text GLabel 6100 3250 2    50   Output ~ 0
SD_DIR_CMD
Wire Wire Line
	6100 3350 5950 3350
Text GLabel 6100 3350 2    50   Output ~ 0
SD_DIR_DAT0
Wire Wire Line
	6100 3450 5950 3450
Text GLabel 6100 3450 2    50   Output ~ 0
SD_DIR_DAT1
NoConn ~ 5950 1050
Text GLabel 3750 4150 0    50   Output ~ 0
PMBUS_RST_B
Wire Wire Line
	3750 4150 4050 4150
NoConn ~ 4050 4350
Wire Bus Line
	7250 5850 7250 6150
Wire Bus Line
	7250 5250 7250 5550
Wire Bus Line
	2600 1750 2600 2050
Wire Bus Line
	2600 1050 2600 1350
Wire Bus Line
	1700 5550 1700 6450
$EndSCHEMATC
