EESchema Schematic File Version 4
EELAYER 30 0
EELAYER END
$Descr A3 16535 11693
encoding utf-8
Sheet 5 28
Title "ZynqMP Mezzanine FMC+ (BuZZyBoard)"
Date "2020-10-02"
Rev "1.0"
Comp "Karlsruhe Institute of Technology (KIT)"
Comment1 "Institute for Data Processing and Electronics (IPE)"
Comment2 "Luis Ardila"
Comment3 ""
Comment4 ""
$EndDescr
$Comp
L KIT_Memory:MT40A512M16LY U7
U 1 1 5E2CDB65
P 3650 5550
F 0 "U7" H 3150 3700 50  0000 C CNN
F 1 "MT40A512M16LY" H 4150 3700 50  0000 C CNN
F 2 "KIT_Package_BGA:FBGA-96_7.5x13.5mm_Layout2x3x16_P0.8mm" H 3600 7950 50  0001 C CNN
F 3 "https://www.micron.com/products/dram/ddr4-sdram/part-catalog/mt40a512m16ly-062E" H 3600 8250 50  0001 C CNN
F 4 "340-345696-TRAY " H 3650 3379 50  0001 C CNN "mouser#"
	1    3650 5550
	1    0    0    -1  
$EndComp
$Comp
L KIT_Memory:MT40A512M16LY U8
U 1 1 5E2E6071
P 8900 5550
F 0 "U8" H 8400 3700 50  0000 C CNN
F 1 "MT40A512M16LY" H 9400 3700 50  0000 C CNN
F 2 "KIT_Package_BGA:FBGA-96_7.5x13.5mm_Layout2x3x16_P0.8mm" H 8850 7950 50  0001 C CNN
F 3 "https://www.micron.com/products/dram/ddr4-sdram/part-catalog/mt40a512m16ly-062E" H 8850 8250 50  0001 C CNN
F 4 "340-345696-TRAY " H 8900 3379 50  0001 C CNN "mouser#"
	1    8900 5550
	1    0    0    -1  
$EndComp
Text Label 2450 3850 0    50   ~ 0
DDR_A0
Text Label 2450 3950 0    50   ~ 0
DDR_A1
Text Label 2450 4050 0    50   ~ 0
DDR_A2
Text Label 2450 4150 0    50   ~ 0
DDR_A3
Text Label 2450 4250 0    50   ~ 0
DDR_A4
Text Label 2450 4350 0    50   ~ 0
DDR_A5
Text Label 2450 4450 0    50   ~ 0
DDR_A6
Text Label 2450 4550 0    50   ~ 0
DDR_A7
Text Label 2450 4650 0    50   ~ 0
DDR_A8
Text Label 2450 4750 0    50   ~ 0
DDR_A9
Text Label 2450 4850 0    50   ~ 0
DDR_A10
Text Label 2450 4950 0    50   ~ 0
DDR_A11
Text Label 2450 5050 0    50   ~ 0
DDR_A12
Text Label 2450 5150 0    50   ~ 0
DDR_A13
Text Label 2450 5250 0    50   ~ 0
DDR_A14
Text Label 2450 5350 0    50   ~ 0
DDR_A15
Text Label 2450 5450 0    50   ~ 0
DDR_A16
Wire Wire Line
	2450 3850 2950 3850
Wire Wire Line
	2450 3950 2950 3950
Wire Wire Line
	2450 4050 2950 4050
Wire Wire Line
	2450 4150 2950 4150
Wire Wire Line
	2450 4250 2950 4250
Wire Wire Line
	2450 4350 2950 4350
Wire Wire Line
	2450 4450 2950 4450
Wire Wire Line
	2450 4550 2950 4550
Wire Wire Line
	2450 4650 2950 4650
Wire Wire Line
	2450 4750 2950 4750
Wire Wire Line
	2450 4850 2950 4850
Wire Wire Line
	2450 4950 2950 4950
Wire Wire Line
	2450 5050 2950 5050
Wire Wire Line
	2450 5150 2950 5150
Wire Wire Line
	2450 5250 2950 5250
Wire Wire Line
	2450 5350 2950 5350
Wire Wire Line
	2450 5450 2950 5450
Text Label 7700 3850 0    50   ~ 0
DDR_A0
Text Label 7700 3950 0    50   ~ 0
DDR_A1
Text Label 7700 4050 0    50   ~ 0
DDR_A2
Text Label 7700 4150 0    50   ~ 0
DDR_A3
Text Label 7700 4250 0    50   ~ 0
DDR_A4
Text Label 7700 4350 0    50   ~ 0
DDR_A5
Text Label 7700 4450 0    50   ~ 0
DDR_A6
Text Label 7700 4550 0    50   ~ 0
DDR_A7
Text Label 7700 4650 0    50   ~ 0
DDR_A8
Text Label 7700 4750 0    50   ~ 0
DDR_A9
Text Label 7700 4850 0    50   ~ 0
DDR_A10
Text Label 7700 4950 0    50   ~ 0
DDR_A11
Text Label 7700 5050 0    50   ~ 0
DDR_A12
Text Label 7700 5150 0    50   ~ 0
DDR_A13
Text Label 7700 5250 0    50   ~ 0
DDR_A14
Text Label 7700 5350 0    50   ~ 0
DDR_A15
Text Label 7700 5450 0    50   ~ 0
DDR_A16
Wire Wire Line
	7700 3850 8200 3850
Wire Wire Line
	7700 3950 8200 3950
Wire Wire Line
	7700 4050 8200 4050
Wire Wire Line
	7700 4150 8200 4150
Wire Wire Line
	7700 4250 8200 4250
Wire Wire Line
	7700 4350 8200 4350
Wire Wire Line
	7700 4450 8200 4450
Wire Wire Line
	7700 4550 8200 4550
Wire Wire Line
	7700 4650 8200 4650
Wire Wire Line
	7700 4750 8200 4750
Wire Wire Line
	7700 4850 8200 4850
Wire Wire Line
	7700 4950 8200 4950
Wire Wire Line
	7700 5050 8200 5050
Wire Wire Line
	7700 5150 8200 5150
Wire Wire Line
	7700 5250 8200 5250
Wire Wire Line
	7700 5350 8200 5350
Wire Wire Line
	7700 5450 8200 5450
Text Label 4900 5500 2    50   ~ 0
DDR_DQ0
Text Label 4900 5700 2    50   ~ 0
DDR_DQ1
Text Label 4900 6100 2    50   ~ 0
DDR_DQ2
Text Label 4900 5900 2    50   ~ 0
DDR_DQ3
Text Label 4900 6000 2    50   ~ 0
DDR_DQ4
Text Label 4900 5600 2    50   ~ 0
DDR_DQ5
Text Label 4900 5400 2    50   ~ 0
DDR_DQ6
Text Label 4900 5800 2    50   ~ 0
DDR_DQ7
Text Label 4900 4650 2    50   ~ 0
DDR_DQ8
Text Label 4900 4150 2    50   ~ 0
DDR_DQ9
Text Label 4900 4450 2    50   ~ 0
DDR_DQ10
Text Label 4900 4350 2    50   ~ 0
DDR_DQ11
Text Label 4900 4750 2    50   ~ 0
DDR_DQ12
Text Label 4900 4550 2    50   ~ 0
DDR_DQ13
Text Label 4900 4050 2    50   ~ 0
DDR_DQ14
Text Label 4900 4250 2    50   ~ 0
DDR_DQ15
Text Label 10150 5500 2    50   ~ 0
DDR_DQ16
Wire Wire Line
	4900 5500 4350 5500
Wire Wire Line
	4900 6100 4350 6100
Wire Wire Line
	4900 5900 4350 5900
Wire Wire Line
	4900 5700 4350 5700
Wire Wire Line
	4900 6000 4350 6000
Wire Wire Line
	4900 5400 4350 5400
Wire Wire Line
	4900 5800 4350 5800
Wire Wire Line
	4900 5600 4350 5600
Wire Wire Line
	4900 4450 4350 4450
Wire Wire Line
	4900 4050 4350 4050
Wire Wire Line
	4900 4650 4350 4650
Wire Wire Line
	4900 4250 4350 4250
Wire Wire Line
	4900 4550 4350 4550
Wire Wire Line
	4900 4150 4350 4150
Wire Wire Line
	4900 4350 4350 4350
Wire Wire Line
	4900 4750 4350 4750
Wire Wire Line
	10150 6100 9600 6100
Text Label 10150 6100 2    50   ~ 0
DDR_DQ17
Text Label 10150 6000 2    50   ~ 0
DDR_DQ18
Text Label 10150 5400 2    50   ~ 0
DDR_DQ19
Text Label 10150 5700 2    50   ~ 0
DDR_DQ20
Text Label 10150 5600 2    50   ~ 0
DDR_DQ21
Text Label 10150 5900 2    50   ~ 0
DDR_DQ22
Text Label 10150 4250 2    50   ~ 0
DDR_DQ24
Text Label 10150 4050 2    50   ~ 0
DDR_DQ25
Text Label 10150 4450 2    50   ~ 0
DDR_DQ26
Text Label 10150 4650 2    50   ~ 0
DDR_DQ27
Text Label 10150 4550 2    50   ~ 0
DDR_DQ28
Text Label 10150 4750 2    50   ~ 0
DDR_DQ29
Text Label 10150 4150 2    50   ~ 0
DDR_DQ30
Text Label 10150 4350 2    50   ~ 0
DDR_DQ31
Wire Wire Line
	10150 5700 9600 5700
Wire Wire Line
	10150 6000 9600 6000
Wire Wire Line
	10150 5600 9600 5600
Wire Wire Line
	10150 5500 9600 5500
Wire Wire Line
	10150 5400 9600 5400
Wire Wire Line
	10150 5900 9600 5900
Wire Wire Line
	10150 5800 9600 5800
Wire Wire Line
	9600 4050 10150 4050
Wire Wire Line
	10150 4450 9600 4450
Wire Wire Line
	10150 4150 9600 4150
Wire Wire Line
	10150 4250 9600 4250
Wire Wire Line
	10150 4750 9600 4750
Wire Wire Line
	10150 4650 9600 4650
Wire Wire Line
	10150 4350 9600 4350
Wire Wire Line
	10150 4550 9600 4550
Text Label 5050 6350 2    50   ~ 0
DDR_DQS_N0
Text Label 5050 5000 2    50   ~ 0
DDR_DQS_N1
Text Label 10300 6350 2    50   ~ 0
DDR_DQS_N2
Text Label 5050 6250 2    50   ~ 0
DDR_DQS_P0
Text Label 5050 4900 2    50   ~ 0
DDR_DQS_P1
Text Label 10300 6250 2    50   ~ 0
DDR_DQS_P2
Text Label 10300 4900 2    50   ~ 0
DDR_DQS_P3
Wire Wire Line
	5050 6250 4350 6250
Wire Wire Line
	5050 4900 4350 4900
Wire Wire Line
	10300 4900 9600 4900
Wire Wire Line
	5050 6350 4350 6350
Wire Wire Line
	5050 5000 4350 5000
Wire Wire Line
	10300 5000 9600 5000
Text Label 10300 5000 2    50   ~ 0
DDR_DQS_N3
Text Label 4900 5250 2    50   ~ 0
DDR_DM0
Text Label 4900 3900 2    50   ~ 0
DDR_DM1
Text Label 10150 5250 2    50   ~ 0
DDR_DM2
Text Label 10150 3900 2    50   ~ 0
DDR_DM3
Wire Wire Line
	4900 5250 4350 5250
Wire Wire Line
	4900 3900 4350 3900
Wire Wire Line
	10150 5250 9600 5250
Wire Wire Line
	10150 3900 9600 3900
Text Label 5000 7000 2    50   ~ 0
DDR_ALERT_N
Text Label 10250 7000 2    50   ~ 0
DDR_ALERT_N
Wire Wire Line
	10250 7000 9600 7000
Text Label 4850 6800 2    50   ~ 0
DDR_ZQ1
Text Label 10100 6800 2    50   ~ 0
DDR_ZQ2
Text Label 2250 7250 0    50   ~ 0
DDR_ACT_N
Text Label 2250 5950 0    50   ~ 0
DDR_BG0
Text Label 2250 5750 0    50   ~ 0
DDR_BA0
Text Label 2250 5850 0    50   ~ 0
DDR_BA1
Text Label 2250 6950 0    50   ~ 0
DDR_CK_N
Text Label 2250 6850 0    50   ~ 0
DDR_CK_P
Text Label 2250 6750 0    50   ~ 0
DDR_CKE
Text Label 2250 6150 0    50   ~ 0
DDR_PAR
Text Label 2250 6250 0    50   ~ 0
DDR_ODT
Text Label 2250 6550 0    50   ~ 0
DDR_CS_N
Text Label 2250 7050 0    50   ~ 0
DDR_RESET_N
NoConn ~ 8200 6450
NoConn ~ 2950 6450
$Comp
L KIT_Power:+DDR_VREFA #PWR?
U 1 1 5E3D9A6D
P 5450 6650
F 0 "#PWR?" H 5450 6500 50  0001 C CNN
F 1 "+DDR_VREFA" H 5465 6823 50  0000 C CNN
F 2 "" H 5450 6650 50  0001 C CNN
F 3 "" H 5450 6650 50  0001 C CNN
	1    5450 6650
	1    0    0    -1  
$EndComp
$Comp
L KIT_Power:+DDR_VTT #PWR?
U 1 1 5EC827F9
P 14500 7100
F 0 "#PWR?" H 14500 6950 50  0001 C CNN
F 1 "+DDR_VTT" H 14515 7273 50  0000 C CNN
F 2 "" H 14500 7100 50  0001 C CNN
F 3 "" H 14500 7100 50  0001 C CNN
	1    14500 7100
	1    0    0    -1  
$EndComp
$Comp
L KIT_Power:+1V2_STBY #PWR?
U 1 1 5EC827FC
P 3200 3450
F 0 "#PWR?" H 3200 3300 50  0001 C CNN
F 1 "+1V2_STBY" H 3215 3623 50  0000 C CNN
F 2 "" H 3200 3450 50  0001 C CNN
F 3 "" H 3200 3450 50  0001 C CNN
	1    3200 3450
	1    0    0    -1  
$EndComp
Wire Wire Line
	3450 3650 3450 3500
Wire Wire Line
	3450 3500 3350 3500
Wire Wire Line
	3200 3500 3200 3450
Wire Wire Line
	3350 3650 3350 3500
Connection ~ 3350 3500
Wire Wire Line
	3350 3500 3200 3500
Wire Wire Line
	3550 3650 3550 3500
Wire Wire Line
	3550 3500 3750 3500
Wire Wire Line
	3750 3500 3750 3450
$Comp
L KIT_Power:+2V5_STBY #PWR?
U 1 1 5E46E5E5
P 9000 3450
F 0 "#PWR?" H 9000 3300 50  0001 C CNN
F 1 "+2V5_STBY" H 9015 3623 50  0000 C CNN
F 2 "" H 9000 3450 50  0001 C CNN
F 3 "" H 9000 3450 50  0001 C CNN
	1    9000 3450
	1    0    0    -1  
$EndComp
$Comp
L KIT_Power:+1V2_STBY #PWR?
U 1 1 5E46E5EB
P 8450 3450
F 0 "#PWR?" H 8450 3300 50  0001 C CNN
F 1 "+1V2_STBY" H 8465 3623 50  0000 C CNN
F 2 "" H 8450 3450 50  0001 C CNN
F 3 "" H 8450 3450 50  0001 C CNN
	1    8450 3450
	1    0    0    -1  
$EndComp
Wire Wire Line
	8700 3650 8700 3500
Wire Wire Line
	8700 3500 8600 3500
Wire Wire Line
	8450 3500 8450 3450
Wire Wire Line
	8600 3650 8600 3500
Connection ~ 8600 3500
Wire Wire Line
	8600 3500 8450 3500
Wire Wire Line
	8800 3650 8800 3500
Wire Wire Line
	8800 3500 9000 3500
Wire Wire Line
	9000 3500 9000 3450
Wire Wire Line
	4350 6700 5450 6700
Wire Wire Line
	5450 6650 5450 6700
$Comp
L Device:C C84
U 1 1 5EC82800
P 5450 6900
F 0 "C84" H 5565 6946 50  0000 L CNN
F 1 "1uF" H 5565 6855 50  0000 L CNN
F 2 "Capacitor_SMD:C_0402_1005Metric" H 5488 6750 50  0001 C CNN
F 3 "~" H 5450 6900 50  0001 C CNN
F 4 "16 V" H 5350 7000 50  0001 C CNN "info"
F 5 "AVT-IPE" H 5450 6900 50  0001 C CNN "stock"
	1    5450 6900
	1    0    0    -1  
$EndComp
$Comp
L power:GND #PWR?
U 1 1 5EC82801
P 5450 7050
F 0 "#PWR?" H 5450 6800 50  0001 C CNN
F 1 "GND" H 5455 6877 50  0000 C CNN
F 2 "" H 5450 7050 50  0001 C CNN
F 3 "" H 5450 7050 50  0001 C CNN
	1    5450 7050
	1    0    0    -1  
$EndComp
Wire Wire Line
	5450 6750 5450 6700
$Comp
L KIT_Power:+DDR_VREFA #PWR?
U 1 1 5E5994EC
P 10700 6650
F 0 "#PWR?" H 10700 6500 50  0001 C CNN
F 1 "+DDR_VREFA" H 10715 6823 50  0000 C CNN
F 2 "" H 10700 6650 50  0001 C CNN
F 3 "" H 10700 6650 50  0001 C CNN
	1    10700 6650
	1    0    0    -1  
$EndComp
Wire Wire Line
	9600 6700 10700 6700
Wire Wire Line
	10700 6650 10700 6700
$Comp
L Device:C C93
U 1 1 5E5994F6
P 10700 6900
F 0 "C93" H 10815 6946 50  0000 L CNN
F 1 "1uF" H 10815 6855 50  0000 L CNN
F 2 "Capacitor_SMD:C_0402_1005Metric" H 10738 6750 50  0001 C CNN
F 3 "~" H 10700 6900 50  0001 C CNN
F 4 "16 V" H 10600 7000 50  0001 C CNN "info"
F 5 "AVT-IPE" H 10700 6900 50  0001 C CNN "stock"
	1    10700 6900
	1    0    0    -1  
$EndComp
$Comp
L power:GND #PWR?
U 1 1 5EC82804
P 10700 7050
F 0 "#PWR?" H 10700 6800 50  0001 C CNN
F 1 "GND" H 10705 6877 50  0000 C CNN
F 2 "" H 10700 7050 50  0001 C CNN
F 3 "" H 10700 7050 50  0001 C CNN
	1    10700 7050
	1    0    0    -1  
$EndComp
Wire Wire Line
	10700 6750 10700 6700
$Comp
L power:GND #PWR?
U 1 1 5E5C7A30
P 7250 7500
F 0 "#PWR?" H 7250 7250 50  0001 C CNN
F 1 "GND" H 7255 7327 50  0000 C CNN
F 2 "" H 7250 7500 50  0001 C CNN
F 3 "" H 7250 7500 50  0001 C CNN
	1    7250 7500
	1    0    0    -1  
$EndComp
$Comp
L KIT_Power:+1V2_STBY #PWR?
U 1 1 5E5E9FE0
P 15150 8750
F 0 "#PWR?" H 15150 8600 50  0001 C CNN
F 1 "+1V2_STBY" H 15165 8923 50  0000 C CNN
F 2 "" H 15150 8750 50  0001 C CNN
F 3 "" H 15150 8750 50  0001 C CNN
	1    15150 8750
	1    0    0    -1  
$EndComp
$Comp
L power:GND #PWR?
U 1 1 5E622ED1
P 8900 7600
F 0 "#PWR?" H 8900 7350 50  0001 C CNN
F 1 "GND" H 8905 7427 50  0000 C CNN
F 2 "" H 8900 7600 50  0001 C CNN
F 3 "" H 8900 7600 50  0001 C CNN
	1    8900 7600
	1    0    0    -1  
$EndComp
Wire Wire Line
	8900 7600 8900 7550
Wire Wire Line
	8900 7550 9000 7550
Wire Wire Line
	9000 7550 9000 7450
Wire Wire Line
	8900 7450 8900 7550
Connection ~ 8900 7550
$Comp
L power:GND #PWR?
U 1 1 5E64AC72
P 3650 7600
F 0 "#PWR?" H 3650 7350 50  0001 C CNN
F 1 "GND" H 3655 7427 50  0000 C CNN
F 2 "" H 3650 7600 50  0001 C CNN
F 3 "" H 3650 7600 50  0001 C CNN
	1    3650 7600
	1    0    0    -1  
$EndComp
Wire Wire Line
	3650 7600 3650 7550
Wire Wire Line
	3650 7550 3750 7550
Wire Wire Line
	3750 7550 3750 7450
Wire Wire Line
	3650 7450 3650 7550
Connection ~ 3650 7550
Connection ~ 5450 6700
Connection ~ 10700 6700
Wire Wire Line
	2200 1100 2200 1050
Wire Wire Line
	2000 1500 2000 1450
$Comp
L power:GND #PWR?
U 1 1 5E73C05B
P 2000 1500
F 0 "#PWR?" H 2000 1250 50  0001 C CNN
F 1 "GND" H 2005 1327 50  0000 C CNN
F 2 "" H 2000 1500 50  0001 C CNN
F 3 "" H 2000 1500 50  0001 C CNN
	1    2000 1500
	1    0    0    -1  
$EndComp
Wire Wire Line
	2650 1100 2650 1050
Wire Wire Line
	2200 1400 2200 1450
Connection ~ 2200 1450
Wire Wire Line
	2650 1400 2650 1450
Wire Wire Line
	2650 1450 2200 1450
Wire Wire Line
	2000 1050 2000 1000
Connection ~ 2200 1050
Wire Wire Line
	2650 1050 2200 1050
$Comp
L KIT_Power:+1V2_STBY #PWR?
U 1 1 5EC8280D
P 2000 1000
F 0 "#PWR?" H 2000 850 50  0001 C CNN
F 1 "+1V2_STBY" H 2015 1173 50  0000 C CNN
F 2 "" H 2000 1000 50  0001 C CNN
F 3 "" H 2000 1000 50  0001 C CNN
	1    2000 1000
	1    0    0    -1  
$EndComp
$Comp
L KIT_Power:+2V5_STBY #PWR?
U 1 1 5EA17855
P 4600 1000
F 0 "#PWR?" H 4600 850 50  0001 C CNN
F 1 "+2V5_STBY" H 4615 1173 50  0000 C CNN
F 2 "" H 4600 1000 50  0001 C CNN
F 3 "" H 4600 1000 50  0001 C CNN
	1    4600 1000
	1    0    0    -1  
$EndComp
Text Label 13200 3400 0    50   ~ 0
DDR_A0
Text Label 13200 3300 0    50   ~ 0
DDR_A2
Text Label 13200 4800 0    50   ~ 0
DDR_A3
Text Label 13200 5800 0    50   ~ 0
DDR_A4
Text Label 13200 4300 0    50   ~ 0
DDR_A6
Text Label 13200 4200 0    50   ~ 0
DDR_A8
Text Label 13200 5700 0    50   ~ 0
DDR_A10
Text Label 13200 4900 0    50   ~ 0
DDR_A12
Text Label 13200 6700 0    50   ~ 0
DDR_A15
Text Label 13200 6400 0    50   ~ 0
DDR_A16
Wire Wire Line
	14150 7250 14500 7250
Text Label 7500 5950 0    50   ~ 0
DDR_BG0
Wire Wire Line
	7500 5950 8200 5950
Text Label 7500 5750 0    50   ~ 0
DDR_BA0
Text Label 7500 5850 0    50   ~ 0
DDR_BA1
Wire Wire Line
	7500 5750 8200 5750
Wire Wire Line
	7500 5850 8200 5850
Wire Wire Line
	7500 6850 8200 6850
Text Label 7500 6950 0    50   ~ 0
DDR_CK_N
Wire Wire Line
	7500 6950 8200 6950
Text Label 7500 6850 0    50   ~ 0
DDR_CK_P
Text Label 7500 6750 0    50   ~ 0
DDR_CKE
Wire Wire Line
	7500 6750 8200 6750
Text Label 7500 6150 0    50   ~ 0
DDR_PAR
Wire Wire Line
	7500 6150 8200 6150
Text Label 7500 6250 0    50   ~ 0
DDR_ODT
Wire Wire Line
	7500 6250 8200 6250
Text Label 7500 6550 0    50   ~ 0
DDR_CS_N
Wire Wire Line
	7500 6550 8200 6550
Text Label 7500 7050 0    50   ~ 0
DDR_RESET_N
Wire Wire Line
	7500 7050 8200 7050
Text Label 7500 7250 0    50   ~ 0
DDR_ACT_N
Wire Wire Line
	7500 7250 8200 7250
Text Label 13200 5900 0    50   ~ 0
DDR_BG0
Text Label 13200 4000 0    50   ~ 0
DDR_BA0
Text Label 13200 7250 0    50   ~ 0
DDR_BA1
Wire Wire Line
	13150 8750 13850 8750
Text Label 13150 8850 0    50   ~ 0
DDR_CK_N
Wire Wire Line
	13150 8850 13850 8850
Text Label 13150 8750 0    50   ~ 0
DDR_CK_P
Text Label 13200 3200 0    50   ~ 0
DDR_PAR
Text Label 13200 5100 0    50   ~ 0
DDR_ODT
Text Label 13150 7850 0    50   ~ 0
DDR_RESET_N
Wire Wire Line
	13150 7850 13850 7850
Text Label 13200 5600 0    50   ~ 0
DDR_ACT_N
$Comp
L Device:C C90
U 1 1 5EC8282C
P 14650 8800
F 0 "C90" V 14398 8800 50  0000 C CNN
F 1 "10nF" V 14489 8800 50  0000 C CNN
F 2 "Capacitor_SMD:C_0402_1005Metric" H 14688 8650 50  0001 C CNN
F 3 "~" H 14650 8800 50  0001 C CNN
F 4 "AVT-IPE" H 14650 8800 50  0001 C CNN "stock"
	1    14650 8800
	0    1    1    0   
$EndComp
Wire Wire Line
	14150 8750 14300 8750
Wire Wire Line
	14300 8850 14150 8850
Wire Wire Line
	14300 8750 14300 8800
Wire Wire Line
	14500 8800 14300 8800
Connection ~ 14300 8800
Wire Wire Line
	14300 8800 14300 8850
Wire Wire Line
	14800 8800 15150 8800
Wire Wire Line
	15150 8750 15150 8800
$Comp
L KIT_Power:+DDR_VTT #PWR?
U 1 1 6014FEAD
P 14500 2300
F 0 "#PWR?" H 14500 2150 50  0001 C CNN
F 1 "+DDR_VTT" H 14515 2473 50  0000 C CNN
F 2 "" H 14500 2300 50  0001 C CNN
F 3 "" H 14500 2300 50  0001 C CNN
	1    14500 2300
	1    0    0    -1  
$EndComp
Wire Wire Line
	14200 2400 14500 2400
Wire Wire Line
	14200 2500 14500 2500
Wire Wire Line
	14200 2600 14500 2600
Wire Wire Line
	14200 2700 14500 2700
Wire Wire Line
	14500 2300 14500 2400
Connection ~ 14500 2400
Wire Wire Line
	14500 2400 14500 2500
Connection ~ 14500 2500
Wire Wire Line
	14500 2500 14500 2600
Connection ~ 14500 2600
Wire Wire Line
	14500 2600 14500 2700
$Comp
L KIT_Power:+DDR_VTT #PWR?
U 1 1 602099F4
P 14500 3100
F 0 "#PWR?" H 14500 2950 50  0001 C CNN
F 1 "+DDR_VTT" H 14515 3273 50  0000 C CNN
F 2 "" H 14500 3100 50  0001 C CNN
F 3 "" H 14500 3100 50  0001 C CNN
	1    14500 3100
	1    0    0    -1  
$EndComp
Wire Wire Line
	14200 3200 14500 3200
Wire Wire Line
	14200 3300 14500 3300
Wire Wire Line
	14200 3400 14500 3400
Wire Wire Line
	14200 3500 14500 3500
Wire Wire Line
	14500 3100 14500 3200
Connection ~ 14500 3200
Wire Wire Line
	14500 3200 14500 3300
Connection ~ 14500 3300
Wire Wire Line
	14500 3300 14500 3400
Connection ~ 14500 3400
Wire Wire Line
	14500 3400 14500 3500
$Comp
L Device:R_Pack04 RN5
U 1 1 60343D0D
P 14000 5800
F 0 "RN5" V 13583 5800 50  0000 C CNN
F 1 "39" V 13674 5800 50  0000 C CNN
F 2 "Resistor_SMD:R_Array_Convex_4x0402" V 14275 5800 50  0001 C CNN
F 3 "~" H 14000 5800 50  0001 C CNN
	1    14000 5800
	0    1    1    0   
$EndComp
Wire Wire Line
	14200 4000 14500 4000
Wire Wire Line
	14200 4100 14500 4100
Wire Wire Line
	14200 4200 14500 4200
Wire Wire Line
	14200 4300 14500 4300
Wire Wire Line
	14500 3900 14500 4000
Connection ~ 14500 4000
Wire Wire Line
	14500 4000 14500 4100
Connection ~ 14500 4100
Wire Wire Line
	14500 4100 14500 4200
Connection ~ 14500 4200
Wire Wire Line
	14500 4200 14500 4300
Wire Wire Line
	14200 4800 14500 4800
Wire Wire Line
	14200 4900 14500 4900
Wire Wire Line
	14200 5000 14500 5000
Wire Wire Line
	14200 5100 14500 5100
Wire Wire Line
	14500 4700 14500 4800
Connection ~ 14500 4800
Wire Wire Line
	14500 4800 14500 4900
Connection ~ 14500 4900
Wire Wire Line
	14500 4900 14500 5000
Connection ~ 14500 5000
Wire Wire Line
	14500 5000 14500 5100
Wire Wire Line
	14200 5600 14500 5600
Wire Wire Line
	14200 5700 14500 5700
Wire Wire Line
	14200 5800 14500 5800
Wire Wire Line
	14200 5900 14500 5900
Wire Wire Line
	14500 5500 14500 5600
Connection ~ 14500 5600
Wire Wire Line
	14500 5600 14500 5700
Connection ~ 14500 5700
Wire Wire Line
	14500 5700 14500 5800
Connection ~ 14500 5800
Wire Wire Line
	14500 5800 14500 5900
Wire Wire Line
	14200 6400 14500 6400
Wire Wire Line
	14200 6500 14500 6500
Wire Wire Line
	14200 6600 14500 6600
Wire Wire Line
	14200 6700 14500 6700
Wire Wire Line
	14500 6300 14500 6400
Connection ~ 14500 6400
Wire Wire Line
	14500 6400 14500 6500
Connection ~ 14500 6500
Wire Wire Line
	14500 6500 14500 6600
Connection ~ 14500 6600
Wire Wire Line
	14500 6600 14500 6700
Wire Wire Line
	13100 1450 12650 1450
Wire Wire Line
	12650 1450 12650 1400
$Comp
L power:GND #PWR?
U 1 1 604303E5
P 12450 1500
F 0 "#PWR?" H 12450 1250 50  0001 C CNN
F 1 "GND" H 12455 1327 50  0000 C CNN
F 2 "" H 12450 1500 50  0001 C CNN
F 3 "" H 12450 1500 50  0001 C CNN
	1    12450 1500
	1    0    0    -1  
$EndComp
Wire Wire Line
	13100 1450 13100 1400
Wire Wire Line
	12650 1100 12650 1050
Wire Wire Line
	13100 1100 13100 1050
Wire Wire Line
	13100 1050 12650 1050
$Comp
L Device:R R46
U 1 1 5EC82841
P 14000 7850
F 0 "R46" V 14115 7850 50  0000 C CNN
F 1 "4.7k" V 14206 7850 50  0000 C CNN
F 2 "Resistor_SMD:R_0402_1005Metric" V 13930 7850 50  0001 C CNN
F 3 "~" H 14000 7850 50  0001 C CNN
F 4 "AVT-IPE" H 14000 7850 50  0001 C CNN "stock"
	1    14000 7850
	0    1    1    0   
$EndComp
$Comp
L power:GND #PWR?
U 1 1 5EC82842
P 14500 7900
F 0 "#PWR?" H 14500 7650 50  0001 C CNN
F 1 "GND" H 14505 7727 50  0000 C CNN
F 2 "" H 14500 7900 50  0001 C CNN
F 3 "" H 14500 7900 50  0001 C CNN
	1    14500 7900
	1    0    0    -1  
$EndComp
Wire Wire Line
	14500 7900 14500 7850
Wire Wire Line
	14500 7850 14150 7850
Text Label 13150 7750 0    50   ~ 0
DDR_ALERT_N
Wire Wire Line
	13850 7750 13150 7750
$Comp
L Device:R R43
U 1 1 5EC82843
P 14000 7750
F 0 "R43" V 13793 7750 50  0000 C CNN
F 1 "39" V 13884 7750 50  0000 C CNN
F 2 "Resistor_SMD:R_0402_1005Metric" V 13930 7750 50  0001 C CNN
F 3 "~" H 14000 7750 50  0001 C CNN
F 4 "AVT-IPE" H 14000 7750 50  0001 C CNN "stock"
	1    14000 7750
	0    1    1    0   
$EndComp
$Comp
L Device:R R44
U 1 1 5EC82844
P 14000 8750
F 0 "R44" V 13793 8750 50  0000 C CNN
F 1 "39" V 13884 8750 50  0000 C CNN
F 2 "Resistor_SMD:R_0402_1005Metric" V 13930 8750 50  0001 C CNN
F 3 "~" H 14000 8750 50  0001 C CNN
F 4 "AVT-IPE" H 14000 8750 50  0001 C CNN "stock"
	1    14000 8750
	0    1    1    0   
$EndComp
$Comp
L Device:R R45
U 1 1 60ACEFF5
P 14000 8850
F 0 "R45" V 14115 8850 50  0000 C CNN
F 1 "39" V 14206 8850 50  0000 C CNN
F 2 "Resistor_SMD:R_0402_1005Metric" V 13930 8850 50  0001 C CNN
F 3 "~" H 14000 8850 50  0001 C CNN
F 4 "AVT-IPE" H 14000 8850 50  0001 C CNN "stock"
	1    14000 8850
	0    1    1    0   
$EndComp
$Comp
L KIT_Power:+1V2_STBY #PWR?
U 1 1 60AD6E61
P 14500 7700
F 0 "#PWR?" H 14500 7550 50  0001 C CNN
F 1 "+1V2_STBY" H 14515 7873 50  0000 C CNN
F 2 "" H 14500 7700 50  0001 C CNN
F 3 "" H 14500 7700 50  0001 C CNN
	1    14500 7700
	1    0    0    -1  
$EndComp
Wire Wire Line
	14150 7750 14500 7750
Wire Wire Line
	14500 7700 14500 7750
$Comp
L Device:R_Pack04 RN3
U 1 1 611BFB09
P 14000 4200
F 0 "RN3" V 13583 4200 50  0000 C CNN
F 1 "39" V 13674 4200 50  0000 C CNN
F 2 "Resistor_SMD:R_Array_Convex_4x0402" V 14275 4200 50  0001 C CNN
F 3 "~" H 14000 4200 50  0001 C CNN
	1    14000 4200
	0    1    1    0   
$EndComp
$Comp
L Device:R_Pack04 RN4
U 1 1 6120C435
P 14000 5000
F 0 "RN4" V 13583 5000 50  0000 C CNN
F 1 "39" V 13674 5000 50  0000 C CNN
F 2 "Resistor_SMD:R_Array_Convex_4x0402" V 14275 5000 50  0001 C CNN
F 3 "~" H 14000 5000 50  0001 C CNN
	1    14000 5000
	0    1    1    0   
$EndComp
$Comp
L Device:R_Pack04 RN1
U 1 1 6125911E
P 14000 2600
F 0 "RN1" V 13583 2600 50  0000 C CNN
F 1 "39" V 13674 2600 50  0000 C CNN
F 2 "Resistor_SMD:R_Array_Convex_4x0402" V 14275 2600 50  0001 C CNN
F 3 "~" H 14000 2600 50  0001 C CNN
	1    14000 2600
	0    1    1    0   
$EndComp
$Comp
L Device:R_Pack04 RN2
U 1 1 612A5BDE
P 14000 3400
F 0 "RN2" V 13583 3400 50  0000 C CNN
F 1 "39" V 13674 3400 50  0000 C CNN
F 2 "Resistor_SMD:R_Array_Convex_4x0402" V 14275 3400 50  0001 C CNN
F 3 "~" H 14000 3400 50  0001 C CNN
	1    14000 3400
	0    1    1    0   
$EndComp
$Comp
L KIT_Power:+2V5_STBY #PWR?
U 1 1 5E3DF4E3
P 3750 3450
F 0 "#PWR?" H 3750 3300 50  0001 C CNN
F 1 "+2V5_STBY" H 3765 3623 50  0000 C CNN
F 2 "" H 3750 3450 50  0001 C CNN
F 3 "" H 3750 3450 50  0001 C CNN
	1    3750 3450
	1    0    0    -1  
$EndComp
Wire Wire Line
	2000 1050 2200 1050
Wire Wire Line
	2000 1450 2200 1450
$Comp
L Device:C C80
U 1 1 5EC8281C
P 12650 1250
F 0 "C80" H 12765 1296 50  0000 L CNN
F 1 "10uF" H 12765 1205 50  0000 L CNN
F 2 "Capacitor_SMD:C_0603_1608Metric" H 12688 1100 50  0001 C CNN
F 3 "~" H 12650 1250 50  0001 C CNN
F 4 "AVT-IPE" H 12650 1250 50  0001 C CNN "stock"
F 5 "25V" H 12550 1350 50  0000 C CNN "info"
	1    12650 1250
	1    0    0    -1  
$EndComp
Wire Wire Line
	12450 1450 12450 1500
$Comp
L Device:R R18
U 1 1 5F1F9FB5
P 14000 7250
F 0 "R18" V 13793 7250 50  0000 C CNN
F 1 "39" V 13884 7250 50  0000 C CNN
F 2 "Resistor_SMD:R_0402_1005Metric" V 13930 7250 50  0001 C CNN
F 3 "~" H 14000 7250 50  0001 C CNN
F 4 "AVT-IPE" H 14000 7250 50  0001 C CNN "stock"
	1    14000 7250
	0    1    1    0   
$EndComp
$Comp
L Device:C C75
U 1 1 5EC82829
P 2200 1250
F 0 "C75" H 2315 1341 50  0000 L CNN
F 1 "10uF" H 2315 1250 50  0000 L CNN
F 2 "Capacitor_SMD:C_0603_1608Metric" H 2238 1100 50  0001 C CNN
F 3 "~" H 2200 1250 50  0001 C CNN
F 4 "AVT-IPE" H 2200 1250 50  0001 C CNN "stock"
F 5 "25V" H 2315 1159 50  0000 L CNN "info"
	1    2200 1250
	1    0    0    -1  
$EndComp
$Comp
L Device:C C76
U 1 1 5EC8282A
P 2650 1250
F 0 "C76" H 2535 1296 50  0000 R CNN
F 1 "0.1uF" H 2535 1205 50  0000 R CNN
F 2 "Capacitor_SMD:C_0402_1005Metric" H 2688 1100 50  0001 C CNN
F 3 "~" H 2650 1250 50  0001 C CNN
F 4 "16 V" H 2650 1250 50  0001 C CNN "info"
F 5 "AVT-IPE" H 2650 1250 50  0001 C CNN "stock"
	1    2650 1250
	-1   0    0    -1  
$EndComp
Connection ~ 2650 1050
Connection ~ 2650 1450
$Comp
L Device:C C77
U 1 1 5EC8282B
P 3100 1250
F 0 "C77" H 2985 1296 50  0000 R CNN
F 1 "0.1uF" H 2985 1205 50  0000 R CNN
F 2 "Capacitor_SMD:C_0402_1005Metric" H 3138 1100 50  0001 C CNN
F 3 "~" H 3100 1250 50  0001 C CNN
F 4 "16 V" H 3100 1250 50  0001 C CNN "info"
F 5 "AVT-IPE" H 3100 1250 50  0001 C CNN "stock"
	1    3100 1250
	-1   0    0    -1  
$EndComp
Wire Wire Line
	3550 1050 3100 1050
Connection ~ 3550 1050
Wire Wire Line
	3100 1050 2650 1050
Connection ~ 3100 1050
Wire Wire Line
	4000 1050 3550 1050
Wire Wire Line
	3550 1450 3100 1450
Connection ~ 3550 1450
Wire Wire Line
	3550 1400 3550 1450
Wire Wire Line
	3100 1450 2650 1450
Connection ~ 3100 1450
Wire Wire Line
	3100 1400 3100 1450
Wire Wire Line
	4000 1450 3550 1450
Wire Wire Line
	4000 1400 4000 1450
Wire Wire Line
	4000 1100 4000 1050
Wire Wire Line
	3550 1100 3550 1050
Wire Wire Line
	3100 1100 3100 1050
$Comp
L Device:C C78
U 1 1 5EC8282D
P 3550 1250
F 0 "C78" H 3435 1296 50  0000 R CNN
F 1 "0.1uF" H 3435 1205 50  0000 R CNN
F 2 "Capacitor_SMD:C_0402_1005Metric" H 3588 1100 50  0001 C CNN
F 3 "~" H 3550 1250 50  0001 C CNN
F 4 "16 V" H 3550 1250 50  0001 C CNN "info"
F 5 "AVT-IPE" H 3550 1250 50  0001 C CNN "stock"
	1    3550 1250
	-1   0    0    -1  
$EndComp
$Comp
L Device:C C79
U 1 1 5EC8282E
P 4000 1250
F 0 "C79" H 3885 1296 50  0000 R CNN
F 1 "0.1uF" H 3885 1205 50  0000 R CNN
F 2 "Capacitor_SMD:C_0402_1005Metric" H 4038 1100 50  0001 C CNN
F 3 "~" H 4000 1250 50  0001 C CNN
F 4 "16 V" H 4000 1250 50  0001 C CNN "info"
F 5 "AVT-IPE" H 4000 1250 50  0001 C CNN "stock"
	1    4000 1250
	-1   0    0    -1  
$EndComp
$Comp
L Device:C C82
U 1 1 5EC8282F
P 4800 1250
F 0 "C82" H 4915 1341 50  0000 L CNN
F 1 "10uF" H 4915 1250 50  0000 L CNN
F 2 "Capacitor_SMD:C_0603_1608Metric" H 4838 1100 50  0001 C CNN
F 3 "~" H 4800 1250 50  0001 C CNN
F 4 "AVT-IPE" H 4800 1250 50  0001 C CNN "stock"
F 5 "25V" H 4915 1159 50  0000 L CNN "info"
	1    4800 1250
	1    0    0    -1  
$EndComp
Wire Wire Line
	4800 1100 4800 1050
Wire Wire Line
	5250 1100 5250 1050
Wire Wire Line
	5250 1400 5250 1450
Wire Wire Line
	5250 1450 4800 1450
Wire Wire Line
	4800 1400 4800 1450
Wire Wire Line
	5250 1050 4800 1050
$Comp
L Device:C C83
U 1 1 5FEF905E
P 5250 1250
F 0 "C83" H 5135 1296 50  0000 R CNN
F 1 "1uF" H 5135 1205 50  0000 R CNN
F 2 "Capacitor_SMD:C_0402_1005Metric" H 5288 1100 50  0001 C CNN
F 3 "~" H 5250 1250 50  0001 C CNN
F 4 "16 V" H 5250 1250 50  0001 C CNN "info"
F 5 "AVT-IPE" H 5250 1250 50  0001 C CNN "stock"
	1    5250 1250
	-1   0    0    -1  
$EndComp
Wire Wire Line
	4800 1050 4600 1050
Wire Wire Line
	4600 1000 4600 1050
Connection ~ 4800 1050
Wire Wire Line
	4800 1450 4600 1450
Wire Wire Line
	4600 1500 4600 1450
Connection ~ 4800 1450
$Comp
L power:GND #PWR?
U 1 1 5FEF9078
P 4600 1500
F 0 "#PWR?" H 4600 1250 50  0001 C CNN
F 1 "GND" H 4605 1327 50  0000 C CNN
F 2 "" H 4600 1500 50  0001 C CNN
F 3 "" H 4600 1500 50  0001 C CNN
	1    4600 1500
	1    0    0    -1  
$EndComp
Wire Wire Line
	7000 1100 7000 1050
Wire Wire Line
	6800 1500 6800 1450
$Comp
L power:GND #PWR?
U 1 1 601BCB9C
P 6800 1500
F 0 "#PWR?" H 6800 1250 50  0001 C CNN
F 1 "GND" H 6805 1327 50  0000 C CNN
F 2 "" H 6800 1500 50  0001 C CNN
F 3 "" H 6800 1500 50  0001 C CNN
	1    6800 1500
	1    0    0    -1  
$EndComp
Wire Wire Line
	7450 1100 7450 1050
Wire Wire Line
	7000 1400 7000 1450
Connection ~ 7000 1450
Wire Wire Line
	7450 1400 7450 1450
Wire Wire Line
	7450 1450 7000 1450
Wire Wire Line
	6800 1050 6800 1000
Connection ~ 7000 1050
Wire Wire Line
	7450 1050 7000 1050
$Comp
L KIT_Power:+1V2_STBY #PWR?
U 1 1 601BCBAA
P 6800 1000
F 0 "#PWR?" H 6800 850 50  0001 C CNN
F 1 "+1V2_STBY" H 6815 1173 50  0000 C CNN
F 2 "" H 6800 1000 50  0001 C CNN
F 3 "" H 6800 1000 50  0001 C CNN
	1    6800 1000
	1    0    0    -1  
$EndComp
$Comp
L KIT_Power:+2V5_STBY #PWR?
U 1 1 601BCBB0
P 10300 1000
F 0 "#PWR?" H 10300 850 50  0001 C CNN
F 1 "+2V5_STBY" H 10315 1173 50  0000 C CNN
F 2 "" H 10300 1000 50  0001 C CNN
F 3 "" H 10300 1000 50  0001 C CNN
	1    10300 1000
	1    0    0    -1  
$EndComp
Wire Wire Line
	6800 1050 7000 1050
Wire Wire Line
	6800 1450 7000 1450
$Comp
L Device:C C85
U 1 1 601BCBBA
P 7000 1250
F 0 "C85" H 7115 1341 50  0000 L CNN
F 1 "10uF" H 7115 1250 50  0000 L CNN
F 2 "Capacitor_SMD:C_0603_1608Metric" H 7038 1100 50  0001 C CNN
F 3 "~" H 7000 1250 50  0001 C CNN
F 4 "AVT-IPE" H 7000 1250 50  0001 C CNN "stock"
F 5 "25V" H 7115 1159 50  0000 L CNN "info"
	1    7000 1250
	1    0    0    -1  
$EndComp
$Comp
L Device:C C86
U 1 1 601BCBC2
P 7450 1250
F 0 "C86" H 7335 1296 50  0000 R CNN
F 1 "0.1uF" H 7335 1205 50  0000 R CNN
F 2 "Capacitor_SMD:C_0402_1005Metric" H 7488 1100 50  0001 C CNN
F 3 "~" H 7450 1250 50  0001 C CNN
F 4 "16 V" H 7450 1250 50  0001 C CNN "info"
F 5 "AVT-IPE" H 7450 1250 50  0001 C CNN "stock"
	1    7450 1250
	-1   0    0    -1  
$EndComp
Connection ~ 7450 1050
Connection ~ 7450 1450
$Comp
L Device:C C87
U 1 1 601BCBCC
P 7900 1250
F 0 "C87" H 7785 1296 50  0000 R CNN
F 1 "0.1uF" H 7785 1205 50  0000 R CNN
F 2 "Capacitor_SMD:C_0402_1005Metric" H 7938 1100 50  0001 C CNN
F 3 "~" H 7900 1250 50  0001 C CNN
F 4 "16 V" H 7900 1250 50  0001 C CNN "info"
F 5 "AVT-IPE" H 7900 1250 50  0001 C CNN "stock"
	1    7900 1250
	-1   0    0    -1  
$EndComp
Wire Wire Line
	8350 1050 7900 1050
Connection ~ 8350 1050
Wire Wire Line
	7900 1050 7450 1050
Connection ~ 7900 1050
Wire Wire Line
	8800 1050 8350 1050
Wire Wire Line
	8350 1450 7900 1450
Connection ~ 8350 1450
Wire Wire Line
	8350 1400 8350 1450
Wire Wire Line
	7900 1450 7450 1450
Connection ~ 7900 1450
Wire Wire Line
	7900 1400 7900 1450
Wire Wire Line
	8800 1450 8350 1450
Wire Wire Line
	8800 1400 8800 1450
Wire Wire Line
	8800 1100 8800 1050
Wire Wire Line
	8350 1100 8350 1050
Wire Wire Line
	7900 1100 7900 1050
$Comp
L Device:C C88
U 1 1 5EC82839
P 8350 1250
F 0 "C88" H 8235 1296 50  0000 R CNN
F 1 "0.1uF" H 8235 1205 50  0000 R CNN
F 2 "Capacitor_SMD:C_0402_1005Metric" H 8388 1100 50  0001 C CNN
F 3 "~" H 8350 1250 50  0001 C CNN
F 4 "16 V" H 8350 1250 50  0001 C CNN "info"
F 5 "AVT-IPE" H 8350 1250 50  0001 C CNN "stock"
	1    8350 1250
	-1   0    0    -1  
$EndComp
$Comp
L Device:C C89
U 1 1 601BCBEC
P 8800 1250
F 0 "C89" H 8685 1296 50  0000 R CNN
F 1 "0.1uF" H 8685 1205 50  0000 R CNN
F 2 "Capacitor_SMD:C_0402_1005Metric" H 8838 1100 50  0001 C CNN
F 3 "~" H 8800 1250 50  0001 C CNN
F 4 "16 V" H 8800 1250 50  0001 C CNN "info"
F 5 "AVT-IPE" H 8800 1250 50  0001 C CNN "stock"
	1    8800 1250
	-1   0    0    -1  
$EndComp
$Comp
L Device:C C91
U 1 1 5EC8283B
P 10500 1250
F 0 "C91" H 10615 1341 50  0000 L CNN
F 1 "10uF" H 10615 1250 50  0000 L CNN
F 2 "Capacitor_SMD:C_0603_1608Metric" H 10538 1100 50  0001 C CNN
F 3 "~" H 10500 1250 50  0001 C CNN
F 4 "AVT-IPE" H 10500 1250 50  0001 C CNN "stock"
F 5 "25V" H 10615 1159 50  0000 L CNN "info"
	1    10500 1250
	1    0    0    -1  
$EndComp
Wire Wire Line
	10500 1100 10500 1050
Wire Wire Line
	10950 1100 10950 1050
Wire Wire Line
	10950 1400 10950 1450
Wire Wire Line
	10950 1450 10500 1450
Wire Wire Line
	10500 1400 10500 1450
Wire Wire Line
	10950 1050 10500 1050
$Comp
L Device:C C92
U 1 1 5EC8283C
P 10950 1250
F 0 "C92" H 10835 1341 50  0000 R CNN
F 1 "1uF" H 10835 1250 50  0000 R CNN
F 2 "Capacitor_SMD:C_0402_1005Metric" H 10988 1100 50  0001 C CNN
F 3 "~" H 10950 1250 50  0001 C CNN
F 4 "16 V" H 10835 1159 50  0000 R CNN "info"
F 5 "AVT-IPE" H 10950 1250 50  0001 C CNN "stock"
	1    10950 1250
	-1   0    0    -1  
$EndComp
Wire Wire Line
	10500 1050 10300 1050
Wire Wire Line
	10300 1000 10300 1050
Connection ~ 10500 1050
Wire Wire Line
	10500 1450 10300 1450
Wire Wire Line
	10300 1500 10300 1450
Connection ~ 10500 1450
$Comp
L power:GND #PWR?
U 1 1 601BCC0E
P 10300 1500
F 0 "#PWR?" H 10300 1250 50  0001 C CNN
F 1 "GND" H 10305 1327 50  0000 C CNN
F 2 "" H 10300 1500 50  0001 C CNN
F 3 "" H 10300 1500 50  0001 C CNN
	1    10300 1500
	1    0    0    -1  
$EndComp
$Comp
L KIT_Power:+DDR_VTT #PWR?
U 1 1 5F99E0F5
P 14500 3900
F 0 "#PWR?" H 14500 3750 50  0001 C CNN
F 1 "+DDR_VTT" H 14515 4073 50  0000 C CNN
F 2 "" H 14500 3900 50  0001 C CNN
F 3 "" H 14500 3900 50  0001 C CNN
	1    14500 3900
	1    0    0    -1  
$EndComp
$Comp
L KIT_Power:+DDR_VTT #PWR?
U 1 1 5F99F6E5
P 14500 4700
F 0 "#PWR?" H 14500 4550 50  0001 C CNN
F 1 "+DDR_VTT" H 14515 4873 50  0000 C CNN
F 2 "" H 14500 4700 50  0001 C CNN
F 3 "" H 14500 4700 50  0001 C CNN
	1    14500 4700
	1    0    0    -1  
$EndComp
$Comp
L KIT_Power:+DDR_VTT #PWR?
U 1 1 5EC82823
P 14500 6300
F 0 "#PWR?" H 14500 6150 50  0001 C CNN
F 1 "+DDR_VTT" H 14515 6473 50  0000 C CNN
F 2 "" H 14500 6300 50  0001 C CNN
F 3 "" H 14500 6300 50  0001 C CNN
	1    14500 6300
	1    0    0    -1  
$EndComp
$Comp
L KIT_Power:+DDR_VTT #PWR?
U 1 1 5F9A2157
P 14500 5500
F 0 "#PWR?" H 14500 5350 50  0001 C CNN
F 1 "+DDR_VTT" H 14515 5673 50  0000 C CNN
F 2 "" H 14500 5500 50  0001 C CNN
F 3 "" H 14500 5500 50  0001 C CNN
	1    14500 5500
	1    0    0    -1  
$EndComp
Text Label 10150 5800 2    50   ~ 0
DDR_DQ23
$Comp
L Device:R R76
U 1 1 5EC8284E
P 10400 7450
F 0 "R76" H 10330 7404 50  0000 R CNN
F 1 "240" H 10330 7495 50  0000 R CNN
F 2 "Resistor_SMD:R_0402_1005Metric" V 10330 7450 50  0001 C CNN
F 3 "~" H 10400 7450 50  0001 C CNN
F 4 "AVT-IPE" H 10400 7450 50  0001 C CNN "stock"
	1    10400 7450
	-1   0    0    1   
$EndComp
Wire Wire Line
	10400 6800 10400 7300
Wire Wire Line
	9600 6800 10400 6800
$Comp
L power:GND #PWR?
U 1 1 5EC8284F
P 10400 7600
F 0 "#PWR?" H 10400 7350 50  0001 C CNN
F 1 "GND" H 10405 7427 50  0000 C CNN
F 2 "" H 10400 7600 50  0001 C CNN
F 3 "" H 10400 7600 50  0001 C CNN
	1    10400 7600
	1    0    0    -1  
$EndComp
$Comp
L Device:R R75
U 1 1 5EC82850
P 5150 7450
F 0 "R75" H 5080 7404 50  0000 R CNN
F 1 "240" H 5080 7495 50  0000 R CNN
F 2 "Resistor_SMD:R_0402_1005Metric" V 5080 7450 50  0001 C CNN
F 3 "~" H 5150 7450 50  0001 C CNN
F 4 "AVT-IPE" H 5150 7450 50  0001 C CNN "stock"
	1    5150 7450
	-1   0    0    1   
$EndComp
Wire Wire Line
	5150 6800 5150 7300
$Comp
L power:GND #PWR?
U 1 1 5EC82851
P 5150 7600
F 0 "#PWR?" H 5150 7350 50  0001 C CNN
F 1 "GND" H 5155 7427 50  0000 C CNN
F 2 "" H 5150 7600 50  0001 C CNN
F 3 "" H 5150 7600 50  0001 C CNN
	1    5150 7600
	1    0    0    -1  
$EndComp
Wire Wire Line
	4350 6800 5150 6800
Text Label 13200 5000 0    50   ~ 0
DDR_CS_N
Wire Wire Line
	13200 5600 13800 5600
Wire Wire Line
	13200 5100 13800 5100
Wire Wire Line
	13200 4900 13800 4900
Wire Wire Line
	13200 6700 13800 6700
Wire Wire Line
	13200 5000 13800 5000
Wire Wire Line
	13200 6400 13800 6400
Wire Wire Line
	13200 4000 13800 4000
Wire Wire Line
	13200 5800 13800 5800
Wire Wire Line
	13200 5900 13800 5900
Wire Wire Line
	13200 5700 13800 5700
Wire Wire Line
	13200 4800 13800 4800
Wire Wire Line
	13200 7250 13850 7250
Wire Wire Line
	13200 3300 13800 3300
Wire Wire Line
	13200 3400 13800 3400
Wire Wire Line
	13200 3500 13800 3500
Wire Wire Line
	13200 2400 13800 2400
Wire Wire Line
	13200 4100 13800 4100
Text Label 13200 2600 0    50   ~ 0
DDR_A7
Wire Wire Line
	13200 4300 13800 4300
Text Label 13200 3500 0    50   ~ 0
DDR_A1
Text Label 13200 4100 0    50   ~ 0
DDR_A11
Wire Wire Line
	13200 2500 13800 2500
Wire Wire Line
	13200 2600 13800 2600
Wire Wire Line
	13200 2700 13800 2700
Wire Wire Line
	13200 4200 13800 4200
Wire Wire Line
	13200 3200 13800 3200
Text Notes 9400 3400 0    50   ~ 0
VDD 1V2 @ 330 mA \nVPP 2V5 @ 30 mA
Text GLabel 2200 7050 0    50   Input ~ 0
DDR_RESET_N
Text GLabel 2200 6150 0    50   Input ~ 0
DDR_PAR
Text GLabel 2200 6250 0    50   Input ~ 0
DDR_ODT
Text GLabel 2200 6550 0    50   Input ~ 0
DDR_CS_N
Text GLabel 2200 6750 0    50   Input ~ 0
DDR_CKE
Text GLabel 2200 6950 0    50   Input ~ 0
DDR_CK_N
Text GLabel 2200 6850 0    50   Input ~ 0
DDR_CK_P
Text GLabel 2200 5950 0    50   Input ~ 0
DDR_BG0
Text GLabel 2200 5850 0    50   Input ~ 0
DDR_BA1
Text GLabel 2200 5750 0    50   Input ~ 0
DDR_BA0
Text GLabel 5000 7150 0    50   Input ~ 0
DDR_ALERT_N
Text GLabel 2200 7250 0    50   Input ~ 0
DDR_ACT_N
Text GLabel 10850 3500 2    50   Input ~ 0
DDR_DM[0..3]
Text GLabel 10850 3400 2    50   BiDi ~ 0
DDR_DQ[0..31]
Text GLabel 10850 3300 2    50   Input ~ 0
DDR_DQS_N[0..3]
Text GLabel 10850 3200 2    50   Input ~ 0
DDR_DQS_P[0..3]
Text GLabel 2250 3750 0    50   Input ~ 0
DDR_A[0..16]
Entry Wire Line
	2350 3750 2450 3850
Entry Wire Line
	2350 3850 2450 3950
Entry Wire Line
	2350 3950 2450 4050
Entry Wire Line
	2350 4050 2450 4150
Entry Wire Line
	2350 4150 2450 4250
Entry Wire Line
	2350 4250 2450 4350
Entry Wire Line
	2350 4350 2450 4450
Entry Wire Line
	2350 4450 2450 4550
Entry Wire Line
	2350 4550 2450 4650
Entry Wire Line
	2350 4650 2450 4750
Entry Wire Line
	2350 4750 2450 4850
Entry Wire Line
	2350 4850 2450 4950
Entry Wire Line
	2350 4950 2450 5050
Entry Wire Line
	2350 5050 2450 5150
Entry Wire Line
	2350 5150 2450 5250
Entry Wire Line
	2350 5250 2450 5350
Entry Wire Line
	2350 5350 2450 5450
Entry Wire Line
	4900 4750 5000 4650
Entry Wire Line
	4900 4650 5000 4550
Entry Wire Line
	4900 4550 5000 4450
Entry Wire Line
	4900 4450 5000 4350
Entry Wire Line
	4900 4350 5000 4250
Entry Wire Line
	4900 4250 5000 4150
Entry Wire Line
	4900 4150 5000 4050
Entry Wire Line
	4900 4050 5000 3950
Entry Wire Line
	4900 3900 5000 3800
Entry Wire Line
	4900 6100 5000 6000
Entry Wire Line
	4900 6000 5000 5900
Entry Wire Line
	4900 5900 5000 5800
Entry Wire Line
	4900 5800 5000 5700
Entry Wire Line
	4900 5700 5000 5600
Entry Wire Line
	4900 5600 5000 5500
Entry Wire Line
	4900 5500 5000 5400
Entry Wire Line
	4900 5400 5000 5300
Entry Wire Line
	4900 5250 5000 5150
Entry Wire Line
	10150 4750 10250 4650
Entry Wire Line
	10150 4650 10250 4550
Entry Wire Line
	10150 4550 10250 4450
Entry Wire Line
	10150 4450 10250 4350
Entry Wire Line
	10150 4350 10250 4250
Entry Wire Line
	10150 4250 10250 4150
Entry Wire Line
	10150 4150 10250 4050
Entry Wire Line
	10150 4050 10250 3950
Entry Wire Line
	10150 3900 10250 3800
Entry Wire Line
	10150 6100 10250 6000
Entry Wire Line
	10150 6000 10250 5900
Entry Wire Line
	10150 5900 10250 5800
Entry Wire Line
	10150 5800 10250 5700
Entry Wire Line
	10150 5700 10250 5600
Entry Wire Line
	10150 5600 10250 5500
Entry Wire Line
	10150 5500 10250 5400
Entry Wire Line
	10150 5400 10250 5300
Entry Wire Line
	10150 5250 10250 5150
Wire Wire Line
	10300 6350 9600 6350
Wire Wire Line
	10300 6250 9600 6250
Entry Wire Line
	10300 6250 10400 6150
Entry Wire Line
	10300 6350 10400 6250
Wire Bus Line
	2350 3750 2250 3750
Entry Wire Line
	10300 4900 10400 4800
Entry Wire Line
	10300 5000 10400 4900
Wire Wire Line
	2200 5750 2950 5750
Wire Wire Line
	2200 5850 2950 5850
Wire Wire Line
	2200 5950 2950 5950
Wire Wire Line
	2200 6150 2950 6150
Wire Wire Line
	2200 6250 2950 6250
Wire Wire Line
	2200 6550 2950 6550
Wire Wire Line
	2200 6750 2950 6750
Wire Wire Line
	2200 6850 2950 6850
Wire Wire Line
	2200 6950 2950 6950
Wire Wire Line
	2200 7050 2950 7050
Wire Wire Line
	5050 7000 5050 7150
Wire Wire Line
	5050 7150 5000 7150
Wire Wire Line
	4350 7000 5050 7000
Wire Wire Line
	2200 7250 2950 7250
Wire Bus Line
	10250 3950 10350 3850
Wire Bus Line
	10250 5300 10350 5200
Wire Bus Line
	10250 5150 10350 5050
Wire Bus Line
	10250 3800 10350 3700
Wire Bus Line
	10350 5200 10650 5200
Wire Bus Line
	10650 5200 10650 3850
Wire Bus Line
	10650 3400 10850 3400
Wire Bus Line
	10350 3850 10650 3850
Connection ~ 10650 3850
Wire Bus Line
	10650 3850 10650 3400
Wire Bus Line
	10350 5050 10750 5050
Wire Bus Line
	10750 5050 10750 3700
Wire Bus Line
	10750 3500 10850 3500
Wire Bus Line
	10350 3700 10750 3700
Connection ~ 10750 3700
Wire Bus Line
	10750 3700 10750 3500
Wire Bus Line
	10400 4900 10550 4900
Wire Bus Line
	10550 4900 10550 3300
Wire Bus Line
	10550 3300 10850 3300
Wire Bus Line
	10400 4800 10450 4800
Wire Bus Line
	10450 4800 10450 3200
Wire Bus Line
	10450 3200 10850 3200
Wire Bus Line
	10400 6150 10450 6150
Wire Bus Line
	10450 6150 10450 4800
Connection ~ 10450 4800
Wire Bus Line
	10400 6250 10550 6250
Wire Bus Line
	10550 6250 10550 4900
Connection ~ 10550 4900
Entry Wire Line
	5050 6250 5150 6150
Entry Wire Line
	5050 6350 5150 6250
Entry Wire Line
	5050 4900 5150 4800
Entry Wire Line
	5050 5000 5150 4900
Wire Bus Line
	5000 3950 5100 3850
Wire Bus Line
	5000 5300 5100 5200
Wire Bus Line
	5000 5150 5100 5050
Wire Bus Line
	5000 3800 5100 3700
Wire Bus Line
	5100 5200 5400 5200
Wire Bus Line
	5400 5200 5400 3850
Wire Bus Line
	5400 3400 5600 3400
Wire Bus Line
	5100 3850 5400 3850
Connection ~ 5400 3850
Wire Bus Line
	5400 3850 5400 3400
Wire Bus Line
	5100 5050 5500 5050
Wire Bus Line
	5500 5050 5500 3700
Wire Bus Line
	5500 3500 5600 3500
Wire Bus Line
	5100 3700 5500 3700
Connection ~ 5500 3700
Wire Bus Line
	5500 3700 5500 3500
Wire Bus Line
	5150 4900 5300 4900
Wire Bus Line
	5300 4900 5300 3300
Wire Bus Line
	5300 3300 5600 3300
Wire Bus Line
	5150 4800 5200 4800
Wire Bus Line
	5200 4800 5200 3200
Wire Bus Line
	5200 3200 5600 3200
Wire Bus Line
	5150 6150 5200 6150
Wire Bus Line
	5200 6150 5200 4800
Connection ~ 5200 4800
Wire Bus Line
	5150 6250 5300 6250
Wire Bus Line
	5300 6250 5300 4900
Connection ~ 5300 4900
Text GLabel 5600 3500 2    50   Input ~ 0
DDR_DM[0..3]
Text GLabel 5600 3400 2    50   BiDi ~ 0
DDR_DQ[0..31]
Text GLabel 5600 3300 2    50   Input ~ 0
DDR_DQS_N[0..3]
Text GLabel 5600 3200 2    50   Input ~ 0
DDR_DQS_P[0..3]
Wire Notes Line
	9350 3200 10200 3200
Wire Notes Line
	10200 3200 10200 3450
Wire Notes Line
	10200 3450 9350 3450
Wire Notes Line
	9350 3450 9350 3200
Text Notes 4150 3400 0    50   ~ 0
VDD 1V2 @ 330 mA \nVPP 2V5 @ 30 mA
Wire Notes Line
	4100 3200 4950 3200
Wire Notes Line
	4950 3200 4950 3450
Wire Notes Line
	4950 3450 4100 3450
Wire Notes Line
	4100 3450 4100 3200
$Comp
L Device:R_Pack04 RN6
U 1 1 61125E51
P 14000 6600
F 0 "RN6" V 13583 6600 50  0000 C CNN
F 1 "39" V 13674 6600 50  0000 C CNN
F 2 "Resistor_SMD:R_Array_Convex_4x0402" V 14275 6600 50  0001 C CNN
F 3 "~" H 14000 6600 50  0001 C CNN
	1    14000 6600
	0    1    1    0   
$EndComp
$Comp
L KIT_Power:+DDR_VTT #PWR?
U 1 1 5F2FF597
P 12450 1000
F 0 "#PWR?" H 12450 850 50  0001 C CNN
F 1 "+DDR_VTT" H 12465 1173 50  0000 C CNN
F 2 "" H 12450 1000 50  0001 C CNN
F 3 "" H 12450 1000 50  0001 C CNN
	1    12450 1000
	1    0    0    -1  
$EndComp
Wire Wire Line
	14500 7100 14500 7250
Wire Wire Line
	12450 1000 12450 1050
Wire Wire Line
	12450 1050 12650 1050
Connection ~ 12650 1050
Wire Wire Line
	12450 1450 12650 1450
Connection ~ 12650 1450
Wire Wire Line
	13200 6500 13800 6500
Wire Wire Line
	13200 6600 13800 6600
Text Label 13200 6500 0    50   ~ 0
DDR_CKE
Text Label 13200 6600 0    50   ~ 0
DDR_A14
Text Notes 650  10950 0    50   ~ 0
UG1075: \n- PS_DDR_ALERT_N pin must be connected with fly-by routing to a 50Ω pull-up resistor to VCC at the last DRAM component.\n- Connect the PS_DDR_ZQ pin to GND using a 240Ω resistor. There should be separate 240Ω resistors at the FPGA and at the DRAM.\n- Address/command/control bits cannot be swapped\n- DQ byte lane swapping is allowed. Group of DM, DQS, DQS_N, and DQ signals\n- DQ bits swapping within a byte lane is allowed.\n- The PS_DDR_BG1 pin can be left unconnected when targeting x16 component interfaces without a BG1 pin
Wire Wire Line
	13550 1100 13550 1050
Connection ~ 13550 1050
Wire Wire Line
	13550 1050 14000 1050
Wire Wire Line
	14000 1450 13550 1450
Wire Wire Line
	13550 1450 13550 1400
Wire Wire Line
	14000 1400 14000 1450
Wire Wire Line
	14000 1050 14000 1100
$Comp
L Device:C C?
U 1 1 5F7B31C3
P 14000 1250
AR Path="/5EB76D90/5F7B31C3" Ref="C?"  Part="1" 
AR Path="/5EDEBADA/5F7B31C3" Ref="C6"  Part="1" 
F 0 "C6" H 13885 1296 50  0000 R CNN
F 1 "0.1uF" H 13885 1205 50  0000 R CNN
F 2 "Capacitor_SMD:C_0402_1005Metric" H 14038 1100 50  0001 C CNN
F 3 "~" H 14000 1250 50  0001 C CNN
F 4 "16 V" H 14000 1250 50  0001 C CNN "info"
F 5 "AVT-IPE" H 14000 1250 50  0001 C CNN "stock"
	1    14000 1250
	-1   0    0    -1  
$EndComp
Wire Wire Line
	14000 1050 14450 1050
Wire Wire Line
	14450 1450 14000 1450
Wire Wire Line
	14450 1400 14450 1450
Wire Wire Line
	14450 1050 14450 1100
$Comp
L Device:C C?
U 1 1 5F7B31CF
P 14450 1250
AR Path="/5EB76D90/5F7B31CF" Ref="C?"  Part="1" 
AR Path="/5EDEBADA/5F7B31CF" Ref="C20"  Part="1" 
F 0 "C20" H 14335 1296 50  0000 R CNN
F 1 "0.1uF" H 14335 1205 50  0000 R CNN
F 2 "Capacitor_SMD:C_0402_1005Metric" H 14488 1100 50  0001 C CNN
F 3 "~" H 14450 1250 50  0001 C CNN
F 4 "16 V" H 14450 1250 50  0001 C CNN "info"
F 5 "AVT-IPE" H 14450 1250 50  0001 C CNN "stock"
	1    14450 1250
	-1   0    0    -1  
$EndComp
Connection ~ 14000 1050
Connection ~ 14000 1450
Connection ~ 13550 1450
Wire Wire Line
	14900 1100 14900 1050
Wire Wire Line
	14900 1050 15350 1050
Wire Wire Line
	15350 1450 14900 1450
Wire Wire Line
	14900 1450 14900 1400
Wire Wire Line
	15350 1400 15350 1450
Wire Wire Line
	15350 1050 15350 1100
$Comp
L Device:C C?
U 1 1 5F7B31E2
P 14900 1250
AR Path="/5EB76D90/5F7B31E2" Ref="C?"  Part="1" 
AR Path="/5EDEBADA/5F7B31E2" Ref="C22"  Part="1" 
F 0 "C22" H 14785 1296 50  0000 R CNN
F 1 "0.1uF" H 14785 1205 50  0000 R CNN
F 2 "Capacitor_SMD:C_0402_1005Metric" H 14938 1100 50  0001 C CNN
F 3 "~" H 14900 1250 50  0001 C CNN
F 4 "16 V" H 14900 1250 50  0001 C CNN "info"
F 5 "AVT-IPE" H 14900 1250 50  0001 C CNN "stock"
	1    14900 1250
	-1   0    0    -1  
$EndComp
$Comp
L Device:C C?
U 1 1 5F7B31EA
P 15350 1250
AR Path="/5EB76D90/5F7B31EA" Ref="C?"  Part="1" 
AR Path="/5EDEBADA/5F7B31EA" Ref="C66"  Part="1" 
F 0 "C66" H 15235 1296 50  0000 R CNN
F 1 "0.1uF" H 15235 1205 50  0000 R CNN
F 2 "Capacitor_SMD:C_0402_1005Metric" H 15388 1100 50  0001 C CNN
F 3 "~" H 15350 1250 50  0001 C CNN
F 4 "16 V" H 15350 1250 50  0001 C CNN "info"
F 5 "AVT-IPE" H 15350 1250 50  0001 C CNN "stock"
	1    15350 1250
	-1   0    0    -1  
$EndComp
Wire Wire Line
	14450 1050 14900 1050
Wire Wire Line
	14450 1450 14900 1450
$Comp
L Device:C C?
U 1 1 5F7B31F4
P 13550 1250
AR Path="/5EB76D90/5F7B31F4" Ref="C?"  Part="1" 
AR Path="/5EDEBADA/5F7B31F4" Ref="C5"  Part="1" 
F 0 "C5" H 13435 1296 50  0000 R CNN
F 1 "0.1uF" H 13435 1205 50  0000 R CNN
F 2 "Capacitor_SMD:C_0402_1005Metric" H 13588 1100 50  0001 C CNN
F 3 "~" H 13550 1250 50  0001 C CNN
F 4 "16 V" H 13550 1250 50  0001 C CNN "info"
F 5 "AVT-IPE" H 13550 1250 50  0001 C CNN "stock"
	1    13550 1250
	-1   0    0    -1  
$EndComp
Connection ~ 14450 1050
Connection ~ 14450 1450
Connection ~ 14900 1050
Connection ~ 14900 1450
Wire Wire Line
	13100 1050 13550 1050
Connection ~ 13100 1050
Wire Wire Line
	13100 1450 13550 1450
Connection ~ 13100 1450
Text Label 13200 2400 0    50   ~ 0
DDR_A9
Text Label 13200 2700 0    50   ~ 0
DDR_A5
Text Label 13200 2500 0    50   ~ 0
DDR_A13
$Comp
L Device:C C?
U 1 1 5FA8DAA4
P 13100 1250
AR Path="/5EB76D90/5FA8DAA4" Ref="C?"  Part="1" 
AR Path="/5EDEBADA/5FA8DAA4" Ref="C67"  Part="1" 
F 0 "C67" H 12985 1296 50  0000 R CNN
F 1 "0.1uF" H 12985 1205 50  0000 R CNN
F 2 "Capacitor_SMD:C_0402_1005Metric" H 13138 1100 50  0001 C CNN
F 3 "~" H 13100 1250 50  0001 C CNN
F 4 "16 V" H 13100 1250 50  0001 C CNN "info"
F 5 "AVT-IPE" H 13100 1250 50  0001 C CNN "stock"
	1    13100 1250
	-1   0    0    -1  
$EndComp
Wire Wire Line
	7250 7200 7250 7150
Wire Wire Line
	7250 7150 8200 7150
$Comp
L power:GND #PWR?
U 1 1 5FCA91A9
P 1500 7650
F 0 "#PWR?" H 1500 7400 50  0001 C CNN
F 1 "GND" H 1505 7477 50  0000 C CNN
F 2 "" H 1500 7650 50  0001 C CNN
F 3 "" H 1500 7650 50  0001 C CNN
	1    1500 7650
	1    0    0    -1  
$EndComp
Wire Wire Line
	1500 7350 1500 7150
Wire Wire Line
	1500 7150 2950 7150
$Comp
L Device:R R?
U 1 1 5EC6186C
P 7250 7350
AR Path="/5F7224E6/5EC6186C" Ref="R?"  Part="1" 
AR Path="/5EDEBADA/5EC6186C" Ref="R30"  Part="1" 
F 0 "R30" H 7320 7441 50  0000 L CNN
F 1 "500" H 7320 7350 50  0000 L CNN
F 2 "Resistor_SMD:R_0402_1005Metric" V 7180 7350 50  0001 C CNN
F 3 "~" H 7250 7350 50  0001 C CNN
F 4 "0.5%" H 7320 7259 50  0000 L CNN "info"
	1    7250 7350
	1    0    0    -1  
$EndComp
$Comp
L Device:R R?
U 1 1 5EC85A40
P 1500 7500
AR Path="/5F7224E6/5EC85A40" Ref="R?"  Part="1" 
AR Path="/5EDEBADA/5EC85A40" Ref="R29"  Part="1" 
F 0 "R29" H 1570 7591 50  0000 L CNN
F 1 "500" H 1570 7500 50  0000 L CNN
F 2 "Resistor_SMD:R_0402_1005Metric" V 1430 7500 50  0001 C CNN
F 3 "~" H 1500 7500 50  0001 C CNN
F 4 "0.5%" H 1570 7409 50  0000 L CNN "info"
	1    1500 7500
	1    0    0    -1  
$EndComp
Connection ~ 10950 1450
Wire Wire Line
	11400 1450 10950 1450
Connection ~ 10950 1050
Wire Wire Line
	11400 1050 10950 1050
Wire Wire Line
	11400 1050 11400 1100
Wire Wire Line
	11400 1400 11400 1450
$Comp
L Device:C C?
U 1 1 5EE3C7A2
P 11400 1250
AR Path="/5E09AE40/5EE3C7A2" Ref="C?"  Part="1" 
AR Path="/5EDEBADA/5EE3C7A2" Ref="C281"  Part="1" 
F 0 "C281" H 11515 1341 50  0000 L CNN
F 1 "1uF" H 11515 1250 50  0000 L CNN
F 2 "Capacitor_SMD:C_0402_1005Metric" H 11438 1100 50  0001 C CNN
F 3 "~" H 11400 1250 50  0001 C CNN
F 4 "16 V" H 11515 1159 50  0000 L CNN "info"
F 5 "AVT-IPE" H 11400 1250 50  0001 C CNN "stock"
	1    11400 1250
	1    0    0    -1  
$EndComp
Wire Wire Line
	5700 1450 5250 1450
Wire Wire Line
	5700 1050 5250 1050
Wire Wire Line
	5700 1050 5700 1100
Wire Wire Line
	5700 1400 5700 1450
$Comp
L Device:C C?
U 1 1 5EF37899
P 5700 1250
AR Path="/5E09AE40/5EF37899" Ref="C?"  Part="1" 
AR Path="/5EDEBADA/5EF37899" Ref="C280"  Part="1" 
F 0 "C280" H 5815 1341 50  0000 L CNN
F 1 "1uF" H 5815 1250 50  0000 L CNN
F 2 "Capacitor_SMD:C_0402_1005Metric" H 5738 1100 50  0001 C CNN
F 3 "~" H 5700 1250 50  0001 C CNN
F 4 "16 V" H 5815 1159 50  0000 L CNN "info"
F 5 "AVT-IPE" H 5700 1250 50  0001 C CNN "stock"
	1    5700 1250
	1    0    0    -1  
$EndComp
Connection ~ 5250 1050
Connection ~ 5250 1450
Wire Bus Line
	5000 3950 5000 4650
Wire Bus Line
	5000 5300 5000 6000
Wire Bus Line
	10250 3950 10250 4650
Wire Bus Line
	10250 5300 10250 6000
Wire Bus Line
	2350 3750 2350 5350
$EndSCHEMATC
