EESchema Schematic File Version 4
EELAYER 30 0
EELAYER END
$Descr A4 11693 8268
encoding utf-8
Sheet 27 28
Title "ZynqMP Mezzanine FMC+ (BuZZyBoard)"
Date "2020-10-02"
Rev "1.0"
Comp "Karlsruhe Institute of Technology (KIT)"
Comment1 "Institute for Data Processing and Electronics (IPE)"
Comment2 "Luis Ardila"
Comment3 ""
Comment4 ""
$EndDescr
$Comp
L KIT_Connector:FMCP_VITA57.4 J2
U 7 1 5EEB2C03
P 5200 2000
F 0 "J2" H 6150 2290 60  0000 C CNN
F 1 "FMCP_VITA57.4" H 6150 2184 60  0000 C CNN
F 2 "KIT_Connector:FMC_SEAM_ASP_184330_BGA-560_40x14_55.778x19.76mm" H 5300 2050 60  0001 L CNN
F 3 "http://suddendocs.samtec.com/prints/asp-188588-01-mkt.pdf" H 5300 1850 60  0001 L CNN
	7    5200 2000
	1    0    0    -1  
$EndComp
$Comp
L power:GND #PWR?
U 1 1 5F00C226
P 5200 2000
F 0 "#PWR?" H 5200 1750 50  0001 C CNN
F 1 "GND" V 5205 1872 50  0000 R CNN
F 2 "" H 5200 2000 50  0001 C CNN
F 3 "" H 5200 2000 50  0001 C CNN
	1    5200 2000
	0    1    1    0   
$EndComp
$Comp
L power:GND #PWR?
U 1 1 5F021428
P 5200 2300
F 0 "#PWR?" H 5200 2050 50  0001 C CNN
F 1 "GND" V 5205 2172 50  0000 R CNN
F 2 "" H 5200 2300 50  0001 C CNN
F 3 "" H 5200 2300 50  0001 C CNN
	1    5200 2300
	0    1    1    0   
$EndComp
$Comp
L power:GND #PWR?
U 1 1 5F021A99
P 5200 2400
F 0 "#PWR?" H 5200 2150 50  0001 C CNN
F 1 "GND" V 5205 2272 50  0000 R CNN
F 2 "" H 5200 2400 50  0001 C CNN
F 3 "" H 5200 2400 50  0001 C CNN
	1    5200 2400
	0    1    1    0   
$EndComp
$Comp
L power:GND #PWR?
U 1 1 5F021FE6
P 5200 2700
F 0 "#PWR?" H 5200 2450 50  0001 C CNN
F 1 "GND" V 5205 2572 50  0000 R CNN
F 2 "" H 5200 2700 50  0001 C CNN
F 3 "" H 5200 2700 50  0001 C CNN
	1    5200 2700
	0    1    1    0   
$EndComp
$Comp
L power:GND #PWR?
U 1 1 5F0226BF
P 5200 2800
F 0 "#PWR?" H 5200 2550 50  0001 C CNN
F 1 "GND" V 5205 2672 50  0000 R CNN
F 2 "" H 5200 2800 50  0001 C CNN
F 3 "" H 5200 2800 50  0001 C CNN
	1    5200 2800
	0    1    1    0   
$EndComp
$Comp
L power:GND #PWR?
U 1 1 5F026194
P 5200 3100
F 0 "#PWR?" H 5200 2850 50  0001 C CNN
F 1 "GND" V 5205 2972 50  0000 R CNN
F 2 "" H 5200 3100 50  0001 C CNN
F 3 "" H 5200 3100 50  0001 C CNN
	1    5200 3100
	0    1    1    0   
$EndComp
$Comp
L power:GND #PWR?
U 1 1 5F02619A
P 5200 3200
F 0 "#PWR?" H 5200 2950 50  0001 C CNN
F 1 "GND" V 5205 3072 50  0000 R CNN
F 2 "" H 5200 3200 50  0001 C CNN
F 3 "" H 5200 3200 50  0001 C CNN
	1    5200 3200
	0    1    1    0   
$EndComp
$Comp
L power:GND #PWR?
U 1 1 5F027BE6
P 5200 3500
F 0 "#PWR?" H 5200 3250 50  0001 C CNN
F 1 "GND" V 5205 3372 50  0000 R CNN
F 2 "" H 5200 3500 50  0001 C CNN
F 3 "" H 5200 3500 50  0001 C CNN
	1    5200 3500
	0    1    1    0   
$EndComp
$Comp
L power:GND #PWR?
U 1 1 5F027BEC
P 5200 3600
F 0 "#PWR?" H 5200 3350 50  0001 C CNN
F 1 "GND" V 5205 3472 50  0000 R CNN
F 2 "" H 5200 3600 50  0001 C CNN
F 3 "" H 5200 3600 50  0001 C CNN
	1    5200 3600
	0    1    1    0   
$EndComp
$Comp
L power:GND #PWR?
U 1 1 5F0284A8
P 5200 3900
F 0 "#PWR?" H 5200 3650 50  0001 C CNN
F 1 "GND" V 5205 3772 50  0000 R CNN
F 2 "" H 5200 3900 50  0001 C CNN
F 3 "" H 5200 3900 50  0001 C CNN
	1    5200 3900
	0    1    1    0   
$EndComp
$Comp
L power:GND #PWR?
U 1 1 5F0284AE
P 5200 4000
F 0 "#PWR?" H 5200 3750 50  0001 C CNN
F 1 "GND" V 5205 3872 50  0000 R CNN
F 2 "" H 5200 4000 50  0001 C CNN
F 3 "" H 5200 4000 50  0001 C CNN
	1    5200 4000
	0    1    1    0   
$EndComp
$Comp
L power:GND #PWR?
U 1 1 5F028A32
P 5200 4300
F 0 "#PWR?" H 5200 4050 50  0001 C CNN
F 1 "GND" V 5205 4172 50  0000 R CNN
F 2 "" H 5200 4300 50  0001 C CNN
F 3 "" H 5200 4300 50  0001 C CNN
	1    5200 4300
	0    1    1    0   
$EndComp
$Comp
L power:GND #PWR?
U 1 1 5F028A38
P 5200 4400
F 0 "#PWR?" H 5200 4150 50  0001 C CNN
F 1 "GND" V 5205 4272 50  0000 R CNN
F 2 "" H 5200 4400 50  0001 C CNN
F 3 "" H 5200 4400 50  0001 C CNN
	1    5200 4400
	0    1    1    0   
$EndComp
$Comp
L power:GND #PWR?
U 1 1 5F029134
P 5200 4700
F 0 "#PWR?" H 5200 4450 50  0001 C CNN
F 1 "GND" V 5205 4572 50  0000 R CNN
F 2 "" H 5200 4700 50  0001 C CNN
F 3 "" H 5200 4700 50  0001 C CNN
	1    5200 4700
	0    1    1    0   
$EndComp
$Comp
L power:GND #PWR?
U 1 1 5F02913A
P 5200 4800
F 0 "#PWR?" H 5200 4550 50  0001 C CNN
F 1 "GND" V 5205 4672 50  0000 R CNN
F 2 "" H 5200 4800 50  0001 C CNN
F 3 "" H 5200 4800 50  0001 C CNN
	1    5200 4800
	0    1    1    0   
$EndComp
$Comp
L power:GND #PWR?
U 1 1 5F02994E
P 5200 5100
F 0 "#PWR?" H 5200 4850 50  0001 C CNN
F 1 "GND" V 5205 4972 50  0000 R CNN
F 2 "" H 5200 5100 50  0001 C CNN
F 3 "" H 5200 5100 50  0001 C CNN
	1    5200 5100
	0    1    1    0   
$EndComp
$Comp
L power:GND #PWR?
U 1 1 5F029954
P 5200 5200
F 0 "#PWR?" H 5200 4950 50  0001 C CNN
F 1 "GND" V 5205 5072 50  0000 R CNN
F 2 "" H 5200 5200 50  0001 C CNN
F 3 "" H 5200 5200 50  0001 C CNN
	1    5200 5200
	0    1    1    0   
$EndComp
$Comp
L power:GND #PWR?
U 1 1 5F02A23E
P 5200 5500
F 0 "#PWR?" H 5200 5250 50  0001 C CNN
F 1 "GND" V 5205 5372 50  0000 R CNN
F 2 "" H 5200 5500 50  0001 C CNN
F 3 "" H 5200 5500 50  0001 C CNN
	1    5200 5500
	0    1    1    0   
$EndComp
$Comp
L power:GND #PWR?
U 1 1 5F02A244
P 5200 5600
F 0 "#PWR?" H 5200 5350 50  0001 C CNN
F 1 "GND" V 5205 5472 50  0000 R CNN
F 2 "" H 5200 5600 50  0001 C CNN
F 3 "" H 5200 5600 50  0001 C CNN
	1    5200 5600
	0    1    1    0   
$EndComp
$Comp
L power:GND #PWR?
U 1 1 5F02D7B6
P 7100 2100
F 0 "#PWR?" H 7100 1850 50  0001 C CNN
F 1 "GND" V 7105 1972 50  0000 R CNN
F 2 "" H 7100 2100 50  0001 C CNN
F 3 "" H 7100 2100 50  0001 C CNN
	1    7100 2100
	0    -1   1    0   
$EndComp
$Comp
L power:GND #PWR?
U 1 1 5F02D7BC
P 7100 2200
F 0 "#PWR?" H 7100 1950 50  0001 C CNN
F 1 "GND" V 7105 2072 50  0000 R CNN
F 2 "" H 7100 2200 50  0001 C CNN
F 3 "" H 7100 2200 50  0001 C CNN
	1    7100 2200
	0    -1   1    0   
$EndComp
$Comp
L power:GND #PWR?
U 1 1 5F02DFE4
P 7100 2500
F 0 "#PWR?" H 7100 2250 50  0001 C CNN
F 1 "GND" V 7105 2372 50  0000 R CNN
F 2 "" H 7100 2500 50  0001 C CNN
F 3 "" H 7100 2500 50  0001 C CNN
	1    7100 2500
	0    -1   1    0   
$EndComp
$Comp
L power:GND #PWR?
U 1 1 5F02DFEA
P 7100 2600
F 0 "#PWR?" H 7100 2350 50  0001 C CNN
F 1 "GND" V 7105 2472 50  0000 R CNN
F 2 "" H 7100 2600 50  0001 C CNN
F 3 "" H 7100 2600 50  0001 C CNN
	1    7100 2600
	0    -1   1    0   
$EndComp
$Comp
L power:GND #PWR?
U 1 1 5F02E5EE
P 7100 2900
F 0 "#PWR?" H 7100 2650 50  0001 C CNN
F 1 "GND" V 7105 2772 50  0000 R CNN
F 2 "" H 7100 2900 50  0001 C CNN
F 3 "" H 7100 2900 50  0001 C CNN
	1    7100 2900
	0    -1   1    0   
$EndComp
$Comp
L power:GND #PWR?
U 1 1 5F02E5F4
P 7100 3000
F 0 "#PWR?" H 7100 2750 50  0001 C CNN
F 1 "GND" V 7105 2872 50  0000 R CNN
F 2 "" H 7100 3000 50  0001 C CNN
F 3 "" H 7100 3000 50  0001 C CNN
	1    7100 3000
	0    -1   1    0   
$EndComp
$Comp
L power:GND #PWR?
U 1 1 5F031E76
P 7100 3300
F 0 "#PWR?" H 7100 3050 50  0001 C CNN
F 1 "GND" V 7105 3172 50  0000 R CNN
F 2 "" H 7100 3300 50  0001 C CNN
F 3 "" H 7100 3300 50  0001 C CNN
	1    7100 3300
	0    -1   1    0   
$EndComp
$Comp
L power:GND #PWR?
U 1 1 5F031E7C
P 7100 3400
F 0 "#PWR?" H 7100 3150 50  0001 C CNN
F 1 "GND" V 7105 3272 50  0000 R CNN
F 2 "" H 7100 3400 50  0001 C CNN
F 3 "" H 7100 3400 50  0001 C CNN
	1    7100 3400
	0    -1   1    0   
$EndComp
$Comp
L power:GND #PWR?
U 1 1 5F03251E
P 7100 3700
F 0 "#PWR?" H 7100 3450 50  0001 C CNN
F 1 "GND" V 7105 3572 50  0000 R CNN
F 2 "" H 7100 3700 50  0001 C CNN
F 3 "" H 7100 3700 50  0001 C CNN
	1    7100 3700
	0    -1   1    0   
$EndComp
$Comp
L power:GND #PWR?
U 1 1 5F032524
P 7100 3800
F 0 "#PWR?" H 7100 3550 50  0001 C CNN
F 1 "GND" V 7105 3672 50  0000 R CNN
F 2 "" H 7100 3800 50  0001 C CNN
F 3 "" H 7100 3800 50  0001 C CNN
	1    7100 3800
	0    -1   1    0   
$EndComp
$Comp
L power:GND #PWR?
U 1 1 5F032E4E
P 7100 4100
F 0 "#PWR?" H 7100 3850 50  0001 C CNN
F 1 "GND" V 7105 3972 50  0000 R CNN
F 2 "" H 7100 4100 50  0001 C CNN
F 3 "" H 7100 4100 50  0001 C CNN
	1    7100 4100
	0    -1   1    0   
$EndComp
$Comp
L power:GND #PWR?
U 1 1 5F032E54
P 7100 4200
F 0 "#PWR?" H 7100 3950 50  0001 C CNN
F 1 "GND" V 7105 4072 50  0000 R CNN
F 2 "" H 7100 4200 50  0001 C CNN
F 3 "" H 7100 4200 50  0001 C CNN
	1    7100 4200
	0    -1   1    0   
$EndComp
$Comp
L power:GND #PWR?
U 1 1 5F035554
P 7100 4500
F 0 "#PWR?" H 7100 4250 50  0001 C CNN
F 1 "GND" V 7105 4372 50  0000 R CNN
F 2 "" H 7100 4500 50  0001 C CNN
F 3 "" H 7100 4500 50  0001 C CNN
	1    7100 4500
	0    -1   1    0   
$EndComp
$Comp
L power:GND #PWR?
U 1 1 5F03555A
P 7100 4600
F 0 "#PWR?" H 7100 4350 50  0001 C CNN
F 1 "GND" V 7105 4472 50  0000 R CNN
F 2 "" H 7100 4600 50  0001 C CNN
F 3 "" H 7100 4600 50  0001 C CNN
	1    7100 4600
	0    -1   1    0   
$EndComp
$Comp
L power:GND #PWR?
U 1 1 5F035E4A
P 7100 4900
F 0 "#PWR?" H 7100 4650 50  0001 C CNN
F 1 "GND" V 7105 4772 50  0000 R CNN
F 2 "" H 7100 4900 50  0001 C CNN
F 3 "" H 7100 4900 50  0001 C CNN
	1    7100 4900
	0    -1   1    0   
$EndComp
$Comp
L power:GND #PWR?
U 1 1 5F035E50
P 7100 5000
F 0 "#PWR?" H 7100 4750 50  0001 C CNN
F 1 "GND" V 7105 4872 50  0000 R CNN
F 2 "" H 7100 5000 50  0001 C CNN
F 3 "" H 7100 5000 50  0001 C CNN
	1    7100 5000
	0    -1   1    0   
$EndComp
$Comp
L power:GND #PWR?
U 1 1 5F03656C
P 7100 5300
F 0 "#PWR?" H 7100 5050 50  0001 C CNN
F 1 "GND" V 7105 5172 50  0000 R CNN
F 2 "" H 7100 5300 50  0001 C CNN
F 3 "" H 7100 5300 50  0001 C CNN
	1    7100 5300
	0    -1   1    0   
$EndComp
$Comp
L power:GND #PWR?
U 1 1 5F036572
P 7100 5400
F 0 "#PWR?" H 7100 5150 50  0001 C CNN
F 1 "GND" V 7105 5272 50  0000 R CNN
F 2 "" H 7100 5400 50  0001 C CNN
F 3 "" H 7100 5400 50  0001 C CNN
	1    7100 5400
	0    -1   1    0   
$EndComp
$Comp
L power:GND #PWR?
U 1 1 5F036C96
P 7100 5700
F 0 "#PWR?" H 7100 5450 50  0001 C CNN
F 1 "GND" V 7105 5572 50  0000 R CNN
F 2 "" H 7100 5700 50  0001 C CNN
F 3 "" H 7100 5700 50  0001 C CNN
	1    7100 5700
	0    -1   1    0   
$EndComp
$Comp
L power:GND #PWR?
U 1 1 5F036C9C
P 7100 5800
F 0 "#PWR?" H 7100 5550 50  0001 C CNN
F 1 "GND" V 7105 5672 50  0000 R CNN
F 2 "" H 7100 5800 50  0001 C CNN
F 3 "" H 7100 5800 50  0001 C CNN
	1    7100 5800
	0    -1   1    0   
$EndComp
$Comp
L power:GND #PWR?
U 1 1 5F0377C8
P 5200 5900
F 0 "#PWR?" H 5200 5650 50  0001 C CNN
F 1 "GND" V 5205 5772 50  0000 R CNN
F 2 "" H 5200 5900 50  0001 C CNN
F 3 "" H 5200 5900 50  0001 C CNN
	1    5200 5900
	0    1    1    0   
$EndComp
$Comp
L power:GND #PWR?
U 1 1 5FDA98AA
P 7100 2000
F 0 "#PWR?" H 7100 1750 50  0001 C CNN
F 1 "GND" V 7105 1872 50  0000 R CNN
F 2 "" H 7100 2000 50  0001 C CNN
F 3 "" H 7100 2000 50  0001 C CNN
	1    7100 2000
	0    -1   1    0   
$EndComp
Wire Wire Line
	5200 2500 4800 2500
Wire Wire Line
	5200 2600 4800 2600
Wire Wire Line
	5200 2900 4800 2900
Wire Wire Line
	5200 3000 4800 3000
Wire Wire Line
	5200 3300 4800 3300
Wire Wire Line
	5200 3400 4800 3400
Wire Wire Line
	5200 3700 4800 3700
Wire Wire Line
	5200 3800 4800 3800
Wire Wire Line
	5200 4100 4800 4100
Wire Wire Line
	5200 4200 4800 4200
Wire Wire Line
	5200 4500 4800 4500
Wire Wire Line
	5200 4600 4800 4600
Wire Wire Line
	5200 4900 4800 4900
Wire Wire Line
	5200 5000 4800 5000
Wire Wire Line
	5200 5300 4800 5300
Wire Wire Line
	5200 5400 4800 5400
Wire Wire Line
	5200 5700 4800 5700
Wire Wire Line
	5200 5800 4800 5800
Wire Wire Line
	7500 2700 7100 2700
Wire Wire Line
	7500 2800 7100 2800
Wire Wire Line
	7500 3100 7100 3100
Wire Wire Line
	7500 3200 7100 3200
Wire Wire Line
	7500 3500 7100 3500
Wire Wire Line
	7500 3600 7100 3600
Wire Wire Line
	7500 3900 7100 3900
Wire Wire Line
	7500 4000 7100 4000
Wire Wire Line
	7500 4300 7100 4300
Wire Wire Line
	7500 4400 7100 4400
Wire Wire Line
	7500 4700 7100 4700
Wire Wire Line
	7500 4800 7100 4800
Wire Wire Line
	7500 5100 7100 5100
Wire Wire Line
	7500 5200 7100 5200
Wire Wire Line
	7500 5500 7100 5500
Wire Wire Line
	7500 5600 7100 5600
$Comp
L Device:C C158
U 1 1 612F40E2
P 8450 6100
F 0 "C158" H 8565 6191 50  0000 L CNN
F 1 "1uF" H 8565 6100 50  0000 L CNN
F 2 "Capacitor_SMD:C_0402_1005Metric" H 8488 5950 50  0001 C CNN
F 3 "~" H 8450 6100 50  0001 C CNN
F 4 "16 V" H 8565 6009 50  0000 L CNN "info"
F 5 "AVT-IPE" H 8450 6100 50  0001 C CNN "stock"
	1    8450 6100
	1    0    0    -1  
$EndComp
Wire Wire Line
	8450 5900 8450 5950
Wire Wire Line
	8450 6250 8450 6300
Wire Wire Line
	8450 5900 9000 5900
Connection ~ 8450 5900
$Comp
L KIT_Power:+3V3_STBY #PWR?
U 1 1 612F8C87
P 9000 5850
F 0 "#PWR?" H 9000 5700 50  0001 C CNN
F 1 "+3V3_STBY" H 9015 6023 50  0000 C CNN
F 2 "" H 9000 5850 50  0001 C CNN
F 3 "" H 9000 5850 50  0001 C CNN
	1    9000 5850
	1    0    0    -1  
$EndComp
Wire Wire Line
	9000 5850 9000 5900
$Comp
L power:GND #PWR?
U 1 1 612FDDDC
P 8450 6300
F 0 "#PWR?" H 8450 6050 50  0001 C CNN
F 1 "GND" H 8455 6127 50  0000 C CNN
F 2 "" H 8450 6300 50  0001 C CNN
F 3 "" H 8450 6300 50  0001 C CNN
	1    8450 6300
	1    0    0    -1  
$EndComp
Text GLabel 4800 3300 0    50   Input ~ 0
PL_MGT_TX_P8
Text GLabel 4800 3400 0    50   Input ~ 0
PL_MGT_TX_N8
Wire Wire Line
	7500 2300 7100 2300
Wire Wire Line
	7500 2400 7100 2400
Wire Wire Line
	5200 2100 4800 2100
Wire Wire Line
	5200 2200 4800 2200
NoConn ~ 4800 2100
NoConn ~ 4800 2200
NoConn ~ 4800 2500
NoConn ~ 4800 2600
NoConn ~ 7500 2300
NoConn ~ 7500 2400
NoConn ~ 7500 2700
NoConn ~ 7500 2800
Text Notes 4050 3350 2    50   ~ 0
10GBE
NoConn ~ 7500 3900
NoConn ~ 7500 4000
Text Notes 8200 4750 0    50   ~ 0
10GBE
Text GLabel 7500 4700 2    50   Output ~ 0
PL_MGT_RX_P8
Text GLabel 7500 4800 2    50   Output ~ 0
PL_MGT_RX_N8
Text Notes 8300 3150 0    50   ~ 0
Not connected in Motherboard!
Text Notes 8300 3550 0    50   ~ 0
Not connected in Motherboard!
Text Notes 8300 4350 0    50   ~ 0
Not connected in Motherboard!
Text Notes 8300 5150 0    50   ~ 0
Not connected in Motherboard!
Text Notes 8300 5550 0    50   ~ 0
Not connected in Motherboard!
Text Notes 4000 2950 2    50   ~ 0
Not connected in Motherboard!
Text Notes 3950 3750 2    50   ~ 0
Not connected in Motherboard!
Text Notes 3950 4150 2    50   ~ 0
Not connected in Motherboard!
Text Notes 3950 4550 2    50   ~ 0
Not connected in Motherboard!
Text Notes 3950 4950 2    50   ~ 0
Not connected in Motherboard!
Text Notes 3950 5350 2    50   ~ 0
Not connected in Motherboard!
Text Notes 3950 5750 2    50   ~ 0
Not connected in Motherboard!
Text Notes 8300 3950 0    50   ~ 0
Not connected in Motherboard!
Text Notes 7650 2750 0    50   ~ 0
Not connected in Motherboard!
Text Notes 7650 2350 0    50   ~ 0
Not connected in Motherboard!
Text Notes 4650 2550 2    50   ~ 0
Not connected in Motherboard!
Text Notes 4650 2150 2    50   ~ 0
Not connected in Motherboard!
Text Notes 7600 3100 0    50   ~ 0
PL_MGT_TX_P7
Text Notes 7600 3200 0    50   ~ 0
PL_MGT_TX_N7
Text Notes 7600 3500 0    50   ~ 0
PL_MGT_TX_P9
Text Notes 7600 3600 0    50   ~ 0
PL_MGT_TX_N9
Text Notes 7600 4300 0    50   ~ 0
PL_MGT_RX_P6
Text Notes 7600 4400 0    50   ~ 0
PL_MGT_RX_N6
Text Notes 7600 5100 0    50   ~ 0
PL_MGT_TX_P12
Text Notes 7600 5200 0    50   ~ 0
PL_MGT_TX_N12
Text Notes 7600 5500 0    50   ~ 0
PL_MGT_TX_P14
Text Notes 7600 5600 0    50   ~ 0
PL_MGT_TX_N14
Text Notes 4700 2900 2    50   ~ 0
PL_MGT_TX_P6
Text Notes 4700 3000 2    50   ~ 0
PL_MGT_TX_N6
Text Notes 4700 3700 2    50   ~ 0
PL_MGT_TX_P10
Text Notes 4700 3800 2    50   ~ 0
PL_MGT_TX_N10
Text Notes 4700 4100 2    50   ~ 0
PL_MGT_TX_P11
Text Notes 4700 4200 2    50   ~ 0
PL_MGT_TX_N11
Text Notes 4700 4500 2    50   ~ 0
PL_MGT_RX_P7
Text Notes 4700 4600 2    50   ~ 0
PL_MGT_RX_N7
Text Notes 4700 4900 2    50   ~ 0
PL_MGT_RX_P9
Text Notes 4700 5000 2    50   ~ 0
PL_MGT_RX_N9
Text Notes 4700 5300 2    50   ~ 0
PL_MGT_TX_P13
Text Notes 4700 5400 2    50   ~ 0
PL_MGT_TX_N13
Text Notes 4700 5700 2    50   ~ 0
PL_MGT_TX_P15
Text Notes 4700 5800 2    50   ~ 0
PL_MGT_TX_N15
NoConn ~ 4800 2900
NoConn ~ 4800 3000
NoConn ~ 4800 3700
NoConn ~ 4800 3800
NoConn ~ 4800 4100
NoConn ~ 4800 4200
NoConn ~ 4800 4500
NoConn ~ 4800 4600
NoConn ~ 4800 4900
NoConn ~ 4800 5000
NoConn ~ 4800 5300
NoConn ~ 4800 5400
NoConn ~ 4800 5700
NoConn ~ 4800 5800
NoConn ~ 7500 3100
NoConn ~ 7500 3200
NoConn ~ 7500 3500
NoConn ~ 7500 3600
NoConn ~ 7500 4300
NoConn ~ 7500 4400
NoConn ~ 7500 5100
NoConn ~ 7500 5200
NoConn ~ 7500 5500
NoConn ~ 7500 5600
Wire Wire Line
	7100 5900 8450 5900
$EndSCHEMATC
