EESchema Schematic File Version 4
EELAYER 30 0
EELAYER END
$Descr A4 11693 8268
encoding utf-8
Sheet 26 28
Title "ZynqMP Mezzanine FMC+ (BuZZyBoard)"
Date "2020-10-02"
Rev "1.0"
Comp "Karlsruhe Institute of Technology (KIT)"
Comment1 "Institute for Data Processing and Electronics (IPE)"
Comment2 "Luis Ardila"
Comment3 ""
Comment4 ""
$EndDescr
$Comp
L KIT_Connector:FMCP_VITA57.4 J2
U 6 1 5EF1CE87
P 5200 2000
F 0 "J2" H 6100 2290 60  0000 C CNN
F 1 "FMCP_VITA57.4" H 6100 2184 60  0000 C CNN
F 2 "KIT_Connector:FMC_SEAM_ASP_184330_BGA-560_40x14_55.778x19.76mm" H 5500 2000 60  0001 L CNN
F 3 "http://suddendocs.samtec.com/prints/asp-188588-01-mkt.pdf" H 5500 1800 60  0001 L CNN
	6    5200 2000
	1    0    0    -1  
$EndComp
$Comp
L power:GND #PWR?
U 1 1 5F110E30
P 5200 2200
AR Path="/5EF3A6F3/5F110E30" Ref="#PWR?"  Part="1" 
AR Path="/5EF3A6EB/5F110E30" Ref="#PWR?"  Part="1" 
AR Path="/5EF3A6F1/5F110E30" Ref="#PWR?"  Part="1" 
F 0 "#PWR?" H 5200 1950 50  0001 C CNN
F 1 "GND" V 5205 2072 50  0000 R CNN
F 2 "" H 5200 2200 50  0001 C CNN
F 3 "" H 5200 2200 50  0001 C CNN
	1    5200 2200
	0    1    1    0   
$EndComp
$Comp
L power:GND #PWR?
U 1 1 5F110E36
P 5200 2500
AR Path="/5EF3A6F3/5F110E36" Ref="#PWR?"  Part="1" 
AR Path="/5EF3A6EB/5F110E36" Ref="#PWR?"  Part="1" 
AR Path="/5EF3A6F1/5F110E36" Ref="#PWR?"  Part="1" 
F 0 "#PWR?" H 5200 2250 50  0001 C CNN
F 1 "GND" V 5205 2372 50  0000 R CNN
F 2 "" H 5200 2500 50  0001 C CNN
F 3 "" H 5200 2500 50  0001 C CNN
	1    5200 2500
	0    1    1    0   
$EndComp
$Comp
L power:GND #PWR?
U 1 1 5F11396C
P 5200 2600
AR Path="/5EF3A6F3/5F11396C" Ref="#PWR?"  Part="1" 
AR Path="/5EF3A6EB/5F11396C" Ref="#PWR?"  Part="1" 
AR Path="/5EF3A6F1/5F11396C" Ref="#PWR?"  Part="1" 
F 0 "#PWR?" H 5200 2350 50  0001 C CNN
F 1 "GND" V 5205 2472 50  0000 R CNN
F 2 "" H 5200 2600 50  0001 C CNN
F 3 "" H 5200 2600 50  0001 C CNN
	1    5200 2600
	0    1    1    0   
$EndComp
$Comp
L power:GND #PWR?
U 1 1 5F113972
P 5200 2900
AR Path="/5EF3A6F3/5F113972" Ref="#PWR?"  Part="1" 
AR Path="/5EF3A6EB/5F113972" Ref="#PWR?"  Part="1" 
AR Path="/5EF3A6F1/5F113972" Ref="#PWR?"  Part="1" 
F 0 "#PWR?" H 5200 2650 50  0001 C CNN
F 1 "GND" V 5205 2772 50  0000 R CNN
F 2 "" H 5200 2900 50  0001 C CNN
F 3 "" H 5200 2900 50  0001 C CNN
	1    5200 2900
	0    1    1    0   
$EndComp
$Comp
L power:GND #PWR?
U 1 1 5F11473C
P 5200 2100
AR Path="/5EF3A6F3/5F11473C" Ref="#PWR?"  Part="1" 
AR Path="/5EF3A6EB/5F11473C" Ref="#PWR?"  Part="1" 
AR Path="/5EF3A6F1/5F11473C" Ref="#PWR?"  Part="1" 
F 0 "#PWR?" H 5200 1850 50  0001 C CNN
F 1 "GND" V 5205 1972 50  0000 R CNN
F 2 "" H 5200 2100 50  0001 C CNN
F 3 "" H 5200 2100 50  0001 C CNN
	1    5200 2100
	0    1    1    0   
$EndComp
$Comp
L power:GND #PWR?
U 1 1 5F116C49
P 5200 3000
AR Path="/5EF3A6F3/5F116C49" Ref="#PWR?"  Part="1" 
AR Path="/5EF3A6EB/5F116C49" Ref="#PWR?"  Part="1" 
AR Path="/5EF3A6F1/5F116C49" Ref="#PWR?"  Part="1" 
F 0 "#PWR?" H 5200 2750 50  0001 C CNN
F 1 "GND" V 5205 2872 50  0000 R CNN
F 2 "" H 5200 3000 50  0001 C CNN
F 3 "" H 5200 3000 50  0001 C CNN
	1    5200 3000
	0    1    1    0   
$EndComp
$Comp
L power:GND #PWR?
U 1 1 5F116C4F
P 5200 3300
AR Path="/5EF3A6F3/5F116C4F" Ref="#PWR?"  Part="1" 
AR Path="/5EF3A6EB/5F116C4F" Ref="#PWR?"  Part="1" 
AR Path="/5EF3A6F1/5F116C4F" Ref="#PWR?"  Part="1" 
F 0 "#PWR?" H 5200 3050 50  0001 C CNN
F 1 "GND" V 5205 3172 50  0000 R CNN
F 2 "" H 5200 3300 50  0001 C CNN
F 3 "" H 5200 3300 50  0001 C CNN
	1    5200 3300
	0    1    1    0   
$EndComp
$Comp
L power:GND #PWR?
U 1 1 5F117429
P 5200 3400
AR Path="/5EF3A6F3/5F117429" Ref="#PWR?"  Part="1" 
AR Path="/5EF3A6EB/5F117429" Ref="#PWR?"  Part="1" 
AR Path="/5EF3A6F1/5F117429" Ref="#PWR?"  Part="1" 
F 0 "#PWR?" H 5200 3150 50  0001 C CNN
F 1 "GND" V 5205 3272 50  0000 R CNN
F 2 "" H 5200 3400 50  0001 C CNN
F 3 "" H 5200 3400 50  0001 C CNN
	1    5200 3400
	0    1    1    0   
$EndComp
$Comp
L power:GND #PWR?
U 1 1 5F11742F
P 5200 3700
AR Path="/5EF3A6F3/5F11742F" Ref="#PWR?"  Part="1" 
AR Path="/5EF3A6EB/5F11742F" Ref="#PWR?"  Part="1" 
AR Path="/5EF3A6F1/5F11742F" Ref="#PWR?"  Part="1" 
F 0 "#PWR?" H 5200 3450 50  0001 C CNN
F 1 "GND" V 5205 3572 50  0000 R CNN
F 2 "" H 5200 3700 50  0001 C CNN
F 3 "" H 5200 3700 50  0001 C CNN
	1    5200 3700
	0    1    1    0   
$EndComp
$Comp
L power:GND #PWR?
U 1 1 5F117A99
P 5200 3800
AR Path="/5EF3A6F3/5F117A99" Ref="#PWR?"  Part="1" 
AR Path="/5EF3A6EB/5F117A99" Ref="#PWR?"  Part="1" 
AR Path="/5EF3A6F1/5F117A99" Ref="#PWR?"  Part="1" 
F 0 "#PWR?" H 5200 3550 50  0001 C CNN
F 1 "GND" V 5205 3672 50  0000 R CNN
F 2 "" H 5200 3800 50  0001 C CNN
F 3 "" H 5200 3800 50  0001 C CNN
	1    5200 3800
	0    1    1    0   
$EndComp
$Comp
L power:GND #PWR?
U 1 1 5F117A9F
P 5200 4100
AR Path="/5EF3A6F3/5F117A9F" Ref="#PWR?"  Part="1" 
AR Path="/5EF3A6EB/5F117A9F" Ref="#PWR?"  Part="1" 
AR Path="/5EF3A6F1/5F117A9F" Ref="#PWR?"  Part="1" 
F 0 "#PWR?" H 5200 3850 50  0001 C CNN
F 1 "GND" V 5205 3972 50  0000 R CNN
F 2 "" H 5200 4100 50  0001 C CNN
F 3 "" H 5200 4100 50  0001 C CNN
	1    5200 4100
	0    1    1    0   
$EndComp
$Comp
L power:GND #PWR?
U 1 1 5F11A373
P 5200 4200
AR Path="/5EF3A6F3/5F11A373" Ref="#PWR?"  Part="1" 
AR Path="/5EF3A6EB/5F11A373" Ref="#PWR?"  Part="1" 
AR Path="/5EF3A6F1/5F11A373" Ref="#PWR?"  Part="1" 
F 0 "#PWR?" H 5200 3950 50  0001 C CNN
F 1 "GND" V 5205 4072 50  0000 R CNN
F 2 "" H 5200 4200 50  0001 C CNN
F 3 "" H 5200 4200 50  0001 C CNN
	1    5200 4200
	0    1    1    0   
$EndComp
$Comp
L power:GND #PWR?
U 1 1 5F11A379
P 5200 4500
AR Path="/5EF3A6F3/5F11A379" Ref="#PWR?"  Part="1" 
AR Path="/5EF3A6EB/5F11A379" Ref="#PWR?"  Part="1" 
AR Path="/5EF3A6F1/5F11A379" Ref="#PWR?"  Part="1" 
F 0 "#PWR?" H 5200 4250 50  0001 C CNN
F 1 "GND" V 5205 4372 50  0000 R CNN
F 2 "" H 5200 4500 50  0001 C CNN
F 3 "" H 5200 4500 50  0001 C CNN
	1    5200 4500
	0    1    1    0   
$EndComp
$Comp
L power:GND #PWR?
U 1 1 5F11A95F
P 5200 4600
AR Path="/5EF3A6F3/5F11A95F" Ref="#PWR?"  Part="1" 
AR Path="/5EF3A6EB/5F11A95F" Ref="#PWR?"  Part="1" 
AR Path="/5EF3A6F1/5F11A95F" Ref="#PWR?"  Part="1" 
F 0 "#PWR?" H 5200 4350 50  0001 C CNN
F 1 "GND" V 5205 4472 50  0000 R CNN
F 2 "" H 5200 4600 50  0001 C CNN
F 3 "" H 5200 4600 50  0001 C CNN
	1    5200 4600
	0    1    1    0   
$EndComp
$Comp
L power:GND #PWR?
U 1 1 5F11A965
P 5200 4900
AR Path="/5EF3A6F3/5F11A965" Ref="#PWR?"  Part="1" 
AR Path="/5EF3A6EB/5F11A965" Ref="#PWR?"  Part="1" 
AR Path="/5EF3A6F1/5F11A965" Ref="#PWR?"  Part="1" 
F 0 "#PWR?" H 5200 4650 50  0001 C CNN
F 1 "GND" V 5205 4772 50  0000 R CNN
F 2 "" H 5200 4900 50  0001 C CNN
F 3 "" H 5200 4900 50  0001 C CNN
	1    5200 4900
	0    1    1    0   
$EndComp
$Comp
L power:GND #PWR?
U 1 1 5F11DACF
P 5200 5000
AR Path="/5EF3A6F3/5F11DACF" Ref="#PWR?"  Part="1" 
AR Path="/5EF3A6EB/5F11DACF" Ref="#PWR?"  Part="1" 
AR Path="/5EF3A6F1/5F11DACF" Ref="#PWR?"  Part="1" 
F 0 "#PWR?" H 5200 4750 50  0001 C CNN
F 1 "GND" V 5205 4872 50  0000 R CNN
F 2 "" H 5200 5000 50  0001 C CNN
F 3 "" H 5200 5000 50  0001 C CNN
	1    5200 5000
	0    1    1    0   
$EndComp
$Comp
L power:GND #PWR?
U 1 1 5F11DAD5
P 5200 5300
AR Path="/5EF3A6F3/5F11DAD5" Ref="#PWR?"  Part="1" 
AR Path="/5EF3A6EB/5F11DAD5" Ref="#PWR?"  Part="1" 
AR Path="/5EF3A6F1/5F11DAD5" Ref="#PWR?"  Part="1" 
F 0 "#PWR?" H 5200 5050 50  0001 C CNN
F 1 "GND" V 5205 5172 50  0000 R CNN
F 2 "" H 5200 5300 50  0001 C CNN
F 3 "" H 5200 5300 50  0001 C CNN
	1    5200 5300
	0    1    1    0   
$EndComp
$Comp
L power:GND #PWR?
U 1 1 5F11E03F
P 5200 5400
AR Path="/5EF3A6F3/5F11E03F" Ref="#PWR?"  Part="1" 
AR Path="/5EF3A6EB/5F11E03F" Ref="#PWR?"  Part="1" 
AR Path="/5EF3A6F1/5F11E03F" Ref="#PWR?"  Part="1" 
F 0 "#PWR?" H 5200 5150 50  0001 C CNN
F 1 "GND" V 5205 5272 50  0000 R CNN
F 2 "" H 5200 5400 50  0001 C CNN
F 3 "" H 5200 5400 50  0001 C CNN
	1    5200 5400
	0    1    1    0   
$EndComp
$Comp
L power:GND #PWR?
U 1 1 5F11E045
P 5200 5700
AR Path="/5EF3A6F3/5F11E045" Ref="#PWR?"  Part="1" 
AR Path="/5EF3A6EB/5F11E045" Ref="#PWR?"  Part="1" 
AR Path="/5EF3A6F1/5F11E045" Ref="#PWR?"  Part="1" 
F 0 "#PWR?" H 5200 5450 50  0001 C CNN
F 1 "GND" V 5205 5572 50  0000 R CNN
F 2 "" H 5200 5700 50  0001 C CNN
F 3 "" H 5200 5700 50  0001 C CNN
	1    5200 5700
	0    1    1    0   
$EndComp
$Comp
L power:GND #PWR?
U 1 1 5F11E4FF
P 5200 5800
AR Path="/5EF3A6F3/5F11E4FF" Ref="#PWR?"  Part="1" 
AR Path="/5EF3A6EB/5F11E4FF" Ref="#PWR?"  Part="1" 
AR Path="/5EF3A6F1/5F11E4FF" Ref="#PWR?"  Part="1" 
F 0 "#PWR?" H 5200 5550 50  0001 C CNN
F 1 "GND" V 5205 5672 50  0000 R CNN
F 2 "" H 5200 5800 50  0001 C CNN
F 3 "" H 5200 5800 50  0001 C CNN
	1    5200 5800
	0    1    1    0   
$EndComp
$Comp
L power:GND #PWR?
U 1 1 5F120B95
P 7000 5600
AR Path="/5EF3A6F3/5F120B95" Ref="#PWR?"  Part="1" 
AR Path="/5EF3A6EB/5F120B95" Ref="#PWR?"  Part="1" 
AR Path="/5EF3A6F1/5F120B95" Ref="#PWR?"  Part="1" 
F 0 "#PWR?" H 7000 5350 50  0001 C CNN
F 1 "GND" V 7005 5472 50  0000 R CNN
F 2 "" H 7000 5600 50  0001 C CNN
F 3 "" H 7000 5600 50  0001 C CNN
	1    7000 5600
	0    -1   1    0   
$EndComp
$Comp
L power:GND #PWR?
U 1 1 5F120B9B
P 7000 5900
AR Path="/5EF3A6F3/5F120B9B" Ref="#PWR?"  Part="1" 
AR Path="/5EF3A6EB/5F120B9B" Ref="#PWR?"  Part="1" 
AR Path="/5EF3A6F1/5F120B9B" Ref="#PWR?"  Part="1" 
F 0 "#PWR?" H 7000 5650 50  0001 C CNN
F 1 "GND" V 7005 5772 50  0000 R CNN
F 2 "" H 7000 5900 50  0001 C CNN
F 3 "" H 7000 5900 50  0001 C CNN
	1    7000 5900
	0    -1   1    0   
$EndComp
$Comp
L power:GND #PWR?
U 1 1 5F121275
P 7000 5200
AR Path="/5EF3A6F3/5F121275" Ref="#PWR?"  Part="1" 
AR Path="/5EF3A6EB/5F121275" Ref="#PWR?"  Part="1" 
AR Path="/5EF3A6F1/5F121275" Ref="#PWR?"  Part="1" 
F 0 "#PWR?" H 7000 4950 50  0001 C CNN
F 1 "GND" V 7005 5072 50  0000 R CNN
F 2 "" H 7000 5200 50  0001 C CNN
F 3 "" H 7000 5200 50  0001 C CNN
	1    7000 5200
	0    -1   1    0   
$EndComp
$Comp
L power:GND #PWR?
U 1 1 5F12127B
P 7000 5500
AR Path="/5EF3A6F3/5F12127B" Ref="#PWR?"  Part="1" 
AR Path="/5EF3A6EB/5F12127B" Ref="#PWR?"  Part="1" 
AR Path="/5EF3A6F1/5F12127B" Ref="#PWR?"  Part="1" 
F 0 "#PWR?" H 7000 5250 50  0001 C CNN
F 1 "GND" V 7005 5372 50  0000 R CNN
F 2 "" H 7000 5500 50  0001 C CNN
F 3 "" H 7000 5500 50  0001 C CNN
	1    7000 5500
	0    -1   1    0   
$EndComp
$Comp
L power:GND #PWR?
U 1 1 5F121939
P 7000 4800
AR Path="/5EF3A6F3/5F121939" Ref="#PWR?"  Part="1" 
AR Path="/5EF3A6EB/5F121939" Ref="#PWR?"  Part="1" 
AR Path="/5EF3A6F1/5F121939" Ref="#PWR?"  Part="1" 
F 0 "#PWR?" H 7000 4550 50  0001 C CNN
F 1 "GND" V 7005 4672 50  0000 R CNN
F 2 "" H 7000 4800 50  0001 C CNN
F 3 "" H 7000 4800 50  0001 C CNN
	1    7000 4800
	0    -1   1    0   
$EndComp
$Comp
L power:GND #PWR?
U 1 1 5F12193F
P 7000 5100
AR Path="/5EF3A6F3/5F12193F" Ref="#PWR?"  Part="1" 
AR Path="/5EF3A6EB/5F12193F" Ref="#PWR?"  Part="1" 
AR Path="/5EF3A6F1/5F12193F" Ref="#PWR?"  Part="1" 
F 0 "#PWR?" H 7000 4850 50  0001 C CNN
F 1 "GND" V 7005 4972 50  0000 R CNN
F 2 "" H 7000 5100 50  0001 C CNN
F 3 "" H 7000 5100 50  0001 C CNN
	1    7000 5100
	0    -1   1    0   
$EndComp
$Comp
L power:GND #PWR?
U 1 1 5F121F85
P 7000 4400
AR Path="/5EF3A6F3/5F121F85" Ref="#PWR?"  Part="1" 
AR Path="/5EF3A6EB/5F121F85" Ref="#PWR?"  Part="1" 
AR Path="/5EF3A6F1/5F121F85" Ref="#PWR?"  Part="1" 
F 0 "#PWR?" H 7000 4150 50  0001 C CNN
F 1 "GND" V 7005 4272 50  0000 R CNN
F 2 "" H 7000 4400 50  0001 C CNN
F 3 "" H 7000 4400 50  0001 C CNN
	1    7000 4400
	0    -1   1    0   
$EndComp
$Comp
L power:GND #PWR?
U 1 1 5F121F8B
P 7000 4700
AR Path="/5EF3A6F3/5F121F8B" Ref="#PWR?"  Part="1" 
AR Path="/5EF3A6EB/5F121F8B" Ref="#PWR?"  Part="1" 
AR Path="/5EF3A6F1/5F121F8B" Ref="#PWR?"  Part="1" 
F 0 "#PWR?" H 7000 4450 50  0001 C CNN
F 1 "GND" V 7005 4572 50  0000 R CNN
F 2 "" H 7000 4700 50  0001 C CNN
F 3 "" H 7000 4700 50  0001 C CNN
	1    7000 4700
	0    -1   1    0   
$EndComp
$Comp
L power:GND #PWR?
U 1 1 5F1253BF
P 7000 4000
AR Path="/5EF3A6F3/5F1253BF" Ref="#PWR?"  Part="1" 
AR Path="/5EF3A6EB/5F1253BF" Ref="#PWR?"  Part="1" 
AR Path="/5EF3A6F1/5F1253BF" Ref="#PWR?"  Part="1" 
F 0 "#PWR?" H 7000 3750 50  0001 C CNN
F 1 "GND" V 7005 3872 50  0000 R CNN
F 2 "" H 7000 4000 50  0001 C CNN
F 3 "" H 7000 4000 50  0001 C CNN
	1    7000 4000
	0    -1   1    0   
$EndComp
$Comp
L power:GND #PWR?
U 1 1 5F1253C5
P 7000 4300
AR Path="/5EF3A6F3/5F1253C5" Ref="#PWR?"  Part="1" 
AR Path="/5EF3A6EB/5F1253C5" Ref="#PWR?"  Part="1" 
AR Path="/5EF3A6F1/5F1253C5" Ref="#PWR?"  Part="1" 
F 0 "#PWR?" H 7000 4050 50  0001 C CNN
F 1 "GND" V 7005 4172 50  0000 R CNN
F 2 "" H 7000 4300 50  0001 C CNN
F 3 "" H 7000 4300 50  0001 C CNN
	1    7000 4300
	0    -1   1    0   
$EndComp
$Comp
L power:GND #PWR?
U 1 1 5F125C07
P 7000 3600
AR Path="/5EF3A6F3/5F125C07" Ref="#PWR?"  Part="1" 
AR Path="/5EF3A6EB/5F125C07" Ref="#PWR?"  Part="1" 
AR Path="/5EF3A6F1/5F125C07" Ref="#PWR?"  Part="1" 
F 0 "#PWR?" H 7000 3350 50  0001 C CNN
F 1 "GND" V 7005 3472 50  0000 R CNN
F 2 "" H 7000 3600 50  0001 C CNN
F 3 "" H 7000 3600 50  0001 C CNN
	1    7000 3600
	0    -1   1    0   
$EndComp
$Comp
L power:GND #PWR?
U 1 1 5F125C0D
P 7000 3900
AR Path="/5EF3A6F3/5F125C0D" Ref="#PWR?"  Part="1" 
AR Path="/5EF3A6EB/5F125C0D" Ref="#PWR?"  Part="1" 
AR Path="/5EF3A6F1/5F125C0D" Ref="#PWR?"  Part="1" 
F 0 "#PWR?" H 7000 3650 50  0001 C CNN
F 1 "GND" V 7005 3772 50  0000 R CNN
F 2 "" H 7000 3900 50  0001 C CNN
F 3 "" H 7000 3900 50  0001 C CNN
	1    7000 3900
	0    -1   1    0   
$EndComp
$Comp
L power:GND #PWR?
U 1 1 5F1262F5
P 7000 3200
AR Path="/5EF3A6F3/5F1262F5" Ref="#PWR?"  Part="1" 
AR Path="/5EF3A6EB/5F1262F5" Ref="#PWR?"  Part="1" 
AR Path="/5EF3A6F1/5F1262F5" Ref="#PWR?"  Part="1" 
F 0 "#PWR?" H 7000 2950 50  0001 C CNN
F 1 "GND" V 7005 3072 50  0000 R CNN
F 2 "" H 7000 3200 50  0001 C CNN
F 3 "" H 7000 3200 50  0001 C CNN
	1    7000 3200
	0    -1   1    0   
$EndComp
$Comp
L power:GND #PWR?
U 1 1 5F1262FB
P 7000 3500
AR Path="/5EF3A6F3/5F1262FB" Ref="#PWR?"  Part="1" 
AR Path="/5EF3A6EB/5F1262FB" Ref="#PWR?"  Part="1" 
AR Path="/5EF3A6F1/5F1262FB" Ref="#PWR?"  Part="1" 
F 0 "#PWR?" H 7000 3250 50  0001 C CNN
F 1 "GND" V 7005 3372 50  0000 R CNN
F 2 "" H 7000 3500 50  0001 C CNN
F 3 "" H 7000 3500 50  0001 C CNN
	1    7000 3500
	0    -1   1    0   
$EndComp
$Comp
L power:GND #PWR?
U 1 1 5F126A4B
P 7000 2800
AR Path="/5EF3A6F3/5F126A4B" Ref="#PWR?"  Part="1" 
AR Path="/5EF3A6EB/5F126A4B" Ref="#PWR?"  Part="1" 
AR Path="/5EF3A6F1/5F126A4B" Ref="#PWR?"  Part="1" 
F 0 "#PWR?" H 7000 2550 50  0001 C CNN
F 1 "GND" V 7005 2672 50  0000 R CNN
F 2 "" H 7000 2800 50  0001 C CNN
F 3 "" H 7000 2800 50  0001 C CNN
	1    7000 2800
	0    -1   1    0   
$EndComp
$Comp
L power:GND #PWR?
U 1 1 5F126A51
P 7000 3100
AR Path="/5EF3A6F3/5F126A51" Ref="#PWR?"  Part="1" 
AR Path="/5EF3A6EB/5F126A51" Ref="#PWR?"  Part="1" 
AR Path="/5EF3A6F1/5F126A51" Ref="#PWR?"  Part="1" 
F 0 "#PWR?" H 7000 2850 50  0001 C CNN
F 1 "GND" V 7005 2972 50  0000 R CNN
F 2 "" H 7000 3100 50  0001 C CNN
F 3 "" H 7000 3100 50  0001 C CNN
	1    7000 3100
	0    -1   1    0   
$EndComp
$Comp
L power:GND #PWR?
U 1 1 5F1298D3
P 7000 2400
AR Path="/5EF3A6F3/5F1298D3" Ref="#PWR?"  Part="1" 
AR Path="/5EF3A6EB/5F1298D3" Ref="#PWR?"  Part="1" 
AR Path="/5EF3A6F1/5F1298D3" Ref="#PWR?"  Part="1" 
F 0 "#PWR?" H 7000 2150 50  0001 C CNN
F 1 "GND" V 7005 2272 50  0000 R CNN
F 2 "" H 7000 2400 50  0001 C CNN
F 3 "" H 7000 2400 50  0001 C CNN
	1    7000 2400
	0    -1   1    0   
$EndComp
$Comp
L power:GND #PWR?
U 1 1 5F1298D9
P 7000 2700
AR Path="/5EF3A6F3/5F1298D9" Ref="#PWR?"  Part="1" 
AR Path="/5EF3A6EB/5F1298D9" Ref="#PWR?"  Part="1" 
AR Path="/5EF3A6F1/5F1298D9" Ref="#PWR?"  Part="1" 
F 0 "#PWR?" H 7000 2450 50  0001 C CNN
F 1 "GND" V 7005 2572 50  0000 R CNN
F 2 "" H 7000 2700 50  0001 C CNN
F 3 "" H 7000 2700 50  0001 C CNN
	1    7000 2700
	0    -1   1    0   
$EndComp
$Comp
L power:GND #PWR?
U 1 1 5F129F8B
P 7000 2000
AR Path="/5EF3A6F3/5F129F8B" Ref="#PWR?"  Part="1" 
AR Path="/5EF3A6EB/5F129F8B" Ref="#PWR?"  Part="1" 
AR Path="/5EF3A6F1/5F129F8B" Ref="#PWR?"  Part="1" 
F 0 "#PWR?" H 7000 1750 50  0001 C CNN
F 1 "GND" V 7005 1872 50  0000 R CNN
F 2 "" H 7000 2000 50  0001 C CNN
F 3 "" H 7000 2000 50  0001 C CNN
	1    7000 2000
	0    -1   1    0   
$EndComp
$Comp
L power:GND #PWR?
U 1 1 5F129F91
P 7000 2300
AR Path="/5EF3A6F3/5F129F91" Ref="#PWR?"  Part="1" 
AR Path="/5EF3A6EB/5F129F91" Ref="#PWR?"  Part="1" 
AR Path="/5EF3A6F1/5F129F91" Ref="#PWR?"  Part="1" 
F 0 "#PWR?" H 7000 2050 50  0001 C CNN
F 1 "GND" V 7005 2172 50  0000 R CNN
F 2 "" H 7000 2300 50  0001 C CNN
F 3 "" H 7000 2300 50  0001 C CNN
	1    7000 2300
	0    -1   1    0   
$EndComp
Text Notes 3950 4750 2    50   ~ 0
100 MHz PCIe
Text Notes 3850 3600 0    50   ~ 0
FPGA_CLK
Wire Wire Line
	5200 3600 4800 3600
Wire Wire Line
	5200 3500 4800 3500
Wire Wire Line
	5200 4800 4800 4800
Wire Wire Line
	5200 4300 4800 4300
Wire Wire Line
	5200 4400 4800 4400
Wire Wire Line
	5200 2800 4800 2800
Wire Wire Line
	5200 2700 4800 2700
Wire Wire Line
	5200 3200 4800 3200
Wire Wire Line
	5200 3100 4800 3100
Wire Wire Line
	4800 2400 5200 2400
Wire Wire Line
	5200 2300 4800 2300
Text Notes 3250 3200 0    50   ~ 0
MGTREFCLK1_223
Text Notes 3250 2800 0    50   ~ 0
MGTREFCLK1_224
Text Notes 3250 2400 0    50   ~ 0
MGTREFCLK1_225
Wire Wire Line
	7400 2100 7000 2100
Wire Wire Line
	7400 2200 7000 2200
Wire Wire Line
	7400 2500 7000 2500
Wire Wire Line
	7400 2600 7000 2600
Wire Wire Line
	7400 2900 7000 2900
Wire Wire Line
	7400 3000 7000 3000
Wire Wire Line
	7400 3300 7000 3300
Wire Wire Line
	7400 3400 7000 3400
Wire Wire Line
	7400 3700 7000 3700
Wire Wire Line
	7400 3800 7000 3800
Wire Wire Line
	7400 4100 7000 4100
Wire Wire Line
	7400 4200 7000 4200
Wire Wire Line
	7400 4500 7000 4500
Wire Wire Line
	7400 4600 7000 4600
Wire Wire Line
	7400 4900 7000 4900
Wire Wire Line
	7400 5000 7000 5000
Wire Wire Line
	7400 5300 7000 5300
Wire Wire Line
	7400 5400 7000 5400
Wire Wire Line
	7400 5700 7000 5700
Wire Wire Line
	7400 5800 7000 5800
Text GLabel 4800 3900 0    50   Output ~ 0
IN_CLK_P0
Text GLabel 4800 4000 0    50   Output ~ 0
IN_CLK_N0
Text GLabel 4550 4700 0    50   Input ~ 0
OUT_CLK_P0
Text GLabel 4550 4800 0    50   Input ~ 0
OUT_CLK_N0
Wire Wire Line
	5200 5100 4800 5100
Wire Wire Line
	5200 5200 4800 5200
Wire Wire Line
	5200 2000 4800 2000
NoConn ~ 4800 2000
NoConn ~ 4800 5100
NoConn ~ 4800 5200
NoConn ~ 7400 2100
NoConn ~ 7400 2200
NoConn ~ 7400 2500
NoConn ~ 7400 2600
NoConn ~ 7400 2900
NoConn ~ 7400 3000
NoConn ~ 7400 3300
NoConn ~ 7400 3400
Text Notes 8250 3750 0    50   ~ 0
Not connected in Motherboard!
Text Notes 1850 2400 0    50   ~ 0
Not connected in Motherboard!
Text Notes 1850 2800 0    50   ~ 0
Not connected in Motherboard!
Text Notes 1850 3200 0    50   ~ 0
Not connected in Motherboard!
Text Notes 4650 4350 2    50   ~ 0
Not connected in Motherboard!
Text Notes 8250 4150 0    50   ~ 0
Not connected in Motherboard!
Text Notes 8250 4550 0    50   ~ 0
Not connected in Motherboard!
Text Notes 8250 4950 0    50   ~ 0
Not connected in Motherboard!
Text Notes 8250 5350 0    50   ~ 0
Not connected in Motherboard!
Text Notes 8250 5750 0    50   ~ 0
Not connected in Motherboard!
NoConn ~ 4800 4300
NoConn ~ 4800 4400
Text GLabel 4800 3600 0    50   Output ~ 0
IN_CLK_N3
Text GLabel 4800 3500 0    50   Output ~ 0
IN_CLK_P3
Wire Wire Line
	5200 3900 4800 3900
Wire Wire Line
	4800 4000 5200 4000
Text Notes 3650 4000 0    50   ~ 0
OSC_COAX_CLK
Wire Wire Line
	4800 4700 5200 4700
Wire Wire Line
	4650 4800 4800 4700
Wire Wire Line
	4800 4800 4650 4700
Wire Wire Line
	4550 4700 4650 4700
Wire Wire Line
	4550 4800 4650 4800
Wire Wire Line
	4350 5900 4350 5600
Wire Wire Line
	4350 5900 5200 5900
Wire Wire Line
	4350 5500 5200 5500
Wire Wire Line
	4350 5600 5200 5600
Connection ~ 4350 5600
Wire Wire Line
	4350 5600 4350 5500
Wire Wire Line
	4350 5500 4350 5450
Connection ~ 4350 5500
$Comp
L power:+12V #PWR?
U 1 1 5F6A22BD
P 4350 5450
F 0 "#PWR?" H 4350 5300 50  0001 C CNN
F 1 "+12V" H 4365 5623 50  0000 C CNN
F 2 "" H 4350 5450 50  0001 C CNN
F 3 "" H 4350 5450 50  0001 C CNN
	1    4350 5450
	1    0    0    -1  
$EndComp
Text Notes 4700 2300 2    50   ~ 0
PL_MGT_CLK_P5
Text Notes 4700 2400 2    50   ~ 0
PL_MGT_CLK_N5
Text Notes 4700 2700 2    50   ~ 0
PL_MGT_CLK_P3
Text Notes 4700 2800 2    50   ~ 0
PL_MGT_CLK_N3
Text Notes 4700 3100 2    50   ~ 0
PL_MGT_CLK_P1
Text Notes 4700 3200 2    50   ~ 0
PL_MGT_CLK_N1
Text Notes 7500 3700 0    50   ~ 0
PL_MGT_RX_P10
Text Notes 7500 3800 0    50   ~ 0
PL_MGT_RX_N10
Text Notes 7500 4100 0    50   ~ 0
PL_MGT_RX_P11
Text Notes 7500 4200 0    50   ~ 0
PL_MGT_RX_N11
Text Notes 7500 4500 0    50   ~ 0
PL_MGT_RX_P12
Text Notes 7500 4600 0    50   ~ 0
PL_MGT_RX_N12
Text Notes 7500 4900 0    50   ~ 0
PL_MGT_RX_P13
Text Notes 7500 5000 0    50   ~ 0
PL_MGT_RX_N13
Text Notes 7500 5300 0    50   ~ 0
PL_MGT_RX_P14
Text Notes 7500 5400 0    50   ~ 0
PL_MGT_RX_N14
Text Notes 7500 5700 0    50   ~ 0
PL_MGT_RX_P15
Text Notes 7500 5800 0    50   ~ 0
PL_MGT_RX_N15
NoConn ~ 4800 2300
NoConn ~ 4800 2400
NoConn ~ 4800 2700
NoConn ~ 4800 2800
NoConn ~ 4800 3100
NoConn ~ 4800 3200
NoConn ~ 7400 3700
NoConn ~ 7400 3800
NoConn ~ 7400 4100
NoConn ~ 7400 4200
NoConn ~ 7400 4500
NoConn ~ 7400 4600
NoConn ~ 7400 4900
NoConn ~ 7400 5000
NoConn ~ 7400 5300
NoConn ~ 7400 5400
NoConn ~ 7400 5700
NoConn ~ 7400 5800
$EndSCHEMATC
