EESchema Schematic File Version 4
EELAYER 30 0
EELAYER END
$Descr A4 11693 8268
encoding utf-8
Sheet 9 28
Title "ZynqMP Mezzanine FMC+ (BuZZyBoard)"
Date "2020-10-02"
Rev "1.0"
Comp "Karlsruhe Institute of Technology (KIT)"
Comment1 "Institute for Data Processing and Electronics (IPE)"
Comment2 "Luis Ardila"
Comment3 ""
Comment4 ""
$EndDescr
$Comp
L power:GND #PWR?
U 1 1 5E335D10
P 5500 3000
F 0 "#PWR?" H 5500 2750 50  0001 C CNN
F 1 "GND" H 5505 2827 50  0000 C CNN
F 2 "" H 5500 3000 50  0001 C CNN
F 3 "" H 5500 3000 50  0001 C CNN
	1    5500 3000
	1    0    0    -1  
$EndComp
Wire Wire Line
	3950 2600 4900 2600
$Comp
L Device:R R57
U 1 1 5E34E039
P 4150 2100
F 0 "R57" H 4220 2146 50  0000 L CNN
F 1 "4.7k" H 4220 2055 50  0000 L CNN
F 2 "Resistor_SMD:R_0402_1005Metric" V 4080 2100 50  0001 C CNN
F 3 "~" H 4150 2100 50  0001 C CNN
F 4 "AVT-IPE" H 4150 2100 50  0001 C CNN "stock"
	1    4150 2100
	1    0    0    -1  
$EndComp
$Comp
L Device:R R59
U 1 1 5E35A6AE
P 6150 2100
F 0 "R59" H 6220 2146 50  0000 L CNN
F 1 "4.7k" H 6220 2055 50  0000 L CNN
F 2 "Resistor_SMD:R_0402_1005Metric" V 6080 2100 50  0001 C CNN
F 3 "~" H 6150 2100 50  0001 C CNN
F 4 "AVT-IPE" H 6150 2100 50  0001 C CNN "stock"
	1    6150 2100
	1    0    0    -1  
$EndComp
Wire Wire Line
	4900 2500 4150 2500
Wire Wire Line
	4150 2250 4150 2500
Connection ~ 4150 2500
Wire Wire Line
	4150 2500 3950 2500
Wire Wire Line
	6150 2250 6150 2650
$Comp
L Device:C C116
U 1 1 6152622E
P 7250 1600
F 0 "C116" H 7135 1646 50  0000 R CNN
F 1 "0.1uF" H 7135 1555 50  0000 R CNN
F 2 "Capacitor_SMD:C_0402_1005Metric" H 7288 1450 50  0001 C CNN
F 3 "~" H 7250 1600 50  0001 C CNN
F 4 "16 V" H 7250 1600 50  0001 C CNN "info"
F 5 "AVT-IPE" H 7250 1600 50  0001 C CNN "stock"
	1    7250 1600
	-1   0    0    -1  
$EndComp
Wire Wire Line
	6150 1950 6150 1900
$Comp
L power:GND #PWR?
U 1 1 61533361
P 7250 1750
F 0 "#PWR?" H 7250 1500 50  0001 C CNN
F 1 "GND" H 7255 1577 50  0000 C CNN
F 2 "" H 7250 1750 50  0001 C CNN
F 3 "" H 7250 1750 50  0001 C CNN
	1    7250 1750
	1    0    0    -1  
$EndComp
Wire Wire Line
	5500 1900 5500 2000
Text GLabel 3950 2600 0    50   Input ~ 0
QSPI_0_SCLK
Text GLabel 7400 2250 2    50   BiDi ~ 0
QSPI_0_IO[0..3]
Text GLabel 3950 2500 0    50   Input ~ 0
QSPI_0_CS_B
Text Notes 8400 2250 0    50   ~ 0
VCC 3V3 @ 20 mA 
$Comp
L KIT_Power:+3V3_STBY #PWR?
U 1 1 5F6D15C7
P 5500 1900
AR Path="/5F72F5D7/5F6D15C7" Ref="#PWR?"  Part="1" 
AR Path="/5F439249/5F6D15C7" Ref="#PWR?"  Part="1" 
F 0 "#PWR?" H 5500 1750 50  0001 C CNN
F 1 "+3V3_STBY" H 5515 2073 50  0000 C CNN
F 2 "" H 5500 1900 50  0001 C CNN
F 3 "" H 5500 1900 50  0001 C CNN
	1    5500 1900
	1    0    0    -1  
$EndComp
$Comp
L KIT_Memory_Flash:N25Q512A U15
U 1 1 5F6F475F
P 5500 2500
F 0 "U15" H 5150 2900 50  0000 C CNN
F 1 "N25Q512A" H 5750 2900 50  0000 C CNN
F 2 "KIT_Package_BGA:T-PBGA-24_5x5_6.0x8.0mm" H 5500 1550 50  0001 C CNN
F 3 "" H 5500 2500 50  0001 C CNN
F 4 "Micron Technology Inc." H 5500 2500 50  0001 C CNN "manf"
F 5 "N25Q512A83G1241F TR" H 5500 2500 50  0001 C CNN "manf#"
F 6 "Cypress Semiconductor Corp" H 5500 2500 50  0001 C CNN "manf1"
F 7 "S25FL512S" H 5500 2500 50  0001 C CNN "manf1#"
F 8 "Winbond Electronics" H 5500 2500 50  0001 C CNN "manf2"
F 9 "W25Q512JVBIQ" H 5500 2500 50  0001 C CNN "manf2#"
F 10 "Macronix" H 5500 2500 50  0001 C CNN "manf3"
F 11 "MX25L51245GXDI-08G" H 5500 2500 50  0001 C CNN "manf3#"
F 12 "124-2654" H 5500 2500 50  0001 C CNN "rs#"
	1    5500 2500
	1    0    0    -1  
$EndComp
Text Label 6650 2450 0    50   ~ 0
QSPI_0_IO1
Text Label 6650 2550 0    50   ~ 0
QSPI_0_IO2
Text Label 6650 2650 0    50   ~ 0
QSPI_0_IO3
Text Label 6650 2350 0    50   ~ 0
QSPI_0_IO0
Wire Wire Line
	6100 2350 7200 2350
Wire Wire Line
	6100 2450 7200 2450
Wire Wire Line
	6100 2550 6500 2550
Wire Wire Line
	7200 2650 6150 2650
Entry Wire Line
	7200 2350 7300 2250
Entry Wire Line
	7200 2650 7300 2550
Entry Wire Line
	7200 2550 7300 2450
Entry Wire Line
	7200 2450 7300 2350
Wire Bus Line
	7300 2250 7400 2250
Connection ~ 6150 2650
Wire Wire Line
	6150 2650 6100 2650
$Comp
L Device:R R41
U 1 1 5F72B70E
P 4500 2100
F 0 "R41" H 4570 2146 50  0000 L CNN
F 1 "4.7k" H 4570 2055 50  0000 L CNN
F 2 "Resistor_SMD:R_0402_1005Metric" V 4430 2100 50  0001 C CNN
F 3 "~" H 4500 2100 50  0001 C CNN
F 4 "AVT-IPE" H 4500 2100 50  0001 C CNN "stock"
	1    4500 2100
	1    0    0    -1  
$EndComp
Wire Wire Line
	4500 2250 4500 2400
Wire Wire Line
	4900 2400 4500 2400
$Comp
L KIT_Power:+3V3_STBY #PWR?
U 1 1 5F7469D3
P 7250 1450
AR Path="/5F72F5D7/5F7469D3" Ref="#PWR?"  Part="1" 
AR Path="/5F439249/5F7469D3" Ref="#PWR?"  Part="1" 
F 0 "#PWR?" H 7250 1300 50  0001 C CNN
F 1 "+3V3_STBY" H 7265 1623 50  0000 C CNN
F 2 "" H 7250 1450 50  0001 C CNN
F 3 "" H 7250 1450 50  0001 C CNN
	1    7250 1450
	1    0    0    -1  
$EndComp
$Comp
L KIT_Power:+3V3_STBY #PWR?
U 1 1 5F74EAFE
P 4350 1850
AR Path="/5F72F5D7/5F74EAFE" Ref="#PWR?"  Part="1" 
AR Path="/5F439249/5F74EAFE" Ref="#PWR?"  Part="1" 
F 0 "#PWR?" H 4350 1700 50  0001 C CNN
F 1 "+3V3_STBY" H 4365 2023 50  0000 C CNN
F 2 "" H 4350 1850 50  0001 C CNN
F 3 "" H 4350 1850 50  0001 C CNN
	1    4350 1850
	1    0    0    -1  
$EndComp
Wire Wire Line
	4500 1900 4350 1900
Wire Wire Line
	4350 1900 4350 1850
Wire Wire Line
	4350 1900 4150 1900
Connection ~ 4350 1900
$Comp
L power:GND #PWR?
U 1 1 5F76E08E
P 5550 5050
F 0 "#PWR?" H 5550 4800 50  0001 C CNN
F 1 "GND" H 5555 4877 50  0000 C CNN
F 2 "" H 5550 5050 50  0001 C CNN
F 3 "" H 5550 5050 50  0001 C CNN
	1    5550 5050
	1    0    0    -1  
$EndComp
Wire Wire Line
	4000 4650 4950 4650
$Comp
L Device:R R58
U 1 1 5F76E095
P 4200 4150
F 0 "R58" H 4270 4196 50  0000 L CNN
F 1 "4.7k" H 4270 4105 50  0000 L CNN
F 2 "Resistor_SMD:R_0402_1005Metric" V 4130 4150 50  0001 C CNN
F 3 "~" H 4200 4150 50  0001 C CNN
F 4 "AVT-IPE" H 4200 4150 50  0001 C CNN "stock"
	1    4200 4150
	1    0    0    -1  
$EndComp
$Comp
L Device:R R60
U 1 1 5F76E09B
P 6200 4150
F 0 "R60" H 6270 4196 50  0000 L CNN
F 1 "4.7k" H 6270 4105 50  0000 L CNN
F 2 "Resistor_SMD:R_0402_1005Metric" V 6130 4150 50  0001 C CNN
F 3 "~" H 6200 4150 50  0001 C CNN
F 4 "AVT-IPE" H 6200 4150 50  0001 C CNN "stock"
	1    6200 4150
	1    0    0    -1  
$EndComp
Wire Wire Line
	4950 4550 4200 4550
Wire Wire Line
	4200 4300 4200 4550
Connection ~ 4200 4550
Wire Wire Line
	4200 4550 4000 4550
Wire Wire Line
	6200 4300 6200 4700
$Comp
L Device:C C117
U 1 1 5F76E0A8
P 7250 3650
F 0 "C117" H 7135 3696 50  0000 R CNN
F 1 "0.1uF" H 7135 3605 50  0000 R CNN
F 2 "Capacitor_SMD:C_0402_1005Metric" H 7288 3500 50  0001 C CNN
F 3 "~" H 7250 3650 50  0001 C CNN
F 4 "16 V" H 7250 3650 50  0001 C CNN "info"
F 5 "AVT-IPE" H 7250 3650 50  0001 C CNN "stock"
	1    7250 3650
	-1   0    0    -1  
$EndComp
Wire Wire Line
	6200 4000 6200 3950
$Comp
L power:GND #PWR?
U 1 1 5F76E0AF
P 7250 3800
F 0 "#PWR?" H 7250 3550 50  0001 C CNN
F 1 "GND" H 7255 3627 50  0000 C CNN
F 2 "" H 7250 3800 50  0001 C CNN
F 3 "" H 7250 3800 50  0001 C CNN
	1    7250 3800
	1    0    0    -1  
$EndComp
Wire Wire Line
	5550 3950 5550 4050
Text GLabel 7400 4300 2    50   BiDi ~ 0
QSPI_1_IO[0..3]
$Comp
L KIT_Power:+3V3_STBY #PWR?
U 1 1 5F76E0B9
P 5550 3950
AR Path="/5F72F5D7/5F76E0B9" Ref="#PWR?"  Part="1" 
AR Path="/5F439249/5F76E0B9" Ref="#PWR?"  Part="1" 
F 0 "#PWR?" H 5550 3800 50  0001 C CNN
F 1 "+3V3_STBY" H 5565 4123 50  0000 C CNN
F 2 "" H 5550 3950 50  0001 C CNN
F 3 "" H 5550 3950 50  0001 C CNN
	1    5550 3950
	1    0    0    -1  
$EndComp
$Comp
L KIT_Memory_Flash:N25Q512A U16
U 1 1 5F76E0C7
P 5550 4550
F 0 "U16" H 5200 4950 50  0000 C CNN
F 1 "N25Q512A" H 5800 4950 50  0000 C CNN
F 2 "KIT_Package_BGA:T-PBGA-24_5x5_6.0x8.0mm" H 5550 3600 50  0001 C CNN
F 3 "" H 5550 4550 50  0001 C CNN
F 4 "Micron Technology Inc." H 5550 4550 50  0001 C CNN "manf"
F 5 "N25Q512A83G1241F TR" H 5550 4550 50  0001 C CNN "manf#"
F 6 "Cypress Semiconductor Corp" H 5550 4550 50  0001 C CNN "manf1"
F 7 "S25FL512S" H 5550 4550 50  0001 C CNN "manf1#"
F 8 "Winbond Electronics" H 5550 4550 50  0001 C CNN "manf2"
F 9 "W25Q512JVBIQ" H 5550 4550 50  0001 C CNN "manf2#"
F 10 "Macronix" H 5550 4550 50  0001 C CNN "manf3"
F 11 "MX25L51245GXDI-08G" H 5550 4550 50  0001 C CNN "manf3#"
F 12 "124-2654" H 5550 4550 50  0001 C CNN "rs#"
	1    5550 4550
	1    0    0    -1  
$EndComp
Entry Wire Line
	7200 4400 7300 4300
Entry Wire Line
	7200 4700 7300 4600
Entry Wire Line
	7200 4600 7300 4500
Entry Wire Line
	7200 4500 7300 4400
Wire Bus Line
	7300 4300 7400 4300
Wire Wire Line
	6200 4700 6150 4700
$Comp
L Device:R R42
U 1 1 5F76E0DC
P 4550 4150
F 0 "R42" H 4620 4196 50  0000 L CNN
F 1 "4.7k" H 4620 4105 50  0000 L CNN
F 2 "Resistor_SMD:R_0402_1005Metric" V 4480 4150 50  0001 C CNN
F 3 "~" H 4550 4150 50  0001 C CNN
F 4 "AVT-IPE" H 4550 4150 50  0001 C CNN "stock"
	1    4550 4150
	1    0    0    -1  
$EndComp
Wire Wire Line
	4550 4300 4550 4450
Wire Wire Line
	4950 4450 4550 4450
$Comp
L KIT_Power:+3V3_STBY #PWR?
U 1 1 5F76E0E4
P 7250 3500
AR Path="/5F72F5D7/5F76E0E4" Ref="#PWR?"  Part="1" 
AR Path="/5F439249/5F76E0E4" Ref="#PWR?"  Part="1" 
F 0 "#PWR?" H 7250 3350 50  0001 C CNN
F 1 "+3V3_STBY" H 7265 3673 50  0000 C CNN
F 2 "" H 7250 3500 50  0001 C CNN
F 3 "" H 7250 3500 50  0001 C CNN
	1    7250 3500
	1    0    0    -1  
$EndComp
$Comp
L KIT_Power:+3V3_STBY #PWR?
U 1 1 5F76E0F0
P 4400 3900
AR Path="/5F72F5D7/5F76E0F0" Ref="#PWR?"  Part="1" 
AR Path="/5F439249/5F76E0F0" Ref="#PWR?"  Part="1" 
F 0 "#PWR?" H 4400 3750 50  0001 C CNN
F 1 "+3V3_STBY" H 4415 4073 50  0000 C CNN
F 2 "" H 4400 3900 50  0001 C CNN
F 3 "" H 4400 3900 50  0001 C CNN
	1    4400 3900
	1    0    0    -1  
$EndComp
Wire Wire Line
	4550 3950 4400 3950
Wire Wire Line
	4400 3950 4400 3900
Wire Wire Line
	4400 3950 4200 3950
Connection ~ 4400 3950
Text GLabel 4000 4650 0    50   Input ~ 0
QSPI_1_SCLK
Text GLabel 4000 4550 0    50   Input ~ 0
QSPI_1_CS_B
Text Label 6600 4400 0    50   ~ 0
QSPI_1_IO0
Text Label 6600 4500 0    50   ~ 0
QSPI_1_IO1
Text Label 6600 4600 0    50   ~ 0
QSPI_1_IO2
Text Label 6600 4700 0    50   ~ 0
QSPI_1_IO3
Text Notes 8350 4300 0    50   ~ 0
VCC 3V3 @ 20 mA 
Wire Wire Line
	6150 4400 7200 4400
Wire Wire Line
	6150 4500 7200 4500
Wire Wire Line
	6150 4600 6550 4600
Wire Wire Line
	6200 4700 7200 4700
Connection ~ 6200 4700
$Comp
L Device:R R165
U 1 1 5FE16CEA
P 6500 2100
F 0 "R165" H 6570 2146 50  0000 L CNN
F 1 "4.7k" H 6570 2055 50  0000 L CNN
F 2 "Resistor_SMD:R_0402_1005Metric" V 6430 2100 50  0001 C CNN
F 3 "~" H 6500 2100 50  0001 C CNN
F 4 "AVT-IPE" H 6500 2100 50  0001 C CNN "stock"
	1    6500 2100
	1    0    0    -1  
$EndComp
Wire Wire Line
	6500 1950 6500 1900
Wire Wire Line
	4150 1900 4150 1950
Wire Wire Line
	4500 1900 4500 1950
$Comp
L KIT_Power:+3V3_STBY #PWR?
U 1 1 5FE1A8B3
P 6350 1850
AR Path="/5F72F5D7/5FE1A8B3" Ref="#PWR?"  Part="1" 
AR Path="/5F439249/5FE1A8B3" Ref="#PWR?"  Part="1" 
F 0 "#PWR?" H 6350 1700 50  0001 C CNN
F 1 "+3V3_STBY" H 6365 2023 50  0000 C CNN
F 2 "" H 6350 1850 50  0001 C CNN
F 3 "" H 6350 1850 50  0001 C CNN
	1    6350 1850
	1    0    0    -1  
$EndComp
Wire Wire Line
	6500 1900 6350 1900
Wire Wire Line
	6350 1900 6350 1850
Wire Wire Line
	6350 1900 6150 1900
Connection ~ 6350 1900
$Comp
L KIT_Power:+3V3_STBY #PWR?
U 1 1 5FE1B7E5
P 6400 3900
AR Path="/5F72F5D7/5FE1B7E5" Ref="#PWR?"  Part="1" 
AR Path="/5F439249/5FE1B7E5" Ref="#PWR?"  Part="1" 
F 0 "#PWR?" H 6400 3750 50  0001 C CNN
F 1 "+3V3_STBY" H 6415 4073 50  0000 C CNN
F 2 "" H 6400 3900 50  0001 C CNN
F 3 "" H 6400 3900 50  0001 C CNN
	1    6400 3900
	1    0    0    -1  
$EndComp
Wire Wire Line
	6550 3950 6400 3950
Wire Wire Line
	6400 3950 6400 3900
Wire Wire Line
	6400 3950 6200 3950
Connection ~ 6400 3950
Wire Wire Line
	4200 3950 4200 4000
Wire Wire Line
	4550 3950 4550 4000
$Comp
L Device:R R166
U 1 1 5FE1FA53
P 6550 4150
F 0 "R166" H 6620 4196 50  0000 L CNN
F 1 "4.7k" H 6620 4105 50  0000 L CNN
F 2 "Resistor_SMD:R_0402_1005Metric" V 6480 4150 50  0001 C CNN
F 3 "~" H 6550 4150 50  0001 C CNN
F 4 "AVT-IPE" H 6550 4150 50  0001 C CNN "stock"
	1    6550 4150
	1    0    0    -1  
$EndComp
Wire Wire Line
	6550 4000 6550 3950
Wire Wire Line
	6550 4300 6550 4600
Connection ~ 6550 4600
Wire Wire Line
	6550 4600 7200 4600
Wire Wire Line
	6500 2250 6500 2550
Connection ~ 6500 2550
Wire Wire Line
	6500 2550 7200 2550
Wire Bus Line
	7300 2250 7300 2550
Wire Bus Line
	7300 4300 7300 4600
$EndSCHEMATC
