EESchema Schematic File Version 4
EELAYER 30 0
EELAYER END
$Descr A3 16535 11693
encoding utf-8
Sheet 6 28
Title "ZynqMP Mezzanine FMC+ (BuZZyBoard)"
Date "2020-10-02"
Rev "1.0"
Comp "Karlsruhe Institute of Technology (KIT)"
Comment1 "Institute for Data Processing and Electronics (IPE)"
Comment2 "Luis Ardila"
Comment3 ""
Comment4 ""
$EndDescr
Wire Wire Line
	6250 5800 6900 5800
Wire Wire Line
	7000 5700 6500 5700
Wire Wire Line
	7000 4900 6900 4900
Wire Wire Line
	7000 4800 6500 4800
Wire Wire Line
	6250 5200 6900 5200
Wire Wire Line
	7000 5100 6500 5100
Wire Wire Line
	6250 5500 6900 5500
Wire Wire Line
	7000 5400 6500 5400
$Comp
L Device:R R50
U 1 1 5FC43023
P 6700 5750
F 0 "R50" V 6500 5750 50  0000 C CNN
F 1 "100" V 6600 5750 50  0000 C CNN
F 2 "Resistor_SMD:R_0402_1005Metric" V 6630 5750 50  0001 C CNN
F 3 "~" H 6700 5750 50  0001 C CNN
F 4 "AVT-IPE" H 6700 5750 50  0001 C CNN "stock"
	1    6700 5750
	0    1    1    0   
$EndComp
$Comp
L Device:R R49
U 1 1 5FC4A1D8
P 6700 5450
F 0 "R49" V 6500 5450 50  0000 C CNN
F 1 "100" V 6600 5450 50  0000 C CNN
F 2 "Resistor_SMD:R_0402_1005Metric" V 6630 5450 50  0001 C CNN
F 3 "~" H 6700 5450 50  0001 C CNN
F 4 "AVT-IPE" H 6700 5450 50  0001 C CNN "stock"
	1    6700 5450
	0    1    1    0   
$EndComp
$Comp
L Device:R R48
U 1 1 5EB394CF
P 6700 5150
F 0 "R48" V 6500 5150 50  0000 C CNN
F 1 "100" V 6600 5150 50  0000 C CNN
F 2 "Resistor_SMD:R_0402_1005Metric" V 6630 5150 50  0001 C CNN
F 3 "~" H 6700 5150 50  0001 C CNN
F 4 "AVT-IPE" H 6700 5150 50  0001 C CNN "stock"
	1    6700 5150
	0    1    1    0   
$EndComp
$Comp
L Device:R R47
U 1 1 5EB394D0
P 6700 4850
F 0 "R47" V 6500 4850 50  0000 C CNN
F 1 "100" V 6600 4850 50  0000 C CNN
F 2 "Resistor_SMD:R_0402_1005Metric" V 6630 4850 50  0001 C CNN
F 3 "~" H 6700 4850 50  0001 C CNN
F 4 "AVT-IPE" H 6700 4850 50  0001 C CNN "stock"
	1    6700 4850
	0    1    1    0   
$EndComp
Wire Wire Line
	6550 4850 6500 4850
Wire Wire Line
	6500 4850 6500 4800
Connection ~ 6500 4800
Wire Wire Line
	6500 4800 6250 4800
Wire Wire Line
	6850 4850 6900 4850
Wire Wire Line
	6900 4850 6900 4900
Connection ~ 6900 4900
Wire Wire Line
	6900 4900 6250 4900
Wire Wire Line
	6550 5150 6500 5150
Wire Wire Line
	6500 5150 6500 5100
Connection ~ 6500 5100
Wire Wire Line
	6500 5100 6250 5100
Wire Wire Line
	6850 5150 6900 5150
Wire Wire Line
	6900 5150 6900 5200
Connection ~ 6900 5200
Wire Wire Line
	6900 5200 7000 5200
Wire Wire Line
	6850 5450 6900 5450
Wire Wire Line
	6900 5450 6900 5500
Connection ~ 6900 5500
Wire Wire Line
	6900 5500 7000 5500
Wire Wire Line
	6550 5450 6500 5450
Wire Wire Line
	6500 5450 6500 5400
Connection ~ 6500 5400
Wire Wire Line
	6500 5400 6250 5400
Wire Wire Line
	6550 5750 6500 5750
Wire Wire Line
	6500 5750 6500 5700
Connection ~ 6500 5700
Wire Wire Line
	6500 5700 6250 5700
Wire Wire Line
	6850 5750 6900 5750
Wire Wire Line
	6900 5750 6900 5800
Connection ~ 6900 5800
Wire Wire Line
	6900 5800 7000 5800
$Comp
L Device:Crystal_GND24 Y1
U 1 1 5EB394D1
P 5950 3950
F 0 "Y1" V 6250 3950 50  0000 C CNN
F 1 "CX2016DB_48MHz" V 6150 3950 50  0000 C CNN
F 2 "KIT_Crystal:Crystal_SMD_2016-4Pin_2.0x1.6mm" H 5950 3950 50  0001 C CNN
F 3 "https://global.kyocera.com/prdct/electro/product/pdf/cx2016db_e.pdf" H 5950 3950 50  0001 C CNN
F 4 "1253-1783-1-ND" V 5950 3950 50  0001 C CNN "digikey#"
F 5 "Notch in Pin 2 & Silkscreen Pin 1" V 5700 4250 50  0000 C CNN "info"
	1    5950 3950
	0    -1   -1   0   
$EndComp
Wire Wire Line
	5950 3800 6600 3800
Wire Wire Line
	6600 3800 6600 3900
Wire Wire Line
	6600 3900 7000 3900
Wire Wire Line
	7000 4000 6600 4000
Wire Wire Line
	6600 4000 6600 4100
Wire Wire Line
	6600 4100 5950 4100
Wire Wire Line
	6150 3950 6350 3950
Wire Wire Line
	6350 3950 6350 4350
Wire Wire Line
	6350 4350 6700 4350
Wire Wire Line
	6700 4350 6700 4100
Wire Wire Line
	6700 4100 7000 4100
Wire Wire Line
	6350 4350 4950 4350
Wire Wire Line
	4950 3550 5500 3550
Wire Wire Line
	6700 3550 6700 3800
Wire Wire Line
	6700 3800 7000 3800
Connection ~ 6350 4350
Wire Wire Line
	5750 3950 5500 3950
Wire Wire Line
	5500 3950 5500 3550
Connection ~ 5500 3550
Wire Wire Line
	5500 3550 6700 3550
Text Label 5900 4350 2    50   ~ 0
crystal_guardring
Wire Wire Line
	9950 4500 8900 4500
Wire Wire Line
	8900 4600 10600 4600
Wire Wire Line
	10250 4500 11150 4500
Wire Wire Line
	11150 4600 10900 4600
Wire Wire Line
	9950 4800 8900 4800
Wire Wire Line
	11150 4900 10900 4900
Wire Wire Line
	9950 5700 8900 5700
Wire Wire Line
	11150 5800 10900 5800
Wire Wire Line
	9950 6000 8900 6000
Wire Wire Line
	11150 6100 10900 6100
Wire Wire Line
	9950 6300 8900 6300
Wire Wire Line
	11150 6400 10900 6400
Wire Wire Line
	9950 6600 8900 6600
Wire Wire Line
	11150 6700 10900 6700
Text Label 9700 4500 2    50   ~ 0
CLK0A_P
Text Label 9700 4600 2    50   ~ 0
CLK0A_N
Text Label 9700 4800 2    50   ~ 0
CLK0_P
Text Label 9700 4900 2    50   ~ 0
CLK0_N
Text Label 9700 5700 2    50   ~ 0
CLK3_P
Text Label 9700 5800 2    50   ~ 0
CLK3_N
Text Label 9700 6000 2    50   ~ 0
CLK4_P
Text Label 9700 6100 2    50   ~ 0
CLK4_N
Text Label 9700 6300 2    50   ~ 0
CLK5_P
Text Label 9700 6400 2    50   ~ 0
CLK5_N
Text Label 9700 6600 2    50   ~ 0
CLK6_P
Text Label 9700 6700 2    50   ~ 0
CLK6_N
$Comp
L Device:C C94
U 1 1 5FD93997
P 6350 2650
F 0 "C94" H 6465 2696 50  0000 L CNN
F 1 "1uF" H 6465 2605 50  0000 L CNN
F 2 "Capacitor_SMD:C_0402_1005Metric" H 6388 2500 50  0001 C CNN
F 3 "~" H 6350 2650 50  0001 C CNN
F 4 "16 V" H 6350 2650 50  0001 C CNN "info"
F 5 "AVT-IPE" H 6350 2650 50  0001 C CNN "stock"
	1    6350 2650
	1    0    0    -1  
$EndComp
$Comp
L Device:C C106
U 1 1 5EB394D6
P 10750 4900
F 0 "C106" V 10700 5000 50  0000 L CNN
F 1 "10nF" V 10700 4800 50  0000 R CNN
F 2 "Capacitor_SMD:C_0201_0603Metric" H 10788 4750 50  0001 C CNN
F 3 "~" H 10750 4900 50  0001 C CNN
	1    10750 4900
	0    1    1    0   
$EndComp
Wire Wire Line
	8900 4900 10600 4900
Wire Wire Line
	10250 4800 11150 4800
$Comp
L Device:C C101
U 1 1 5EB394D7
P 10100 5700
F 0 "C101" V 10050 5800 50  0000 L CNN
F 1 "10nF" V 10050 5600 50  0000 R CNN
F 2 "Capacitor_SMD:C_0201_0603Metric" H 10138 5550 50  0001 C CNN
F 3 "~" H 10100 5700 50  0001 C CNN
	1    10100 5700
	0    1    1    0   
$EndComp
$Comp
L Device:C C107
U 1 1 5FD9A125
P 10750 5800
F 0 "C107" V 10700 5900 50  0000 L CNN
F 1 "10nF" V 10700 5700 50  0000 R CNN
F 2 "Capacitor_SMD:C_0201_0603Metric" H 10788 5650 50  0001 C CNN
F 3 "~" H 10750 5800 50  0001 C CNN
	1    10750 5800
	0    1    1    0   
$EndComp
Wire Wire Line
	8900 5800 10600 5800
Wire Wire Line
	10250 5700 11150 5700
$Comp
L Device:C C102
U 1 1 5FD9D196
P 10100 6000
F 0 "C102" V 10050 6100 50  0000 L CNN
F 1 "10nF" V 10050 5900 50  0000 R CNN
F 2 "Capacitor_SMD:C_0201_0603Metric" H 10138 5850 50  0001 C CNN
F 3 "~" H 10100 6000 50  0001 C CNN
	1    10100 6000
	0    1    1    0   
$EndComp
$Comp
L Device:C C108
U 1 1 5FD9D19C
P 10750 6100
F 0 "C108" V 10700 6200 50  0000 L CNN
F 1 "10nF" V 10700 6000 50  0000 R CNN
F 2 "Capacitor_SMD:C_0201_0603Metric" H 10788 5950 50  0001 C CNN
F 3 "~" H 10750 6100 50  0001 C CNN
	1    10750 6100
	0    1    1    0   
$EndComp
Wire Wire Line
	8900 6100 10600 6100
Wire Wire Line
	10250 6000 11150 6000
$Comp
L Device:C C103
U 1 1 5FDA063C
P 10100 6300
F 0 "C103" V 10050 6400 50  0000 L CNN
F 1 "10nF" V 10050 6200 50  0000 R CNN
F 2 "Capacitor_SMD:C_0201_0603Metric" H 10138 6150 50  0001 C CNN
F 3 "~" H 10100 6300 50  0001 C CNN
	1    10100 6300
	0    1    1    0   
$EndComp
$Comp
L Device:C C109
U 1 1 5FDA0642
P 10750 6400
F 0 "C109" V 10700 6500 50  0000 L CNN
F 1 "10nF" V 10700 6300 50  0000 R CNN
F 2 "Capacitor_SMD:C_0201_0603Metric" H 10788 6250 50  0001 C CNN
F 3 "~" H 10750 6400 50  0001 C CNN
	1    10750 6400
	0    1    1    0   
$EndComp
Wire Wire Line
	8900 6400 10600 6400
Wire Wire Line
	10250 6300 11150 6300
$Comp
L Device:C C104
U 1 1 5EB394DD
P 10100 6600
F 0 "C104" V 10050 6700 50  0000 L CNN
F 1 "10nF" V 10050 6500 50  0000 R CNN
F 2 "Capacitor_SMD:C_0201_0603Metric" H 10138 6450 50  0001 C CNN
F 3 "~" H 10100 6600 50  0001 C CNN
	1    10100 6600
	0    1    1    0   
$EndComp
$Comp
L Device:C C110
U 1 1 5EB394DE
P 10750 6700
F 0 "C110" V 10700 6800 50  0000 L CNN
F 1 "10nF" V 10700 6600 50  0000 R CNN
F 2 "Capacitor_SMD:C_0201_0603Metric" H 10788 6550 50  0001 C CNN
F 3 "~" H 10750 6700 50  0001 C CNN
	1    10750 6700
	0    1    1    0   
$EndComp
Wire Wire Line
	8900 6700 10600 6700
Wire Wire Line
	10250 6600 11150 6600
$Comp
L Device:C C95
U 1 1 5EB394DF
P 6750 2650
F 0 "C95" H 6865 2696 50  0000 L CNN
F 1 "1uF" H 6865 2605 50  0000 L CNN
F 2 "Capacitor_SMD:C_0402_1005Metric" H 6788 2500 50  0001 C CNN
F 3 "~" H 6750 2650 50  0001 C CNN
F 4 "16 V" H 6750 2650 50  0001 C CNN "info"
F 5 "AVT-IPE" H 6750 2650 50  0001 C CNN "stock"
	1    6750 2650
	1    0    0    -1  
$EndComp
$Comp
L power:GND #PWR?
U 1 1 5EB394E1
P 6200 2800
F 0 "#PWR?" H 6200 2550 50  0001 C CNN
F 1 "GND" H 6205 2627 50  0000 C CNN
F 2 "" H 6200 2800 50  0001 C CNN
F 3 "" H 6200 2800 50  0001 C CNN
	1    6200 2800
	1    0    0    -1  
$EndComp
Wire Wire Line
	6200 2800 6350 2800
Connection ~ 6350 2800
Wire Wire Line
	6350 2800 6750 2800
Connection ~ 6750 2800
Wire Wire Line
	6750 2800 7150 2800
Wire Wire Line
	7650 2500 7650 2950
Wire Wire Line
	7750 3100 7750 2950
Wire Wire Line
	7750 2950 7650 2950
Connection ~ 7650 2950
Wire Wire Line
	7650 2950 7650 3100
Wire Wire Line
	7850 3100 7850 2950
Wire Wire Line
	7850 2950 7750 2950
Connection ~ 7750 2950
$Comp
L Device:C C96
U 1 1 5EB394E0
P 7150 2650
F 0 "C96" H 7265 2696 50  0000 L CNN
F 1 "1uF" H 7265 2605 50  0000 L CNN
F 2 "Capacitor_SMD:C_0402_1005Metric" H 7188 2500 50  0001 C CNN
F 3 "~" H 7150 2650 50  0001 C CNN
F 4 "16 V" H 7150 2650 50  0001 C CNN "info"
F 5 "AVT-IPE" H 7150 2650 50  0001 C CNN "stock"
	1    7150 2650
	1    0    0    -1  
$EndComp
$Comp
L Device:C C97
U 1 1 5FE0EEA0
P 8200 2700
F 0 "C97" H 8315 2746 50  0000 L CNN
F 1 "1uF" H 8315 2655 50  0000 L CNN
F 2 "Capacitor_SMD:C_0402_1005Metric" H 8238 2550 50  0001 C CNN
F 3 "~" H 8200 2700 50  0001 C CNN
F 4 "16 V" H 8200 2700 50  0001 C CNN "info"
F 5 "AVT-IPE" H 8200 2700 50  0001 C CNN "stock"
	1    8200 2700
	1    0    0    -1  
$EndComp
$Comp
L power:GND #PWR?
U 1 1 5FE12025
P 8200 2850
F 0 "#PWR?" H 8200 2600 50  0001 C CNN
F 1 "GND" H 8205 2677 50  0000 C CNN
F 2 "" H 8200 2850 50  0001 C CNN
F 3 "" H 8200 2850 50  0001 C CNN
	1    8200 2850
	1    0    0    -1  
$EndComp
$Comp
L KIT_Power:+3V3_STBY #PWR?
U 1 1 5EB394E5
P 9550 2450
F 0 "#PWR?" H 9550 2300 50  0001 C CNN
F 1 "+3V3_STBY" H 9565 2623 50  0000 C CNN
F 2 "" H 9550 2450 50  0001 C CNN
F 3 "" H 9550 2450 50  0001 C CNN
	1    9550 2450
	1    0    0    -1  
$EndComp
$Comp
L KIT_Power:+1V8_STBY #PWR?
U 1 1 616E2D9E
P 5250 2450
F 0 "#PWR?" H 5250 2300 50  0001 C CNN
F 1 "+1V8_STBY" H 5265 2623 50  0000 C CNN
F 2 "" H 5250 2450 50  0001 C CNN
F 3 "" H 5250 2450 50  0001 C CNN
	1    5250 2450
	1    0    0    -1  
$EndComp
Wire Wire Line
	5250 2450 5250 2500
Wire Wire Line
	8200 2500 8200 2550
$Comp
L power:GND #PWR?
U 1 1 5EB394B9
P 7950 8350
F 0 "#PWR?" H 7950 8100 50  0001 C CNN
F 1 "GND" H 7955 8177 50  0000 C CNN
F 2 "" H 7950 8350 50  0001 C CNN
F 3 "" H 7950 8350 50  0001 C CNN
	1    7950 8350
	1    0    0    -1  
$EndComp
$Comp
L Device:C C100
U 1 1 5EB394D5
P 10100 4800
F 0 "C100" V 10050 4900 50  0000 L CNN
F 1 "10nF" V 10050 4700 50  0000 R CNN
F 2 "Capacitor_SMD:C_0201_0603Metric" H 10138 4650 50  0001 C CNN
F 3 "~" H 10100 4800 50  0001 C CNN
	1    10100 4800
	0    1    1    0   
$EndComp
$Comp
L Device:C C105
U 1 1 5EB394D3
P 10750 4600
F 0 "C105" V 10700 4700 50  0000 L CNN
F 1 "10nF" V 10700 4500 50  0000 R CNN
F 2 "Capacitor_SMD:C_0201_0603Metric" H 10788 4450 50  0001 C CNN
F 3 "~" H 10750 4600 50  0001 C CNN
	1    10750 4600
	0    1    1    0   
$EndComp
$Comp
L Device:C C99
U 1 1 5FD1222B
P 10100 4500
F 0 "C99" V 10050 4600 50  0000 L CNN
F 1 "10nF" V 10050 4400 50  0000 R CNN
F 2 "Capacitor_SMD:C_0201_0603Metric" H 10138 4350 50  0001 C CNN
F 3 "~" H 10100 4500 50  0001 C CNN
	1    10100 4500
	0    1    1    0   
$EndComp
Wire Wire Line
	4950 3550 4950 4350
Text Label 6800 3900 0    50   ~ 0
XA
Text Label 6800 4000 0    50   ~ 0
XB
$Comp
L KIT_Clock:Si5395 U9
U 1 1 602928D3
P 7950 4800
F 0 "U9" H 7250 6350 50  0000 C CNN
F 1 "Si5395" H 8550 6350 50  0000 C CNN
F 2 "KIT_Package_DFN_QFN:QFN-64-1EP_9x9mm_P0.5mm_EP5.2x5.2mm_ThermalVias" H 7950 400 50  0001 C CNN
F 3 "https://www.silabs.com/documents/public/reference-manuals/si5395-94-92-family.pdf" H 7950 5400 50  0001 C CNN
F 4 "336-4802-ND" H 7950 4800 50  0001 C CNN "digikey#"
	1    7950 4800
	1    0    0    -1  
$EndComp
NoConn ~ 7000 7800
NoConn ~ 7000 7900
Text Notes 12100 4900 0    50   ~ 0
GBE 125 MHz
Text Notes 12100 4600 0    50   ~ 0
USB3.0 100 MHz
Text Notes 12100 5200 0    50   ~ 0
SATA 125 MHz
Wire Wire Line
	9100 4300 8900 4300
Wire Wire Line
	8900 3400 9100 3400
Connection ~ 9100 3400
Wire Wire Line
	9100 3400 9100 3500
Wire Wire Line
	8900 3500 9100 3500
Connection ~ 9100 3500
Wire Wire Line
	9100 3500 9100 3600
Wire Wire Line
	8900 3600 9100 3600
Connection ~ 9100 3600
Wire Wire Line
	9100 3600 9100 3700
Wire Wire Line
	8900 3700 9100 3700
Connection ~ 9100 3700
Wire Wire Line
	9100 3700 9100 3800
Wire Wire Line
	8900 3800 9100 3800
Connection ~ 9100 3800
Wire Wire Line
	9100 3800 9100 3900
Wire Wire Line
	8900 3900 9100 3900
Connection ~ 9100 3900
Wire Wire Line
	9100 3900 9100 4000
Wire Wire Line
	8900 4000 9100 4000
Connection ~ 9100 4000
Wire Wire Line
	9100 4000 9100 4100
Wire Wire Line
	8900 4100 9100 4100
Connection ~ 9100 4100
Wire Wire Line
	9100 4100 9100 4200
Wire Wire Line
	8900 4200 9100 4200
Connection ~ 9100 4200
Wire Wire Line
	9100 4200 9100 4300
Wire Wire Line
	9950 5100 8900 5100
Wire Wire Line
	8900 5200 10600 5200
Wire Wire Line
	10250 5100 11150 5100
Wire Wire Line
	11150 5200 10900 5200
Wire Wire Line
	9950 5400 8900 5400
Wire Wire Line
	11150 5500 10900 5500
Text Label 9700 5100 2    50   ~ 0
CLK1_P
Text Label 9700 5200 2    50   ~ 0
CLK1_N
Text Label 9700 5400 2    50   ~ 0
CLK2_P
Text Label 9700 5500 2    50   ~ 0
CLK2_N
$Comp
L Device:C C135
U 1 1 5F0635CE
P 10750 5500
F 0 "C135" V 10700 5600 50  0000 L CNN
F 1 "10nF" V 10700 5400 50  0000 R CNN
F 2 "Capacitor_SMD:C_0201_0603Metric" H 10788 5350 50  0001 C CNN
F 3 "~" H 10750 5500 50  0001 C CNN
	1    10750 5500
	0    1    1    0   
$EndComp
Wire Wire Line
	8900 5500 10600 5500
Wire Wire Line
	10250 5400 11150 5400
$Comp
L Device:C C133
U 1 1 5F0635D6
P 10100 5400
F 0 "C133" V 10050 5500 50  0000 L CNN
F 1 "10nF" V 10050 5300 50  0000 R CNN
F 2 "Capacitor_SMD:C_0201_0603Metric" H 10138 5250 50  0001 C CNN
F 3 "~" H 10100 5400 50  0001 C CNN
	1    10100 5400
	0    1    1    0   
$EndComp
$Comp
L Device:C C134
U 1 1 5EB394C0
P 10750 5200
F 0 "C134" V 10700 5300 50  0000 L CNN
F 1 "10nF" V 10700 5100 50  0000 R CNN
F 2 "Capacitor_SMD:C_0201_0603Metric" H 10788 5050 50  0001 C CNN
F 3 "~" H 10750 5200 50  0001 C CNN
	1    10750 5200
	0    1    1    0   
$EndComp
$Comp
L Device:C C132
U 1 1 5F0635E2
P 10100 5100
F 0 "C132" V 10050 5200 50  0000 L CNN
F 1 "10nF" V 10050 5000 50  0000 R CNN
F 2 "Capacitor_SMD:C_0201_0603Metric" H 10138 4950 50  0001 C CNN
F 3 "~" H 10100 5100 50  0001 C CNN
	1    10100 5100
	0    1    1    0   
$EndComp
$Comp
L Device:C C139
U 1 1 5F2B0E04
P 9550 3600
F 0 "C139" H 9435 3646 50  0000 R CNN
F 1 "0.1uF" H 9435 3555 50  0000 R CNN
F 2 "Capacitor_SMD:C_0402_1005Metric" H 9588 3450 50  0001 C CNN
F 3 "~" H 9550 3600 50  0001 C CNN
F 4 "16 V" H 9550 3600 50  0001 C CNN "info"
F 5 "AVT-IPE" H 9550 3600 50  0001 C CNN "stock"
	1    9550 3600
	-1   0    0    -1  
$EndComp
$Comp
L Device:C C140
U 1 1 5EB394C3
P 10050 3600
F 0 "C140" H 9935 3646 50  0000 R CNN
F 1 "0.1uF" H 9935 3555 50  0000 R CNN
F 2 "Capacitor_SMD:C_0402_1005Metric" H 10088 3450 50  0001 C CNN
F 3 "~" H 10050 3600 50  0001 C CNN
F 4 "16 V" H 10050 3600 50  0001 C CNN "info"
F 5 "AVT-IPE" H 10050 3600 50  0001 C CNN "stock"
	1    10050 3600
	-1   0    0    -1  
$EndComp
$Comp
L Device:C C141
U 1 1 5EB394C4
P 10550 3600
F 0 "C141" H 10435 3646 50  0000 R CNN
F 1 "0.1uF" H 10435 3555 50  0000 R CNN
F 2 "Capacitor_SMD:C_0402_1005Metric" H 10588 3450 50  0001 C CNN
F 3 "~" H 10550 3600 50  0001 C CNN
F 4 "16 V" H 10550 3600 50  0001 C CNN "info"
F 5 "AVT-IPE" H 10550 3600 50  0001 C CNN "stock"
	1    10550 3600
	-1   0    0    -1  
$EndComp
$Comp
L Device:C C142
U 1 1 5EB394C5
P 11050 3600
F 0 "C142" H 10935 3646 50  0000 R CNN
F 1 "0.1uF" H 10935 3555 50  0000 R CNN
F 2 "Capacitor_SMD:C_0402_1005Metric" H 11088 3450 50  0001 C CNN
F 3 "~" H 11050 3600 50  0001 C CNN
F 4 "16 V" H 11050 3600 50  0001 C CNN "info"
F 5 "AVT-IPE" H 11050 3600 50  0001 C CNN "stock"
	1    11050 3600
	-1   0    0    -1  
$EndComp
$Comp
L Device:C C143
U 1 1 5F2CC72B
P 11550 3600
F 0 "C143" H 11435 3646 50  0000 R CNN
F 1 "0.1uF" H 11435 3555 50  0000 R CNN
F 2 "Capacitor_SMD:C_0402_1005Metric" H 11588 3450 50  0001 C CNN
F 3 "~" H 11550 3600 50  0001 C CNN
F 4 "16 V" H 11550 3600 50  0001 C CNN "info"
F 5 "AVT-IPE" H 11550 3600 50  0001 C CNN "stock"
	1    11550 3600
	-1   0    0    -1  
$EndComp
$Comp
L Device:C C144
U 1 1 5F2CC733
P 12050 3600
F 0 "C144" H 11935 3646 50  0000 R CNN
F 1 "0.1uF" H 11935 3555 50  0000 R CNN
F 2 "Capacitor_SMD:C_0402_1005Metric" H 12088 3450 50  0001 C CNN
F 3 "~" H 12050 3600 50  0001 C CNN
F 4 "16 V" H 12050 3600 50  0001 C CNN "info"
F 5 "AVT-IPE" H 12050 3600 50  0001 C CNN "stock"
	1    12050 3600
	-1   0    0    -1  
$EndComp
$Comp
L Device:C C145
U 1 1 5F2D4AB9
P 12600 3600
F 0 "C145" H 12485 3646 50  0000 R CNN
F 1 "0.1uF" H 12485 3555 50  0000 R CNN
F 2 "Capacitor_SMD:C_0402_1005Metric" H 12638 3450 50  0001 C CNN
F 3 "~" H 12600 3600 50  0001 C CNN
F 4 "16 V" H 12600 3600 50  0001 C CNN "info"
F 5 "AVT-IPE" H 12600 3600 50  0001 C CNN "stock"
	1    12600 3600
	-1   0    0    -1  
$EndComp
$Comp
L Device:C C146
U 1 1 5F2D4AC1
P 13100 3600
F 0 "C146" H 12985 3646 50  0000 R CNN
F 1 "0.1uF" H 12985 3555 50  0000 R CNN
F 2 "Capacitor_SMD:C_0402_1005Metric" H 13138 3450 50  0001 C CNN
F 3 "~" H 13100 3600 50  0001 C CNN
F 4 "16 V" H 13100 3600 50  0001 C CNN "info"
F 5 "AVT-IPE" H 13100 3600 50  0001 C CNN "stock"
	1    13100 3600
	-1   0    0    -1  
$EndComp
$Comp
L Device:C C147
U 1 1 5F2EA337
P 13600 3600
F 0 "C147" H 13485 3646 50  0000 R CNN
F 1 "0.1uF" H 13485 3555 50  0000 R CNN
F 2 "Capacitor_SMD:C_0402_1005Metric" H 13638 3450 50  0001 C CNN
F 3 "~" H 13600 3600 50  0001 C CNN
F 4 "16 V" H 13600 3600 50  0001 C CNN "info"
F 5 "AVT-IPE" H 13600 3600 50  0001 C CNN "stock"
	1    13600 3600
	-1   0    0    -1  
$EndComp
$Comp
L Device:C C148
U 1 1 5F2EA33F
P 14100 3600
F 0 "C148" H 13985 3646 50  0000 R CNN
F 1 "0.1uF" H 13985 3555 50  0000 R CNN
F 2 "Capacitor_SMD:C_0402_1005Metric" H 14138 3450 50  0001 C CNN
F 3 "~" H 14100 3600 50  0001 C CNN
F 4 "16 V" H 14100 3600 50  0001 C CNN "info"
F 5 "AVT-IPE" H 14100 3600 50  0001 C CNN "stock"
	1    14100 3600
	-1   0    0    -1  
$EndComp
Wire Wire Line
	14350 3800 14350 3850
Wire Wire Line
	14100 3450 14100 3400
Wire Wire Line
	9550 3400 9550 3450
Wire Wire Line
	9550 3750 9550 3800
Connection ~ 9550 3400
Wire Wire Line
	9550 3400 9100 3400
Wire Wire Line
	9550 3800 10050 3800
Wire Wire Line
	10050 3400 10050 3450
Wire Wire Line
	10050 3750 10050 3800
Connection ~ 10050 3400
Wire Wire Line
	10050 3400 9550 3400
Connection ~ 10050 3800
Wire Wire Line
	10550 3400 10550 3450
Wire Wire Line
	10050 3800 10550 3800
Wire Wire Line
	10550 3750 10550 3800
Connection ~ 10550 3400
Wire Wire Line
	10550 3400 10050 3400
Connection ~ 10550 3800
Wire Wire Line
	10550 3800 11050 3800
Wire Wire Line
	11050 3400 11050 3450
Wire Wire Line
	11050 3750 11050 3800
Connection ~ 11050 3400
Wire Wire Line
	11050 3400 10550 3400
Connection ~ 11050 3800
Wire Wire Line
	11050 3800 11550 3800
Wire Wire Line
	11550 3400 11550 3450
Wire Wire Line
	11550 3750 11550 3800
Connection ~ 11550 3400
Wire Wire Line
	11550 3400 11050 3400
Connection ~ 11550 3800
Wire Wire Line
	11550 3800 12050 3800
Wire Wire Line
	12050 3400 12050 3450
Wire Wire Line
	12050 3750 12050 3800
Connection ~ 12050 3400
Wire Wire Line
	12050 3400 11550 3400
Connection ~ 12050 3800
Wire Wire Line
	12050 3800 12600 3800
Wire Wire Line
	14100 3400 13600 3400
Wire Wire Line
	12600 3400 12600 3450
Wire Wire Line
	12600 3750 12600 3800
Connection ~ 12600 3400
Wire Wire Line
	12600 3400 12050 3400
Connection ~ 12600 3800
Wire Wire Line
	12600 3800 13100 3800
Wire Wire Line
	13100 3400 13100 3450
Wire Wire Line
	13100 3750 13100 3800
Connection ~ 13100 3400
Wire Wire Line
	13100 3400 12600 3400
Connection ~ 13100 3800
Wire Wire Line
	13100 3800 13600 3800
Wire Wire Line
	13600 3400 13600 3450
Wire Wire Line
	13600 3750 13600 3800
Connection ~ 13600 3400
Wire Wire Line
	13600 3400 13100 3400
Connection ~ 13600 3800
Wire Wire Line
	13600 3800 14100 3800
Wire Wire Line
	14100 3750 14100 3800
Connection ~ 14100 3800
Wire Wire Line
	14100 3800 14350 3800
$Comp
L power:GND #PWR?
U 1 1 5F38880E
P 14350 3850
F 0 "#PWR?" H 14350 3600 50  0001 C CNN
F 1 "GND" H 14355 3677 50  0000 C CNN
F 2 "" H 14350 3850 50  0001 C CNN
F 3 "" H 14350 3850 50  0001 C CNN
	1    14350 3850
	1    0    0    -1  
$EndComp
Text Notes 10700 2250 0    50   ~ 0
VDD 1V8 @ 170mA\nVDDA 3V3 @ 123mA\nVDDO @ 31mA 
Wire Wire Line
	8050 3100 8050 2500
Wire Wire Line
	8050 2500 8200 2500
Wire Wire Line
	9550 2450 9550 2500
Wire Wire Line
	9000 2500 9550 2500
Wire Wire Line
	6100 2500 6350 2500
Wire Wire Line
	5250 2500 5800 2500
Connection ~ 6350 2500
Wire Wire Line
	6350 2500 6750 2500
Connection ~ 6750 2500
Wire Wire Line
	6750 2500 7150 2500
Connection ~ 7150 2500
Wire Wire Line
	7150 2500 7650 2500
Text Label 7200 2500 0    50   ~ 0
+1V8_VDD
Connection ~ 8200 2500
Wire Wire Line
	8200 2500 8700 2500
Text Label 8250 2500 0    50   ~ 0
+3V3_VDDA
$Comp
L Device:Ferrite_Bead FB8
U 1 1 5EB394BA
P 5950 2500
F 0 "FB8" V 5713 2500 50  0000 C CNN
F 1 "120 Ohms @ 100MHz" V 5804 2500 50  0000 C CNN
F 2 "Inductor_SMD:L_0402_1005Metric" V 5880 2500 50  0001 C CNN
F 3 "https://www.murata.com/en-us/products/productdata/8796740059166/ENFA0018.pdf" H 5950 2500 50  0001 C CNN
F 4 "120 Ohms @ 100MHz 1 Power Line Ferrite Bead 0402 (1005 Metric) 2A 55mOhm" V 5950 2500 50  0001 C CNN "info"
F 5 "Murata" H 5950 2500 50  0001 C CNN "manf"
F 6 "BLM15PX121SN1D" H 5950 2500 50  0001 C CNN "manf#"
	1    5950 2500
	0    1    1    0   
$EndComp
$Comp
L Device:Ferrite_Bead FB9
U 1 1 5EB394BB
P 8850 2500
F 0 "FB9" V 8613 2500 50  0000 C CNN
F 1 "120 Ohms @ 100MHz" V 8704 2500 50  0000 C CNN
F 2 "Inductor_SMD:L_0402_1005Metric" V 8780 2500 50  0001 C CNN
F 3 "https://www.murata.com/en-us/products/productdata/8796740059166/ENFA0018.pdf" H 8850 2500 50  0001 C CNN
F 4 "120 Ohms @ 100MHz 1 Power Line Ferrite Bead 0402 (1005 Metric) 2A 55mOhm" V 8850 2500 50  0001 C CNN "info"
F 5 "Murata" H 8850 2500 50  0001 C CNN "manf"
F 6 "BLM15PX121SN1D" H 8850 2500 50  0001 C CNN "manf#"
	1    8850 2500
	0    1    1    0   
$EndComp
$Comp
L power:PWR_FLAG #FLG?
U 1 1 5EC09B0A
P 8200 2500
F 0 "#FLG?" H 8200 2575 50  0001 C CNN
F 1 "PWR_FLAG" H 8200 2673 50  0000 C CNN
F 2 "" H 8200 2500 50  0001 C CNN
F 3 "~" H 8200 2500 50  0001 C CNN
	1    8200 2500
	1    0    0    -1  
$EndComp
$Comp
L power:PWR_FLAG #FLG?
U 1 1 5EC09D87
P 7150 2500
F 0 "#FLG?" H 7150 2575 50  0001 C CNN
F 1 "PWR_FLAG" H 7150 2673 50  0000 C CNN
F 2 "" H 7150 2500 50  0001 C CNN
F 3 "~" H 7150 2500 50  0001 C CNN
	1    7150 2500
	1    0    0    -1  
$EndComp
Text GLabel 11150 4900 2    50   Output ~ 0
PS_MGT_CLK_N0
Text GLabel 11150 4600 2    50   Output ~ 0
PS_MGT_CLK_N1
Text GLabel 11150 5200 2    50   Output ~ 0
PS_MGT_CLK_N2
Text GLabel 11150 5500 2    50   Output ~ 0
PS_MGT_CLK_N3
Text GLabel 11150 4800 2    50   Output ~ 0
PS_MGT_CLK_P0
Text GLabel 11150 4500 2    50   Output ~ 0
PS_MGT_CLK_P1
Text GLabel 11150 5100 2    50   Output ~ 0
PS_MGT_CLK_P2
Text GLabel 11150 5400 2    50   Output ~ 0
PS_MGT_CLK_P3
Text GLabel 11150 5800 2    50   Output ~ 0
PL_MGT_CLK_P6
Text GLabel 11150 6100 2    50   Output ~ 0
PL_MGT_CLK_P4
Text GLabel 11150 6400 2    50   Output ~ 0
PL_MGT_CLK_P2
Text GLabel 11150 5700 2    50   Output ~ 0
PL_MGT_CLK_N6
Text GLabel 11150 6000 2    50   Output ~ 0
PL_MGT_CLK_N4
Text GLabel 11150 6300 2    50   Output ~ 0
PL_MGT_CLK_N2
Text GLabel 11150 6600 2    50   Output ~ 0
PL_MGT_CLK_P0
Text GLabel 11150 6700 2    50   Output ~ 0
PL_MGT_CLK_N0
Text Notes 12100 6650 0    50   ~ 0
B223
Text Notes 12100 6350 0    50   ~ 0
B224
Text Notes 12100 6050 0    50   ~ 0
B225
Text Notes 12100 5750 0    50   ~ 0
B226
Text GLabel 6250 5700 0    50   Input ~ 0
IN_CLK_P3
Text GLabel 6250 5800 0    50   Input ~ 0
IN_CLK_N3
Text GLabel 6250 5500 0    50   Input ~ 0
IN_CLK_N2
Text GLabel 6250 5400 0    50   Input ~ 0
IN_CLK_P2
Text GLabel 6250 5200 0    50   Input ~ 0
IN_CLK_N1
Text GLabel 6250 5100 0    50   Input ~ 0
IN_CLK_P1
Text GLabel 6250 4900 0    50   Input ~ 0
IN_CLK_N0
Text GLabel 6250 4800 0    50   Input ~ 0
IN_CLK_P0
Text GLabel 9750 6900 2    50   Output ~ 0
OUT_CLK_P0
Text GLabel 9750 7000 2    50   Output ~ 0
OUT_CLK_N0
Wire Wire Line
	9600 7500 8900 7500
Wire Wire Line
	9600 7600 8900 7600
Wire Wire Line
	9600 7800 8900 7800
Wire Wire Line
	9600 7900 8900 7900
Wire Wire Line
	9750 6900 8900 6900
Wire Wire Line
	9750 7000 8900 7000
Wire Wire Line
	9600 7200 8900 7200
Wire Wire Line
	9600 7300 8900 7300
Text Notes 10350 6950 0    50   ~ 0
100 MHz PCIe
$Comp
L KIT_Power:+3V3_STBY #PWR?
U 1 1 5F7AF755
P 14350 3350
F 0 "#PWR?" H 14350 3200 50  0001 C CNN
F 1 "+3V3_STBY" H 14365 3523 50  0000 C CNN
F 2 "" H 14350 3350 50  0001 C CNN
F 3 "" H 14350 3350 50  0001 C CNN
	1    14350 3350
	1    0    0    -1  
$EndComp
Wire Wire Line
	14350 3350 14350 3400
Wire Wire Line
	14100 3400 14350 3400
Connection ~ 14100 3400
Text GLabel 6650 6350 0    50   Input ~ 0
MO_SCL
Text GLabel 6650 6250 0    50   BiDi ~ 0
MO_SDA
Wire Wire Line
	6650 6250 7000 6250
Wire Wire Line
	7000 6350 6650 6350
Text Notes 6900 6150 2    50   ~ 0
I2C_SEL pulled up internally to select I2C interface
$Comp
L power:GND #PWR?
U 1 1 5EFA8095
P 6750 6600
F 0 "#PWR?" H 6750 6350 50  0001 C CNN
F 1 "GND" H 6755 6427 50  0000 C CNN
F 2 "" H 6750 6600 50  0001 C CNN
F 3 "" H 6750 6600 50  0001 C CNN
	1    6750 6600
	1    0    0    -1  
$EndComp
Wire Wire Line
	7000 6450 6750 6450
Wire Wire Line
	6750 6450 6750 6550
Wire Wire Line
	7000 6550 6750 6550
Connection ~ 6750 6550
Wire Wire Line
	6750 6550 6750 6600
Text GLabel 6650 6850 0    50   Input ~ 0
Si5395_RSTb
Wire Wire Line
	6650 6850 7000 6850
Text GLabel 6650 6950 0    50   Input ~ 0
Si5395_OE0b
Wire Wire Line
	6650 6950 7000 6950
Text GLabel 6650 7050 0    50   Input ~ 0
Si5395_IN_SEL1
Text GLabel 6650 7150 0    50   Input ~ 0
Si5395_IN_SEL0
Text GLabel 6650 7300 0    50   Output ~ 0
Si5395_INTRb
Text GLabel 6650 7400 0    50   Output ~ 0
Si5395_LOLb
Wire Wire Line
	7000 7050 6650 7050
Wire Wire Line
	6650 7150 7000 7150
Wire Wire Line
	7000 7300 6650 7300
Wire Wire Line
	6650 7400 7000 7400
Text Notes 3150 7100 0    50   ~ 0
IO_VDD_SEL:  0x0943 Control I/O info Select\n  -> or 1.8 V external connections; 1 for 3.3 V external connections
NoConn ~ 7000 6150
Text GLabel 1800 1900 0    50   BiDi ~ 0
B66_IO_[0..51]
Wire Bus Line
	2000 1900 1800 1900
Text GLabel 1800 2050 0    50   BiDi ~ 0
B65_IO_[0..51]
Wire Bus Line
	2000 2050 1800 2050
Text Label 1100 2900 0    50   ~ 0
B65_IO_20
Text Label 1100 2800 0    50   ~ 0
B65_IO_21
Text Label 2350 2800 2    50   ~ 0
OUT_CLK_P2
Text Label 2350 2900 2    50   ~ 0
OUT_CLK_N2
Wire Wire Line
	1100 2800 2350 2800
Wire Wire Line
	1100 2900 2350 2900
Text Label 9600 7500 2    50   ~ 0
OUT_CLK_P2
Text Label 9600 7600 2    50   ~ 0
OUT_CLK_N2
Text Label 1100 3100 0    50   ~ 0
B66_IO_27
Text Label 1100 3200 0    50   ~ 0
B66_IO_26
Text Label 9600 7800 2    50   ~ 0
OUT_CLK_P3
Text Label 9600 7900 2    50   ~ 0
OUT_CLK_N3
Text Label 2350 3100 2    50   ~ 0
OUT_CLK_P3
Text Label 2350 3200 2    50   ~ 0
OUT_CLK_N3
Wire Wire Line
	2350 3100 1100 3100
Wire Wire Line
	1100 3200 2350 3200
Text Label 1100 3500 0    50   ~ 0
B45_IO_14
Text Label 1100 3400 0    50   ~ 0
B45_IO_15
Text GLabel 1800 2200 0    50   BiDi ~ 0
B45_IO_[0..23]
Wire Bus Line
	2000 2200 1800 2200
Wire Wire Line
	1100 3400 2350 3400
Wire Wire Line
	2350 3500 1100 3500
Text Label 9600 7200 2    50   ~ 0
OUT_CLK_P1
Text Label 9600 7300 2    50   ~ 0
OUT_CLK_N1
Text Label 2350 3400 2    50   ~ 0
OUT_CLK_P1
Text Label 2350 3500 2    50   ~ 0
OUT_CLK_N1
$EndSCHEMATC
