EESchema Schematic File Version 4
EELAYER 30 0
EELAYER END
$Descr A3 16535 11693
encoding utf-8
Sheet 13 28
Title "ZynqMP Mezzanine FMC+ (BuZZyBoard)"
Date "2020-10-02"
Rev "1.0"
Comp "Karlsruhe Institute of Technology (KIT)"
Comment1 "Institute for Data Processing and Electronics (IPE)"
Comment2 "Luis Ardila"
Comment3 ""
Comment4 ""
$EndDescr
$Comp
L power:GND #PWR?
U 1 1 5F84F7AD
P 750 2500
F 0 "#PWR?" H 750 2250 50  0001 C CNN
F 1 "GND" H 755 2327 50  0000 C CNN
F 2 "" H 750 2500 50  0001 C CNN
F 3 "" H 750 2500 50  0001 C CNN
	1    750  2500
	1    0    0    -1  
$EndComp
$Comp
L Device:C C248
U 1 1 5F84F7AE
P 10600 6300
F 0 "C248" H 10715 6391 50  0000 L CNN
F 1 "22uF" H 10715 6300 50  0000 L CNN
F 2 "Capacitor_SMD:C_0603_1608Metric" H 10638 6150 50  0001 C CNN
F 3 "~" H 10600 6300 50  0001 C CNN
F 4 "AVT-IPE" H 10600 6300 50  0001 C CNN "stock"
F 5 "10V" H 10715 6209 50  0000 L CNN "info"
	1    10600 6300
	1    0    0    -1  
$EndComp
$Comp
L Device:C C254
U 1 1 5F84F7AB
P 11200 7950
F 0 "C254" H 11315 8041 50  0000 L CNN
F 1 "22uF" H 11315 7950 50  0000 L CNN
F 2 "Capacitor_SMD:C_0603_1608Metric" H 11238 7800 50  0001 C CNN
F 3 "~" H 11200 7950 50  0001 C CNN
F 4 "AVT-IPE" H 11200 7950 50  0001 C CNN "stock"
F 5 "10V" H 11315 7859 50  0000 L CNN "info"
	1    11200 7950
	1    0    0    -1  
$EndComp
$Comp
L Device:L L10
U 1 1 605FA33E
P 9550 6100
F 0 "L10" V 9740 6100 50  0000 C CNN
F 1 "2.2uH" V 9649 6100 50  0000 C CNN
F 2 "Inductor_SMD:L_Coilcraft_XxL4020" H 9550 6100 50  0001 C CNN
F 3 "https://www.mouser.de/datasheet/2/597/xal4000-270751.pdf" H 9550 6100 50  0001 C CNN
F 4 " 994-XAL4020-222MEC " V 9550 6100 50  0001 C CNN "mouser#"
	1    9550 6100
	0    -1   -1   0   
$EndComp
$Comp
L Device:Net-Tie_2 NT14
U 1 1 5F84F7B0
P 9550 6600
F 0 "NT14" H 9550 6689 50  0000 C CNN
F 1 "Net-Tie" H 9550 6690 50  0001 C CNN
F 2 "KIT_NetTie:NetTie-2_SMD_Pad0.3mm" H 9550 6600 50  0001 C CNN
F 3 "~" H 9550 6600 50  0001 C CNN
	1    9550 6600
	-1   0    0    -1  
$EndComp
$Comp
L Device:C C240
U 1 1 5F84F7B1
P 9150 6100
F 0 "C240" V 8898 6100 50  0000 C CNN
F 1 "0.22uF" V 8989 6100 50  0000 C CNN
F 2 "Resistor_SMD:R_0201_0603Metric" H 9188 5950 50  0001 C CNN
F 3 "~" H 9150 6100 50  0001 C CNN
	1    9150 6100
	0    1    1    0   
$EndComp
$Comp
L Device:C C244
U 1 1 5F84F7B2
P 10100 6300
F 0 "C244" H 10215 6391 50  0000 L CNN
F 1 "330uF" H 10215 6300 50  0000 L CNN
F 2 "Capacitor_SMD:C_1210_3225Metric" H 10138 6150 50  0001 C CNN
F 3 "~" H 10100 6300 50  0001 C CNN
F 4 "330µF ±20% 4V Keramikkondensatoren X5R 1210 (3225 metrisch)" H 10100 6300 50  0001 C CNN "info"
	1    10100 6300
	1    0    0    -1  
$EndComp
$Comp
L Device:C C252
U 1 1 5F84F7B3
P 11050 6300
F 0 "C252" H 11165 6391 50  0000 L CNN
F 1 "1uF" H 11165 6300 50  0000 L CNN
F 2 "Capacitor_SMD:C_0402_1005Metric" H 11088 6150 50  0001 C CNN
F 3 "~" H 11050 6300 50  0001 C CNN
F 4 "16 V" H 11165 6209 50  0000 L CNN "info"
F 5 "AVT-IPE" H 11050 6300 50  0001 C CNN "stock"
	1    11050 6300
	1    0    0    -1  
$EndComp
Wire Wire Line
	8900 6100 9000 6100
Wire Wire Line
	9700 6100 9850 6100
Wire Wire Line
	9300 6100 9350 6100
Wire Wire Line
	8900 6600 9450 6600
Wire Wire Line
	9650 6600 9850 6600
Connection ~ 9850 6100
Wire Wire Line
	9850 6100 10100 6100
$Comp
L power:GND #PWR?
U 1 1 5F84F7B4
P 10100 6550
F 0 "#PWR?" H 10100 6300 50  0001 C CNN
F 1 "GND" H 10105 6377 50  0000 C CNN
F 2 "" H 10100 6550 50  0001 C CNN
F 3 "" H 10100 6550 50  0001 C CNN
	1    10100 6550
	1    0    0    -1  
$EndComp
Wire Wire Line
	10100 6550 10100 6500
Wire Wire Line
	10100 6500 10100 6450
Wire Wire Line
	10600 6450 10600 6500
Connection ~ 10600 6500
Wire Wire Line
	10600 6500 10100 6500
Wire Wire Line
	11050 6450 11050 6500
Wire Wire Line
	11050 6500 10600 6500
Wire Wire Line
	11050 6150 11050 6100
Connection ~ 11050 6100
Wire Wire Line
	11050 6100 11200 6100
Wire Wire Line
	10600 6150 10600 6100
Connection ~ 10600 6100
Wire Wire Line
	10600 6100 11050 6100
Wire Wire Line
	10100 6150 10100 6100
Connection ~ 10100 6100
Wire Wire Line
	10100 6100 10600 6100
Wire Wire Line
	8900 6400 9000 6400
Connection ~ 9350 6100
Wire Wire Line
	9350 6100 9400 6100
Wire Wire Line
	8900 6200 9000 6200
Wire Wire Line
	9000 6200 9000 6300
Wire Wire Line
	9000 6500 9350 6500
Wire Wire Line
	8900 6300 9000 6300
Connection ~ 9000 6300
Wire Wire Line
	9000 6300 9000 6400
$Comp
L Device:C C249
U 1 1 6066F6DE
P 10600 7100
F 0 "C249" H 10715 7191 50  0000 L CNN
F 1 "22uF" H 10715 7100 50  0000 L CNN
F 2 "Capacitor_SMD:C_0603_1608Metric" H 10638 6950 50  0001 C CNN
F 3 "~" H 10600 7100 50  0001 C CNN
F 4 "AVT-IPE" H 10600 7100 50  0001 C CNN "stock"
F 5 "10V" H 10715 7009 50  0000 L CNN "info"
	1    10600 7100
	1    0    0    -1  
$EndComp
$Comp
L Device:L L11
U 1 1 6066F6E4
P 9550 6900
F 0 "L11" V 9740 6900 50  0000 C CNN
F 1 "0.4uH" V 9649 6900 50  0000 C CNN
F 2 "Inductor_SMD:L_Coilcraft_XxL4020" H 9550 6900 50  0001 C CNN
F 3 "https://www.mouser.de/datasheet/2/597/xal4000-270751.pdf" H 9550 6900 50  0001 C CNN
F 4 " 994-XAL4020-401MEC " V 9550 6900 50  0001 C CNN "mouser#"
	1    9550 6900
	0    -1   -1   0   
$EndComp
$Comp
L Device:Net-Tie_2 NT15
U 1 1 6066F6EA
P 9550 7400
F 0 "NT15" H 9550 7489 50  0000 C CNN
F 1 "Net-Tie" H 9550 7490 50  0001 C CNN
F 2 "KIT_NetTie:NetTie-2_SMD_Pad0.3mm" H 9550 7400 50  0001 C CNN
F 3 "~" H 9550 7400 50  0001 C CNN
	1    9550 7400
	-1   0    0    -1  
$EndComp
$Comp
L Device:C C241
U 1 1 6066F6F0
P 9150 6900
F 0 "C241" V 8898 6900 50  0000 C CNN
F 1 "0.22uF" V 8989 6900 50  0000 C CNN
F 2 "Resistor_SMD:R_0201_0603Metric" H 9188 6750 50  0001 C CNN
F 3 "~" H 9150 6900 50  0001 C CNN
	1    9150 6900
	0    1    1    0   
$EndComp
$Comp
L Device:C C253
U 1 1 6066F6FE
P 11050 7100
F 0 "C253" H 11165 7191 50  0000 L CNN
F 1 "1uF" H 11165 7100 50  0000 L CNN
F 2 "Capacitor_SMD:C_0402_1005Metric" H 11088 6950 50  0001 C CNN
F 3 "~" H 11050 7100 50  0001 C CNN
F 4 "16 V" H 11165 7009 50  0000 L CNN "info"
F 5 "AVT-IPE" H 11050 7100 50  0001 C CNN "stock"
	1    11050 7100
	1    0    0    -1  
$EndComp
Wire Wire Line
	8900 6900 9000 6900
Wire Wire Line
	11200 6900 11200 6850
Wire Wire Line
	9700 6900 9850 6900
Wire Wire Line
	9300 6900 9350 6900
Wire Wire Line
	8900 7400 9450 7400
Wire Wire Line
	9850 7400 9850 6900
Wire Wire Line
	9650 7400 9850 7400
Connection ~ 9850 6900
Wire Wire Line
	9850 6900 10100 6900
Wire Wire Line
	10100 7300 10100 7250
Wire Wire Line
	10600 7250 10600 7300
Connection ~ 10600 7300
Wire Wire Line
	10600 7300 10100 7300
Wire Wire Line
	11050 7250 11050 7300
Wire Wire Line
	11050 7300 10600 7300
Wire Wire Line
	11050 6950 11050 6900
Connection ~ 11050 6900
Wire Wire Line
	11050 6900 11200 6900
Wire Wire Line
	10600 6950 10600 6900
Connection ~ 10600 6900
Wire Wire Line
	10600 6900 11050 6900
Wire Wire Line
	10100 6950 10100 6900
Connection ~ 10100 6900
Wire Wire Line
	10100 6900 10600 6900
Wire Wire Line
	8900 7200 9000 7200
Connection ~ 9350 6900
Wire Wire Line
	9350 6900 9400 6900
Wire Wire Line
	8900 7000 9000 7000
Wire Wire Line
	9000 7000 9000 7100
Wire Wire Line
	9000 7300 9350 7300
Wire Wire Line
	8900 7100 9000 7100
Connection ~ 9000 7100
Wire Wire Line
	9000 7100 9000 7200
Connection ~ 10100 6500
$Comp
L power:GND #PWR?
U 1 1 60688950
P 10100 7350
F 0 "#PWR?" H 10100 7100 50  0001 C CNN
F 1 "GND" H 10105 7177 50  0000 C CNN
F 2 "" H 10100 7350 50  0001 C CNN
F 3 "" H 10100 7350 50  0001 C CNN
	1    10100 7350
	1    0    0    -1  
$EndComp
Wire Wire Line
	10100 7350 10100 7300
Connection ~ 10100 7300
$Comp
L Device:C C247
U 1 1 606A17CE
P 10600 5500
F 0 "C247" H 10715 5591 50  0000 L CNN
F 1 "22uF" H 10715 5500 50  0000 L CNN
F 2 "Capacitor_SMD:C_0603_1608Metric" H 10638 5350 50  0001 C CNN
F 3 "~" H 10600 5500 50  0001 C CNN
F 4 "AVT-IPE" H 10600 5500 50  0001 C CNN "stock"
F 5 "10V" H 10715 5409 50  0000 L CNN "info"
	1    10600 5500
	1    0    0    -1  
$EndComp
$Comp
L Device:Net-Tie_2 NT13
U 1 1 5F84F7BC
P 9550 5700
F 0 "NT13" H 9550 5789 50  0000 C CNN
F 1 "Net-Tie" H 9550 5790 50  0001 C CNN
F 2 "KIT_NetTie:NetTie-2_SMD_Pad0.3mm" H 9550 5700 50  0001 C CNN
F 3 "~" H 9550 5700 50  0001 C CNN
	1    9550 5700
	-1   0    0    -1  
$EndComp
$Comp
L Device:C C239
U 1 1 5F84F7BD
P 9150 5300
F 0 "C239" V 8898 5300 50  0000 C CNN
F 1 "0.22uF" V 8989 5300 50  0000 C CNN
F 2 "Resistor_SMD:R_0201_0603Metric" H 9188 5150 50  0001 C CNN
F 3 "~" H 9150 5300 50  0001 C CNN
	1    9150 5300
	0    1    1    0   
$EndComp
$Comp
L Device:C C243
U 1 1 5F84F7BE
P 10100 5500
F 0 "C243" H 10215 5591 50  0000 L CNN
F 1 "100uF" H 10215 5500 50  0000 L CNN
F 2 "Capacitor_SMD:C_1210_3225Metric" H 10138 5350 50  0001 C CNN
F 3 "~" H 10100 5500 50  0001 C CNN
F 4 "10V" H 10100 5500 50  0001 C CNN "info"
F 5 "AVT-IPE" H 10100 5500 50  0001 C CNN "stock"
	1    10100 5500
	1    0    0    -1  
$EndComp
$Comp
L Device:C C251
U 1 1 5F84F7BF
P 11050 5500
F 0 "C251" H 11165 5591 50  0000 L CNN
F 1 "1uF" H 11165 5500 50  0000 L CNN
F 2 "Capacitor_SMD:C_0402_1005Metric" H 11088 5350 50  0001 C CNN
F 3 "~" H 11050 5500 50  0001 C CNN
F 4 "16 V" H 11165 5409 50  0000 L CNN "info"
F 5 "AVT-IPE" H 11050 5500 50  0001 C CNN "stock"
	1    11050 5500
	1    0    0    -1  
$EndComp
Wire Wire Line
	8900 5300 9000 5300
Wire Wire Line
	11200 5300 11200 5250
Wire Wire Line
	9700 5300 9850 5300
Wire Wire Line
	9300 5300 9350 5300
Wire Wire Line
	8900 5700 9450 5700
Wire Wire Line
	9850 5700 9850 5300
Wire Wire Line
	9650 5700 9850 5700
Connection ~ 9850 5300
Wire Wire Line
	9850 5300 10100 5300
$Comp
L power:GND #PWR?
U 1 1 606A17FD
P 10100 5750
F 0 "#PWR?" H 10100 5500 50  0001 C CNN
F 1 "GND" H 10105 5577 50  0000 C CNN
F 2 "" H 10100 5750 50  0001 C CNN
F 3 "" H 10100 5750 50  0001 C CNN
	1    10100 5750
	1    0    0    -1  
$EndComp
Wire Wire Line
	10100 5750 10100 5700
Wire Wire Line
	10100 5700 10100 5650
Wire Wire Line
	10600 5650 10600 5700
Connection ~ 10600 5700
Wire Wire Line
	10600 5700 10100 5700
Wire Wire Line
	11050 5650 11050 5700
Wire Wire Line
	11050 5700 10600 5700
Wire Wire Line
	11050 5350 11050 5300
Connection ~ 11050 5300
Wire Wire Line
	11050 5300 11200 5300
Wire Wire Line
	10600 5350 10600 5300
Connection ~ 10600 5300
Wire Wire Line
	10600 5300 11050 5300
Wire Wire Line
	10100 5350 10100 5300
Connection ~ 10100 5300
Wire Wire Line
	10100 5300 10600 5300
Wire Wire Line
	8900 5600 9000 5600
Wire Wire Line
	9350 5600 9350 5300
Connection ~ 9350 5300
Wire Wire Line
	9350 5300 9400 5300
Connection ~ 9000 5600
Wire Wire Line
	9000 5600 9350 5600
Wire Wire Line
	8900 5500 9000 5500
Wire Wire Line
	9000 5500 9000 5600
Connection ~ 10100 5700
$Comp
L Device:R R139
U 1 1 5EA08597
P 9250 7800
F 0 "R139" H 9180 7754 50  0000 R CNN
F 1 "1.4k" H 9180 7845 50  0000 R CNN
F 2 "Resistor_SMD:R_0402_1005Metric" V 9180 7800 50  0001 C CNN
F 3 "~" H 9250 7800 50  0001 C CNN
	1    9250 7800
	-1   0    0    1   
$EndComp
Wire Wire Line
	8950 7700 8900 7700
Wire Wire Line
	11200 7700 11200 7750
$Comp
L power:GND #PWR?
U 1 1 5F84F775
P 9250 8350
F 0 "#PWR?" H 9250 8100 50  0001 C CNN
F 1 "GND" H 9255 8177 50  0000 C CNN
F 2 "" H 9250 8350 50  0001 C CNN
F 3 "" H 9250 8350 50  0001 C CNN
	1    9250 8350
	1    0    0    -1  
$EndComp
Wire Wire Line
	11200 7800 11200 7750
Wire Wire Line
	11200 7750 9750 7750
Wire Wire Line
	9750 7750 9750 7600
Wire Wire Line
	9750 7600 9250 7600
Connection ~ 11200 7750
Wire Wire Line
	9250 7950 9250 8000
Wire Wire Line
	8950 8000 8950 7700
Wire Wire Line
	8950 8000 9250 8000
Connection ~ 9250 8000
Wire Wire Line
	9250 8000 9250 8050
Wire Wire Line
	9250 7650 9250 7600
Connection ~ 9250 7600
Wire Wire Line
	9250 7600 8900 7600
$Comp
L power:GND #PWR?
U 1 1 5F84F77D
P 11200 8100
F 0 "#PWR?" H 11200 7850 50  0001 C CNN
F 1 "GND" H 11205 7927 50  0000 C CNN
F 2 "" H 11200 8100 50  0001 C CNN
F 3 "" H 11200 8100 50  0001 C CNN
	1    11200 8100
	1    0    0    -1  
$EndComp
$Comp
L Device:R R140
U 1 1 5EA17633
P 9250 8200
F 0 "R140" H 9320 8246 50  0000 L CNN
F 1 "1k" H 9320 8155 50  0000 L CNN
F 2 "Resistor_SMD:R_0402_1005Metric" V 9180 8200 50  0001 C CNN
F 3 "~" H 9250 8200 50  0001 C CNN
F 4 "AVT-IPE" H 9250 8200 50  0001 C CNN "stock"
	1    9250 8200
	1    0    0    -1  
$EndComp
Wire Wire Line
	8200 3200 8200 3250
$Comp
L Device:C C223
U 1 1 5F84F762
P 900 2250
F 0 "C223" H 1015 2341 50  0000 L CNN
F 1 "22uF" H 1015 2250 50  0000 L CNN
F 2 "Capacitor_SMD:C_1210_3225Metric" H 938 2100 50  0001 C CNN
F 3 "~" H 900 2250 50  0001 C CNN
F 4 "25V" H 1015 2159 50  0000 L CNN "info"
F 5 "" H 900 2250 50  0001 C CNN "rs#"
F 6 "AVT-IPE" H 900 2250 50  0001 C CNN "stock"
	1    900  2250
	1    0    0    -1  
$EndComp
$Comp
L Device:C C245
U 1 1 5F84F763
P 10100 7100
F 0 "C245" H 10215 7191 50  0000 L CNN
F 1 "100uF" H 10215 7100 50  0000 L CNN
F 2 "Capacitor_SMD:C_1210_3225Metric" H 10138 6950 50  0001 C CNN
F 3 "~" H 10100 7100 50  0001 C CNN
F 4 "10V" H 10100 7100 50  0001 C CNN "info"
F 5 "AVT-IPE" H 10100 7100 50  0001 C CNN "stock"
	1    10100 7100
	1    0    0    -1  
$EndComp
$Comp
L Device:C C227
U 1 1 5F84F764
P 1350 2250
F 0 "C227" H 1465 2341 50  0000 L CNN
F 1 "1uF" H 1465 2250 50  0000 L CNN
F 2 "Capacitor_SMD:C_0402_1005Metric" H 1388 2100 50  0001 C CNN
F 3 "~" H 1350 2250 50  0001 C CNN
F 4 "16 V" H 1465 2159 50  0000 L CNN "info"
F 5 "AVT-IPE" H 1350 2250 50  0001 C CNN "stock"
	1    1350 2250
	1    0    0    -1  
$EndComp
Wire Wire Line
	1350 2400 1350 2450
Wire Wire Line
	1350 2450 900  2450
Wire Wire Line
	900  2400 900  2450
Connection ~ 900  2450
Wire Wire Line
	900  2450 750  2450
Wire Wire Line
	750  2450 750  2500
$Comp
L power:GND #PWR?
U 1 1 5E94CA4C
P 750 3600
F 0 "#PWR?" H 750 3350 50  0001 C CNN
F 1 "GND" H 755 3427 50  0000 C CNN
F 2 "" H 750 3600 50  0001 C CNN
F 3 "" H 750 3600 50  0001 C CNN
	1    750  3600
	1    0    0    -1  
$EndComp
Wire Wire Line
	1350 3500 1350 3550
Wire Wire Line
	1350 3550 900  3550
Wire Wire Line
	900  3500 900  3550
Connection ~ 900  3550
Wire Wire Line
	900  3550 750  3550
Wire Wire Line
	750  3550 750  3600
$Comp
L power:GND #PWR?
U 1 1 5E9529E4
P 750 4750
F 0 "#PWR?" H 750 4500 50  0001 C CNN
F 1 "GND" H 755 4577 50  0000 C CNN
F 2 "" H 750 4750 50  0001 C CNN
F 3 "" H 750 4750 50  0001 C CNN
	1    750  4750
	1    0    0    -1  
$EndComp
$Comp
L Device:C C229
U 1 1 5F84F76B
P 1350 4500
F 0 "C229" H 1465 4591 50  0000 L CNN
F 1 "1uF" H 1465 4500 50  0000 L CNN
F 2 "Capacitor_SMD:C_0402_1005Metric" H 1388 4350 50  0001 C CNN
F 3 "~" H 1350 4500 50  0001 C CNN
F 4 "16 V" H 1465 4409 50  0000 L CNN "info"
F 5 "AVT-IPE" H 1350 4500 50  0001 C CNN "stock"
	1    1350 4500
	1    0    0    -1  
$EndComp
Wire Wire Line
	1350 4650 1350 4700
Wire Wire Line
	1350 4700 900  4700
Wire Wire Line
	900  4650 900  4700
Connection ~ 900  4700
Wire Wire Line
	900  4700 750  4700
Wire Wire Line
	750  4700 750  4750
$Comp
L Device:C C225
U 1 1 5F84F76E
P 900 4500
F 0 "C225" H 1015 4591 50  0000 L CNN
F 1 "22uF" H 1015 4500 50  0000 L CNN
F 2 "Capacitor_SMD:C_1210_3225Metric" H 938 4350 50  0001 C CNN
F 3 "~" H 900 4500 50  0001 C CNN
F 4 "25V" H 1015 4409 50  0000 L CNN "info"
F 5 "" H 900 4500 50  0001 C CNN "rs#"
F 6 "AVT-IPE" H 900 4500 50  0001 C CNN "stock"
	1    900  4500
	1    0    0    -1  
$EndComp
$Comp
L power:GND #PWR?
U 1 1 5E9C1432
P 8400 3600
F 0 "#PWR?" H 8400 3350 50  0001 C CNN
F 1 "GND" H 8405 3427 50  0000 C CNN
F 2 "" H 8400 3600 50  0001 C CNN
F 3 "" H 8400 3600 50  0001 C CNN
	1    8400 3600
	1    0    0    -1  
$EndComp
Wire Wire Line
	8200 3250 8400 3250
Wire Wire Line
	8400 3250 8400 3300
Connection ~ 8200 3250
Wire Wire Line
	8200 3250 8200 3700
$Comp
L Device:C C237
U 1 1 5F84F7AC
P 8400 3450
F 0 "C237" H 8515 3541 50  0000 L CNN
F 1 "10uF" H 8515 3450 50  0000 L CNN
F 2 "Capacitor_SMD:C_0603_1608Metric" H 8438 3300 50  0001 C CNN
F 3 "~" H 8400 3450 50  0001 C CNN
F 4 "AVT-IPE" H 8400 3450 50  0001 C CNN "stock"
F 5 "25V" H 8515 3359 50  0000 L CNN "info"
	1    8400 3450
	1    0    0    -1  
$EndComp
$Comp
L Device:R R137
U 1 1 5F84F781
P 5850 4200
F 0 "R137" H 5920 4246 50  0000 L CNN
F 1 "2.2" H 5920 4155 50  0000 L CNN
F 2 "Resistor_SMD:R_0402_1005Metric" V 5780 4200 50  0001 C CNN
F 3 "~" H 5850 4200 50  0001 C CNN
	1    5850 4200
	1    0    0    -1  
$EndComp
Wire Wire Line
	5850 4400 5850 4350
Wire Wire Line
	5850 4000 5850 4050
Wire Wire Line
	5850 4000 5850 3600
Connection ~ 5850 4000
$Comp
L Device:C C236
U 1 1 5F84F782
P 5850 4600
F 0 "C236" H 5965 4691 50  0000 L CNN
F 1 "1uF" H 5965 4600 50  0000 L CNN
F 2 "Capacitor_SMD:C_0402_1005Metric" H 5888 4450 50  0001 C CNN
F 3 "~" H 5850 4600 50  0001 C CNN
F 4 "16 V" H 5965 4509 50  0000 L CNN "info"
F 5 "AVT-IPE" H 5850 4600 50  0001 C CNN "stock"
	1    5850 4600
	1    0    0    -1  
$EndComp
$Comp
L power:GND #PWR?
U 1 1 5F84F783
P 5850 4750
F 0 "#PWR?" H 5850 4500 50  0001 C CNN
F 1 "GND" H 5855 4577 50  0000 C CNN
F 2 "" H 5850 4750 50  0001 C CNN
F 3 "" H 5850 4750 50  0001 C CNN
	1    5850 4750
	1    0    0    -1  
$EndComp
Wire Wire Line
	5850 4000 6050 4000
Wire Wire Line
	5850 4400 6050 4400
Wire Wire Line
	5850 4450 5850 4400
Connection ~ 5850 4400
$Comp
L Device:C C231
U 1 1 5EC5CB30
P 4650 4900
F 0 "C231" H 4765 4991 50  0000 L CNN
F 1 "1uF" H 4765 4900 50  0000 L CNN
F 2 "Capacitor_SMD:C_0402_1005Metric" H 4688 4750 50  0001 C CNN
F 3 "~" H 4650 4900 50  0001 C CNN
F 4 "16 V" H 4765 4809 50  0000 L CNN "info"
F 5 "AVT-IPE" H 4650 4900 50  0001 C CNN "stock"
	1    4650 4900
	1    0    0    -1  
$EndComp
$Comp
L power:GND #PWR?
U 1 1 5F84F785
P 4650 5050
F 0 "#PWR?" H 4650 4800 50  0001 C CNN
F 1 "GND" H 4655 4877 50  0000 C CNN
F 2 "" H 4650 5050 50  0001 C CNN
F 3 "" H 4650 5050 50  0001 C CNN
	1    4650 5050
	1    0    0    -1  
$EndComp
Wire Wire Line
	4650 4750 4650 4700
Text Label 5750 5100 0    50   ~ 0
1V8
$Comp
L power:GND #PWR?
U 1 1 5F84F791
P 7600 8200
F 0 "#PWR?" H 7600 7950 50  0001 C CNN
F 1 "GND" H 7605 8027 50  0000 C CNN
F 2 "" H 7600 8200 50  0001 C CNN
F 3 "" H 7600 8200 50  0001 C CNN
	1    7600 8200
	1    0    0    -1  
$EndComp
Wire Wire Line
	7600 8050 7600 8100
$Comp
L Device:Net-Tie_2 NT11
U 1 1 5F84F792
P 7400 8100
F 0 "NT11" H 7400 8011 50  0000 C CNN
F 1 "Net-Tie" H 7400 8190 50  0001 C CNN
F 2 "KIT_NetTie:NetTie-2_SMD_Pad0.2mm" H 7400 8100 50  0001 C CNN
F 3 "~" H 7400 8100 50  0001 C CNN
	1    7400 8100
	1    0    0    -1  
$EndComp
Wire Wire Line
	7500 8100 7600 8100
Connection ~ 7600 8100
Wire Wire Line
	7600 8100 7600 8200
Wire Wire Line
	7200 8050 7200 8100
Wire Wire Line
	7200 8100 7300 8100
$Comp
L KIT_Power:+3V3_STBY #PWR?
U 1 1 5F84F793
P 5250 7350
F 0 "#PWR?" H 5250 7200 50  0001 C CNN
F 1 "+3V3_STBY" H 5265 7523 50  0000 C CNN
F 2 "" H 5250 7350 50  0001 C CNN
F 3 "" H 5250 7350 50  0001 C CNN
	1    5250 7350
	1    0    0    -1  
$EndComp
$Comp
L Device:R R138
U 1 1 5EF7F56F
P 5900 7600
F 0 "R138" H 5830 7554 50  0000 R CNN
F 1 "11k" H 5830 7645 50  0000 R CNN
F 2 "Resistor_SMD:R_0402_1005Metric" V 5830 7600 50  0001 C CNN
F 3 "~" H 5900 7600 50  0001 C CNN
F 4 "AVT-IPE" H 5900 7600 50  0001 C CNN "stock"
	1    5900 7600
	-1   0    0    1   
$EndComp
$Comp
L Device:C C235
U 1 1 5F84F795
P 5500 7600
F 0 "C235" H 5615 7646 50  0000 L CNN
F 1 "10nF" H 5615 7555 50  0000 L CNN
F 2 "Capacitor_SMD:C_0402_1005Metric" H 5538 7450 50  0001 C CNN
F 3 "~" H 5500 7600 50  0001 C CNN
F 4 "AVT-IPE" H 5500 7600 50  0001 C CNN "stock"
	1    5500 7600
	1    0    0    -1  
$EndComp
Wire Wire Line
	5500 7450 5500 7400
Wire Wire Line
	5500 7400 5900 7400
Wire Wire Line
	5900 7450 5900 7400
Connection ~ 5900 7400
Wire Wire Line
	5900 7400 6050 7400
Wire Wire Line
	5900 7750 5900 8100
Wire Wire Line
	5900 8100 5500 8100
Wire Wire Line
	5500 8100 5500 7750
Wire Wire Line
	7200 8100 5900 8100
Connection ~ 7200 8100
Connection ~ 5900 8100
$Comp
L Device:R R130
U 1 1 5F84F796
P 5050 7600
F 0 "R130" H 4980 7554 50  0000 R CNN
F 1 "11k" H 4980 7645 50  0000 R CNN
F 2 "Resistor_SMD:R_0402_1005Metric" V 4980 7600 50  0001 C CNN
F 3 "~" H 5050 7600 50  0001 C CNN
F 4 "AVT-IPE" H 5050 7600 50  0001 C CNN "stock"
	1    5050 7600
	-1   0    0    1   
$EndComp
$Comp
L Device:C C232
U 1 1 5F064F4C
P 4650 7600
F 0 "C232" H 4765 7646 50  0000 L CNN
F 1 "10nF" H 4765 7555 50  0000 L CNN
F 2 "Capacitor_SMD:C_0402_1005Metric" H 4688 7450 50  0001 C CNN
F 3 "~" H 4650 7600 50  0001 C CNN
F 4 "AVT-IPE" H 4650 7600 50  0001 C CNN "stock"
	1    4650 7600
	1    0    0    -1  
$EndComp
Wire Wire Line
	6050 7100 5050 7100
Wire Wire Line
	5050 7100 5050 7450
Wire Wire Line
	5050 7100 4650 7100
Wire Wire Line
	4650 7100 4650 7450
Connection ~ 5050 7100
Wire Wire Line
	4650 7750 4650 8100
Wire Wire Line
	4650 8100 5050 8100
Connection ~ 5500 8100
Wire Wire Line
	5050 7750 5050 8100
Connection ~ 5050 8100
Wire Wire Line
	5050 8100 5500 8100
Text Notes 4900 8650 0    50   ~ 0
ADDR_PROT\n11k ==> +14  I2C Address Offset\n           7 BIT I2C ADDR = 0x1E\n           7 BIT PMBUS = 0x4E\nMTP Resistor\n11k ==> +14 MTP segment selected
$Comp
L power:GND #PWR?
U 1 1 5F0BB845
P 6050 7200
F 0 "#PWR?" H 6050 6950 50  0001 C CNN
F 1 "GND" V 6055 7072 50  0000 R CNN
F 2 "" H 6050 7200 50  0001 C CNN
F 3 "" H 6050 7200 50  0001 C CNN
	1    6050 7200
	0    1    1    0   
$EndComp
Wire Wire Line
	5350 7300 5350 7400
Wire Wire Line
	5350 7400 5250 7400
Wire Wire Line
	5250 7400 5250 7350
Wire Wire Line
	5350 7300 6050 7300
$Comp
L Device:L L8
U 1 1 5F84F79A
P 12950 3300
F 0 "L8" V 13140 3300 50  0000 C CNN
F 1 "330nH" V 13049 3300 50  0000 C CNN
F 2 "Inductor_SMD:L_Wuerth_HCM-1070" H 12950 3300 50  0001 C CNN
F 3 "https://www.we-online.de/katalog/datasheet/744308033.pdf" H 12950 3300 50  0001 C CNN
F 4 "732-3024-1-ND" V 12950 3300 50  0001 C CNN "digikey#"
F 5 "25A / 0.37mOHM" V 12950 3300 50  0001 C CNN "info"
	1    12950 3300
	0    -1   -1   0   
$EndComp
$Comp
L Device:Net-Tie_2 NT12
U 1 1 5F84F79B
P 13450 4000
F 0 "NT12" V 13450 4044 50  0000 L CNN
F 1 "Net-Tie" H 13450 4090 50  0001 C CNN
F 2 "KIT_NetTie:NetTie-2_SMD_Pad0.3mm" H 13450 4000 50  0001 C CNN
F 3 "~" H 13450 4000 50  0001 C CNN
	1    13450 4000
	0    1    -1   0   
$EndComp
$Comp
L Device:C C238
U 1 1 5F17B652
P 10050 3100
F 0 "C238" V 10210 3100 50  0000 C CNN
F 1 "0.22uF" V 10301 3100 50  0000 C CNN
F 2 "Resistor_SMD:R_0201_0603Metric" H 10088 2950 50  0001 C CNN
F 3 "~" H 10050 3100 50  0001 C CNN
	1    10050 3100
	0    1    1    0   
$EndComp
Wire Wire Line
	9800 3100 9900 3100
Wire Wire Line
	13100 3300 13350 3300
Wire Wire Line
	13450 4800 13450 4100
$Comp
L Device:L L9
U 1 1 5F214A65
P 9550 5300
F 0 "L9" V 9740 5300 50  0000 C CNN
F 1 "2.2uH" V 9649 5300 50  0000 C CNN
F 2 "Inductor_SMD:L_Coilcraft_XxL4020" H 9550 5300 50  0001 C CNN
F 3 "https://www.mouser.de/datasheet/2/597/xal4000-270751.pdf" H 9550 5300 50  0001 C CNN
F 4 " 994-XAL4020-222MEC " V 9550 5300 50  0001 C CNN "mouser#"
	1    9550 5300
	0    -1   -1   0   
$EndComp
$Comp
L Device:Net-Tie_2 NT16
U 1 1 5F2A45BD
P 13700 4000
F 0 "NT16" V 13700 4044 50  0000 L CNN
F 1 "Net-Tie" H 13700 4150 50  0001 C CNN
F 2 "KIT_NetTie:NetTie-2_SMD_Pad0.3mm" H 13700 4000 50  0001 C CNN
F 3 "~" H 13700 4000 50  0001 C CNN
	1    13700 4000
	0    1    1    0   
$EndComp
Text Notes 9850 4900 0    50   ~ 0
ROUTE DIFFERENTIALLY
Wire Wire Line
	4650 4700 5600 4700
Wire Wire Line
	5600 4700 5600 5100
Wire Wire Line
	5600 5100 6050 5100
Text Label 12400 3300 0    20   ~ 0
SWA
Text Label 9100 5600 0    20   ~ 0
SWB
Text Label 9100 6500 0    20   ~ 0
SWC
Text Label 9100 7300 0    20   ~ 0
SWD
Text Label 9000 8000 0    20   ~ 0
FB_L
Text Label 9100 7400 0    20   ~ 0
FB_D
Text Label 9100 6600 0    20   ~ 0
FB_C
Text Label 9100 5700 0    20   ~ 0
FB_B
Text Label 8950 4800 0    20   ~ 0
FB_A_P
Text Label 8950 4900 0    20   ~ 0
FB_A_N
Text Label 8950 5300 0    20   ~ 0
BOOT_B
Text Label 8950 6100 0    20   ~ 0
BOOT_C
Text Label 8950 6900 0    20   ~ 0
BOOT_D
Text Label 10200 3000 0    20   ~ 0
BOOT_A
Text Label 6400 8100 0    20   ~ 0
AGND
Text Label 5650 7100 0    20   ~ 0
ADDR_PROT
Text Label 5650 7400 0    20   ~ 0
MTP
Text Label 5950 4400 0    20   ~ 0
VDRV
Connection ~ 13450 3300
Connection ~ 13700 3700
Wire Wire Line
	13700 3700 13700 3900
Wire Wire Line
	13700 3300 14150 3300
Connection ~ 13700 3300
Wire Wire Line
	13700 3350 13700 3300
Wire Wire Line
	13700 3700 13700 3650
Wire Wire Line
	15650 3750 15650 3700
$Comp
L power:GND #PWR?
U 1 1 5F17B66F
P 15650 3750
F 0 "#PWR?" H 15650 3500 50  0001 C CNN
F 1 "GND" H 15655 3577 50  0000 C CNN
F 2 "" H 15650 3750 50  0001 C CNN
F 3 "" H 15650 3750 50  0001 C CNN
	1    15650 3750
	1    0    0    -1  
$EndComp
Wire Wire Line
	13450 3300 13700 3300
Wire Wire Line
	15650 3300 15650 3250
Wire Wire Line
	9800 3100 9800 3000
Wire Wire Line
	9800 3000 10350 3000
Wire Wire Line
	10350 3100 10200 3100
$Comp
L Device:C C257
U 1 1 5FCDD823
P 13150 3650
F 0 "C257" V 12898 3650 50  0000 C CNN
F 1 "0.22uF" V 12989 3650 50  0000 C CNN
F 2 "Resistor_SMD:R_0201_0603Metric" H 13188 3500 50  0001 C CNN
F 3 "~" H 13150 3650 50  0001 C CNN
	1    13150 3650
	0    1    1    0   
$EndComp
$Comp
L Device:R R129
U 1 1 5FCDE6B2
P 12750 3650
F 0 "R129" V 12543 3650 50  0000 C CNN
F 1 "4.7k" V 12634 3650 50  0000 C CNN
F 2 "Resistor_SMD:R_0402_1005Metric" V 12680 3650 50  0001 C CNN
F 3 "~" H 12750 3650 50  0001 C CNN
F 4 "AVT-IPE" H 12750 3650 50  0001 C CNN "stock"
	1    12750 3650
	0    1    1    0   
$EndComp
Wire Wire Line
	12950 3650 12950 4600
Wire Wire Line
	12950 4600 8900 4600
Wire Wire Line
	13350 3300 13350 3650
Wire Wire Line
	13350 3650 13300 3650
Wire Wire Line
	12550 3650 12550 3300
Wire Wire Line
	12550 3300 12800 3300
Wire Wire Line
	13000 3650 12950 3650
Wire Wire Line
	12600 3650 12550 3650
Connection ~ 13350 3300
Wire Wire Line
	13350 3300 13450 3300
Connection ~ 12950 3650
Wire Wire Line
	12950 3650 12900 3650
Wire Wire Line
	12250 2600 12350 2600
Wire Wire Line
	12350 2600 12350 2700
Wire Wire Line
	12350 3300 12550 3300
Connection ~ 12550 3300
Wire Wire Line
	12250 3300 12350 3300
Connection ~ 12350 3300
Wire Wire Line
	12250 2700 12350 2700
Connection ~ 12350 2700
Wire Wire Line
	12350 2700 12350 2800
Wire Wire Line
	12250 2800 12350 2800
Connection ~ 12350 2800
Wire Wire Line
	12350 2800 12350 2900
Wire Wire Line
	12250 2900 12350 2900
Connection ~ 12350 2900
Wire Wire Line
	12350 2900 12350 3000
Wire Wire Line
	12250 3000 12350 3000
Connection ~ 12350 3000
Wire Wire Line
	12350 3000 12350 3100
Wire Wire Line
	12250 3100 12350 3100
Connection ~ 12350 3100
Wire Wire Line
	12350 3100 12350 3200
Wire Wire Line
	12250 3200 12350 3200
Connection ~ 12350 3200
Wire Wire Line
	12350 3200 12350 3300
Wire Wire Line
	8900 4700 13350 4700
Wire Wire Line
	13350 3650 13350 3900
Connection ~ 13350 3650
$Comp
L Device:Net-Tie_2 NT18
U 1 1 5FDEF6D6
P 13350 4000
F 0 "NT18" V 13350 3957 50  0000 R CNN
F 1 "Net-Tie" H 13350 4090 50  0001 C CNN
F 2 "KIT_NetTie:NetTie-2_SMD_Pad0.3mm" H 13350 4000 50  0001 C CNN
F 3 "~" H 13350 4000 50  0001 C CNN
	1    13350 4000
	0    1    -1   0   
$EndComp
Wire Wire Line
	13350 4100 13350 4700
Wire Wire Line
	13450 3900 13450 3300
Wire Wire Line
	13700 4100 13700 4900
Wire Wire Line
	8900 4800 13450 4800
Wire Wire Line
	8900 4900 13700 4900
$Comp
L KIT_Power:+0.85_PL_VCCINT #PWR?
U 1 1 5FE7C6D3
P 15650 3250
F 0 "#PWR?" H 15650 3100 50  0001 C CNN
F 1 "+0.85_PL_VCCINT" H 15665 3423 50  0000 C CNN
F 2 "" H 15650 3250 50  0001 C CNN
F 3 "" H 15650 3250 50  0001 C CNN
	1    15650 3250
	1    0    0    -1  
$EndComp
Wire Wire Line
	14150 3300 14150 3350
Wire Wire Line
	14150 3650 14150 3700
Wire Wire Line
	14150 3700 13700 3700
$Comp
L power:GND #PWR?
U 1 1 5FFA4EE5
P 11300 4150
F 0 "#PWR?" H 11300 3900 50  0001 C CNN
F 1 "GND" H 11305 3977 50  0000 C CNN
F 2 "" H 11300 4150 50  0001 C CNN
F 3 "" H 11300 4150 50  0001 C CNN
	1    11300 4150
	1    0    0    -1  
$EndComp
$Comp
L Device:Net-Tie_2 NT17
U 1 1 5FFAE3B8
P 11050 4100
F 0 "NT17" H 11050 4011 50  0000 C CNN
F 1 "Net-Tie" H 11050 4190 50  0001 C CNN
F 2 "KIT_NetTie:NetTie-2_SMD_Pad0.2mm" H 11050 4100 50  0001 C CNN
F 3 "~" H 11050 4100 50  0001 C CNN
	1    11050 4100
	1    0    0    1   
$EndComp
Wire Wire Line
	10900 3800 10900 3900
Wire Wire Line
	10900 3900 11000 3900
Wire Wire Line
	11300 3900 11300 4100
Wire Wire Line
	11000 3800 11000 3900
Connection ~ 11000 3900
Wire Wire Line
	11000 3900 11100 3900
Wire Wire Line
	11100 3800 11100 3900
Connection ~ 11100 3900
Wire Wire Line
	11100 3900 11200 3900
Wire Wire Line
	11200 3800 11200 3900
Connection ~ 11200 3900
Wire Wire Line
	11200 3900 11300 3900
Wire Wire Line
	11300 3800 11300 3900
Connection ~ 11300 3900
Wire Wire Line
	11150 4100 11300 4100
Connection ~ 11300 4100
Wire Wire Line
	11300 4100 11300 4150
Wire Wire Line
	10950 4100 10800 4100
Wire Wire Line
	10800 4100 10800 3800
NoConn ~ 8900 4200
$Comp
L Device:R R128
U 1 1 6013F56F
P 9200 3400
F 0 "R128" H 9269 3354 50  0000 L CNN
F 1 "4.7k" H 9269 3445 50  0000 L CNN
F 2 "Resistor_SMD:R_0402_1005Metric" V 9130 3400 50  0001 C CNN
F 3 "~" H 9200 3400 50  0001 C CNN
F 4 "AVT-IPE" H 9200 3400 50  0001 C CNN "stock"
	1    9200 3400
	-1   0    0    1   
$EndComp
Wire Wire Line
	9200 4100 9200 3550
Wire Wire Line
	9200 3250 9200 2800
Text Label 10200 3100 0    20   ~ 0
PHASE_A
NoConn ~ 12250 2500
$Comp
L power:GND #PWR?
U 1 1 601A986E
P 12350 1700
F 0 "#PWR?" H 12350 1450 50  0001 C CNN
F 1 "GND" H 12355 1527 50  0000 C CNN
F 2 "" H 12350 1700 50  0001 C CNN
F 3 "" H 12350 1700 50  0001 C CNN
	1    12350 1700
	1    0    0    -1  
$EndComp
$Comp
L Device:C C255
U 1 1 601A9875
P 12500 1450
F 0 "C255" H 12615 1541 50  0000 L CNN
F 1 "22uF" H 12615 1450 50  0000 L CNN
F 2 "Capacitor_SMD:C_1210_3225Metric" H 12538 1300 50  0001 C CNN
F 3 "~" H 12500 1450 50  0001 C CNN
F 4 "25V" H 12615 1359 50  0000 L CNN "info"
F 5 "" H 12500 1450 50  0001 C CNN "rs#"
F 6 "AVT-IPE" H 12500 1450 50  0001 C CNN "stock"
	1    12500 1450
	1    0    0    -1  
$EndComp
Wire Wire Line
	12950 1600 12950 1650
Wire Wire Line
	12950 1650 12500 1650
Wire Wire Line
	12500 1600 12500 1650
Connection ~ 12500 1650
Wire Wire Line
	12500 1650 12350 1650
Wire Wire Line
	12350 1650 12350 1700
$Comp
L KIT_Power:+5V_STBY #PWR?
U 1 1 602C3C62
P 10900 1850
F 0 "#PWR?" H 10900 1700 50  0001 C CNN
F 1 "+5V_STBY" H 10915 2023 50  0000 C CNN
F 2 "" H 10900 1850 50  0001 C CNN
F 3 "" H 10900 1850 50  0001 C CNN
	1    10900 1850
	1    0    0    -1  
$EndComp
Wire Wire Line
	10900 1850 10900 1900
Wire Wire Line
	10900 1900 11000 1900
Wire Wire Line
	11000 1900 11000 2050
Wire Wire Line
	10900 2050 10900 1900
Connection ~ 10900 1900
Wire Wire Line
	13400 1600 13400 1650
Wire Wire Line
	13400 1650 12950 1650
Connection ~ 12950 1650
$Comp
L Device:C C258
U 1 1 603F60A8
P 12950 1450
F 0 "C258" H 13065 1541 50  0000 L CNN
F 1 "10uF" H 13065 1450 50  0000 L CNN
F 2 "Capacitor_SMD:C_0603_1608Metric" H 12988 1300 50  0001 C CNN
F 3 "~" H 12950 1450 50  0001 C CNN
F 4 "" H 12950 1450 50  0001 C CNN "manf#"
F 5 "" H 12950 1450 50  0001 C CNN "manf"
F 6 "" H 12950 1450 50  0001 C CNN "VPN"
F 7 "AVT-IPE" H 12950 1450 50  0001 C CNN "stock"
F 8 "25V" H 13065 1359 50  0000 L CNN "info"
	1    12950 1450
	1    0    0    -1  
$EndComp
$Comp
L power:GND #PWR?
U 1 1 604472DB
P 9500 1700
F 0 "#PWR?" H 9500 1450 50  0001 C CNN
F 1 "GND" H 9505 1527 50  0000 C CNN
F 2 "" H 9500 1700 50  0001 C CNN
F 3 "" H 9500 1700 50  0001 C CNN
	1    9500 1700
	1    0    0    -1  
$EndComp
$Comp
L Device:C C234
U 1 1 604472E2
P 9650 1450
F 0 "C234" H 9765 1541 50  0000 L CNN
F 1 "22uF" H 9765 1450 50  0000 L CNN
F 2 "Capacitor_SMD:C_1210_3225Metric" H 9688 1300 50  0001 C CNN
F 3 "~" H 9650 1450 50  0001 C CNN
F 4 "25V" H 9765 1359 50  0000 L CNN "info"
F 5 "" H 9650 1450 50  0001 C CNN "rs#"
F 6 "AVT-IPE" H 9650 1450 50  0001 C CNN "stock"
	1    9650 1450
	1    0    0    -1  
$EndComp
Wire Wire Line
	9500 1200 9500 1250
Wire Wire Line
	10150 1650 9650 1650
Wire Wire Line
	9650 1600 9650 1650
Connection ~ 9650 1650
Wire Wire Line
	9650 1650 9500 1650
Wire Wire Line
	9500 1650 9500 1700
Wire Wire Line
	10150 1250 9650 1250
Wire Wire Line
	9650 1300 9650 1250
Connection ~ 9650 1250
Wire Wire Line
	9650 1250 9500 1250
$Comp
L Device:C C260
U 1 1 6034B7A6
P 13400 1450
F 0 "C260" H 13515 1541 50  0000 L CNN
F 1 "1uF" H 13515 1450 50  0000 L CNN
F 2 "Capacitor_SMD:C_0402_1005Metric" H 13438 1300 50  0001 C CNN
F 3 "~" H 13400 1450 50  0001 C CNN
F 4 "16 V" H 13515 1359 50  0000 L CNN "info"
F 5 "AVT-IPE" H 13400 1450 50  0001 C CNN "stock"
	1    13400 1450
	1    0    0    -1  
$EndComp
$Comp
L Device:C C242
U 1 1 60467992
P 10150 1450
F 0 "C242" H 10265 1541 50  0000 L CNN
F 1 "1uF" H 10265 1450 50  0000 L CNN
F 2 "Capacitor_SMD:C_0402_1005Metric" H 10188 1300 50  0001 C CNN
F 3 "~" H 10150 1450 50  0001 C CNN
F 4 "16 V" H 10265 1359 50  0000 L CNN "info"
F 5 "AVT-IPE" H 10150 1450 50  0001 C CNN "stock"
	1    10150 1450
	1    0    0    -1  
$EndComp
Wire Wire Line
	10150 1250 10150 1300
Wire Wire Line
	10150 1600 10150 1650
$Comp
L KIT_Power:+5V_STBY #PWR?
U 1 1 604B224A
P 9500 1200
F 0 "#PWR?" H 9500 1050 50  0001 C CNN
F 1 "+5V_STBY" H 9515 1373 50  0000 C CNN
F 2 "" H 9500 1200 50  0001 C CNN
F 3 "" H 9500 1200 50  0001 C CNN
	1    9500 1200
	1    0    0    -1  
$EndComp
Text Label 10800 4100 0    20   ~ 0
TDA21242_AGND
$Comp
L KIT_Power:+0.9V_PL_MGTAVCC #PWR?
U 1 1 6015A83C
P 11200 6850
F 0 "#PWR?" H 11200 6700 50  0001 C CNN
F 1 "+0.9V_PL_MGTAVCC" H 11215 7023 50  0000 C CNN
F 2 "" H 11200 6850 50  0001 C CNN
F 3 "" H 11200 6850 50  0001 C CNN
	1    11200 6850
	1    0    0    -1  
$EndComp
$Comp
L KIT_Power:+1V2_PL_MGTAVTT #PWR?
U 1 1 60179789
P 11200 6050
F 0 "#PWR?" H 11200 5900 50  0001 C CNN
F 1 "+1V2_PL_MGTAVTT" H 11215 6223 50  0000 C CNN
F 2 "" H 11200 6050 50  0001 C CNN
F 3 "" H 11200 6050 50  0001 C CNN
	1    11200 6050
	1    0    0    -1  
$EndComp
Wire Wire Line
	11200 6050 11200 6100
$Comp
L KIT_Power:+1V8_PL_MGTVCCAUX #PWR?
U 1 1 602092FA
P 11200 7700
F 0 "#PWR?" H 11200 7550 50  0001 C CNN
F 1 "+1V8_PL_MGTVCCAUX" H 11215 7873 50  0000 C CNN
F 2 "" H 11200 7700 50  0001 C CNN
F 3 "" H 11200 7700 50  0001 C CNN
	1    11200 7700
	1    0    0    -1  
$EndComp
$Comp
L Device:C C130
U 1 1 602AF97C
P 5350 3800
F 0 "C130" H 5465 3891 50  0000 L CNN
F 1 "1uF" H 5465 3800 50  0000 L CNN
F 2 "Capacitor_SMD:C_0402_1005Metric" H 5388 3650 50  0001 C CNN
F 3 "~" H 5350 3800 50  0001 C CNN
F 4 "16 V" H 5465 3709 50  0000 L CNN "info"
F 5 "AVT-IPE" H 5350 3800 50  0001 C CNN "stock"
	1    5350 3800
	1    0    0    -1  
$EndComp
$Comp
L power:GND #PWR?
U 1 1 602AF982
P 5350 3950
F 0 "#PWR?" H 5350 3700 50  0001 C CNN
F 1 "GND" H 5355 3777 50  0000 C CNN
F 2 "" H 5350 3950 50  0001 C CNN
F 3 "" H 5350 3950 50  0001 C CNN
	1    5350 3950
	1    0    0    -1  
$EndComp
Wire Wire Line
	5350 3650 5350 3600
Wire Wire Line
	5350 3600 5850 3600
$Comp
L KIT_Power:+5V_STBY #PWR?
U 1 1 602AF9A2
P 5350 3550
F 0 "#PWR?" H 5350 3400 50  0001 C CNN
F 1 "+5V_STBY" H 5365 3723 50  0000 C CNN
F 2 "" H 5350 3550 50  0001 C CNN
F 3 "" H 5350 3550 50  0001 C CNN
	1    5350 3550
	1    0    0    -1  
$EndComp
Wire Wire Line
	5350 3550 5350 3600
Connection ~ 5350 3600
Wire Wire Line
	5850 3600 6600 3600
Connection ~ 5850 3600
$Comp
L Device:C C151
U 1 1 5F2EEB99
P 4150 6700
F 0 "C151" H 4265 6791 50  0000 L CNN
F 1 "1uF" H 4265 6700 50  0000 L CNN
F 2 "Capacitor_SMD:C_0402_1005Metric" H 4188 6550 50  0001 C CNN
F 3 "~" H 4150 6700 50  0001 C CNN
F 4 "16 V" H 4265 6609 50  0000 L CNN "info"
F 5 "AVT-IPE" H 4150 6700 50  0001 C CNN "stock"
	1    4150 6700
	1    0    0    -1  
$EndComp
$Comp
L power:GND #PWR?
U 1 1 5F2EEB9F
P 4150 6850
F 0 "#PWR?" H 4150 6600 50  0001 C CNN
F 1 "GND" H 4155 6677 50  0000 C CNN
F 2 "" H 4150 6850 50  0001 C CNN
F 3 "" H 4150 6850 50  0001 C CNN
	1    4150 6850
	1    0    0    -1  
$EndComp
Wire Wire Line
	4150 6550 4150 6500
Wire Wire Line
	4150 6450 4150 6500
Connection ~ 4150 6500
Wire Wire Line
	4150 6500 6050 6500
$Comp
L KIT_Power:+3V3_STBY #PWR?
U 1 1 5F2EEBA9
P 4150 6450
F 0 "#PWR?" H 4150 6300 50  0001 C CNN
F 1 "+3V3_STBY" H 4165 6623 50  0000 C CNN
F 2 "" H 4150 6450 50  0001 C CNN
F 3 "" H 4150 6450 50  0001 C CNN
	1    4150 6450
	1    0    0    -1  
$EndComp
Wire Wire Line
	5700 6700 6050 6700
Wire Wire Line
	5700 6800 6050 6800
Wire Wire Line
	5700 6900 6050 6900
Wire Wire Line
	8900 4300 9100 4300
Wire Wire Line
	9100 4300 9100 4400
Wire Wire Line
	9100 4400 8900 4400
Text Label 8950 4300 0    20   ~ 0
PHA_A
$Comp
L KIT_Regulator_Switching:TDA21242 U42
U 1 1 5FAAEF85
P 11100 2900
F 0 "U42" H 10650 3600 50  0000 R CNN
F 1 "TDA21242" H 12050 3600 50  0000 R CNN
F 2 "KIT_Package_DFN_QFN:TDA21242_IQFN-30-4EP_4x4mm_P0.45mm" H 10750 3350 197 0001 C CNN
F 3 "https://www.infineon.com/dgdl/Infineon-TDA21242-DS-v02_01-EN.pdf?fileId=5546d4625a888733015aae26a17e4c72" H 10750 3350 197 0001 C CNN
F 4 "Infineon Technologies" H 11100 2900 50  0001 C CNN "manf"
F 5 "TDA21242AUMA1 " H 11100 2900 50  0001 C CNN "manf#"
F 6 "726-TDA21242AUMA1 " H 11100 2900 50  0001 C CNN "mouser#"
	1    11100 2900
	1    0    0    -1  
$EndComp
Wire Wire Line
	11500 3800 11500 3900
Wire Wire Line
	11500 3900 11600 3900
Wire Wire Line
	11800 3900 11800 3800
Wire Wire Line
	11600 3800 11600 3900
Connection ~ 11600 3900
Wire Wire Line
	11600 3900 11700 3900
Wire Wire Line
	11700 3800 11700 3900
Connection ~ 11700 3900
Wire Wire Line
	11700 3900 11800 3900
Text Label 11950 3900 2    50   ~ 0
GL
Wire Wire Line
	12000 3900 11800 3900
Connection ~ 11800 3900
NoConn ~ 12000 3900
Text Label 8950 4100 0    50   ~ 0
PWM_A
Wire Wire Line
	8900 4100 9200 4100
Text Label 9700 2800 0    50   ~ 0
PWM
$Comp
L power:PWR_FLAG #FLG?
U 1 1 5FAB9AF9
P 10600 5300
F 0 "#FLG?" H 10600 5375 50  0001 C CNN
F 1 "PWR_FLAG" H 10600 5473 50  0000 C CNN
F 2 "" H 10600 5300 50  0001 C CNN
F 3 "~" H 10600 5300 50  0001 C CNN
	1    10600 5300
	1    0    0    -1  
$EndComp
$Comp
L power:PWR_FLAG #FLG?
U 1 1 5FABA151
P 10600 6100
F 0 "#FLG?" H 10600 6175 50  0001 C CNN
F 1 "PWR_FLAG" H 10600 6273 50  0000 C CNN
F 2 "" H 10600 6100 50  0001 C CNN
F 3 "~" H 10600 6100 50  0001 C CNN
	1    10600 6100
	1    0    0    -1  
$EndComp
$Comp
L power:PWR_FLAG #FLG?
U 1 1 5FABA5C8
P 10600 6900
F 0 "#FLG?" H 10600 6975 50  0001 C CNN
F 1 "PWR_FLAG" H 10600 7073 50  0000 C CNN
F 2 "" H 10600 6900 50  0001 C CNN
F 3 "~" H 10600 6900 50  0001 C CNN
	1    10600 6900
	1    0    0    -1  
$EndComp
$Comp
L power:PWR_FLAG #FLG?
U 1 1 5FAC672F
P 13700 3300
F 0 "#FLG?" H 13700 3375 50  0001 C CNN
F 1 "PWR_FLAG" H 13700 3473 50  0000 C CNN
F 2 "" H 13700 3300 50  0001 C CNN
F 3 "~" H 13700 3300 50  0001 C CNN
	1    13700 3300
	1    0    0    -1  
$EndComp
$Comp
L Device:C C228
U 1 1 5E94CA5C
P 1350 3350
F 0 "C228" H 1465 3441 50  0000 L CNN
F 1 "1uF" H 1465 3350 50  0000 L CNN
F 2 "Capacitor_SMD:C_0402_1005Metric" H 1388 3200 50  0001 C CNN
F 3 "~" H 1350 3350 50  0001 C CNN
F 4 "16 V" H 1465 3259 50  0000 L CNN "info"
F 5 "AVT-IPE" H 1350 3350 50  0001 C CNN "stock"
	1    1350 3350
	1    0    0    -1  
$EndComp
Wire Wire Line
	12350 1200 12350 1250
Wire Wire Line
	12350 1250 12500 1250
Wire Wire Line
	13400 1250 13400 1300
Wire Wire Line
	12950 1300 12950 1250
Connection ~ 12950 1250
Wire Wire Line
	12950 1250 13400 1250
Wire Wire Line
	12500 1300 12500 1250
Connection ~ 12500 1250
Wire Wire Line
	12500 1250 12950 1250
Wire Wire Line
	11600 1850 11600 1900
Wire Wire Line
	11600 1900 11500 1900
Wire Wire Line
	11200 1900 11200 2050
Wire Wire Line
	11300 2050 11300 1900
Connection ~ 11300 1900
Wire Wire Line
	11300 1900 11200 1900
Wire Wire Line
	11400 2050 11400 1900
Connection ~ 11400 1900
Wire Wire Line
	11400 1900 11300 1900
Wire Wire Line
	11500 2050 11500 1900
Connection ~ 11500 1900
Wire Wire Line
	11500 1900 11400 1900
Wire Wire Line
	11600 2050 11600 1900
Connection ~ 11600 1900
Wire Wire Line
	750  2000 750  2050
Wire Wire Line
	750  2050 900  2050
Wire Wire Line
	1350 2050 1350 2100
Wire Wire Line
	900  2100 900  2050
Connection ~ 900  2050
Wire Wire Line
	900  2050 1350 2050
Wire Wire Line
	750  3100 750  3150
Wire Wire Line
	750  3150 900  3150
Wire Wire Line
	1350 3150 1350 3200
Wire Wire Line
	900  3200 900  3150
Connection ~ 900  3150
Wire Wire Line
	900  3150 1350 3150
Wire Wire Line
	750  4250 750  4300
Wire Wire Line
	750  4300 900  4300
Wire Wire Line
	1350 4300 1350 4350
Wire Wire Line
	900  4350 900  4300
Connection ~ 900  4300
Wire Wire Line
	900  4300 1350 4300
$Comp
L power:PWR_FLAG #FLG?
U 1 1 5EE89A8A
P 10800 4150
F 0 "#FLG?" H 10800 4225 50  0001 C CNN
F 1 "PWR_FLAG" H 10800 4323 50  0000 C CNN
F 2 "" H 10800 4150 50  0001 C CNN
F 3 "~" H 10800 4150 50  0001 C CNN
	1    10800 4150
	-1   0    0    1   
$EndComp
Wire Wire Line
	10800 4150 10800 4100
Connection ~ 10800 4100
Wire Wire Line
	9000 7300 9000 7200
Connection ~ 9000 7200
Wire Wire Line
	9000 7300 8900 7300
Connection ~ 9000 7300
Wire Wire Line
	9350 6900 9350 7300
Wire Wire Line
	9000 6500 9000 6400
Connection ~ 9000 6400
Wire Wire Line
	9000 6500 8900 6500
Connection ~ 9000 6500
Wire Wire Line
	9350 6100 9350 6500
Wire Wire Line
	9850 6100 9850 6600
Wire Wire Line
	8900 5400 9000 5400
Wire Wire Line
	9000 5400 9000 5500
Connection ~ 9000 5500
Wire Wire Line
	8900 4500 9100 4500
Wire Wire Line
	9100 4500 9100 4400
Connection ~ 9100 4400
Wire Wire Line
	6600 3700 6600 3600
$Comp
L power:+12V #PWR?
U 1 1 5F122398
P 750 2000
AR Path="/5F122398" Ref="#PWR?"  Part="1" 
AR Path="/5F7AC3E6/5F122398" Ref="#PWR?"  Part="1" 
F 0 "#PWR?" H 750 1850 50  0001 C CNN
F 1 "+12V" H 765 2173 50  0000 C CNN
F 2 "" H 750 2000 50  0001 C CNN
F 3 "" H 750 2000 50  0001 C CNN
	1    750  2000
	1    0    0    -1  
$EndComp
$Comp
L power:+12V #PWR?
U 1 1 5F12C3B5
P 750 3100
AR Path="/5F12C3B5" Ref="#PWR?"  Part="1" 
AR Path="/5F7AC3E6/5F12C3B5" Ref="#PWR?"  Part="1" 
F 0 "#PWR?" H 750 2950 50  0001 C CNN
F 1 "+12V" H 765 3273 50  0000 C CNN
F 2 "" H 750 3100 50  0001 C CNN
F 3 "" H 750 3100 50  0001 C CNN
	1    750  3100
	1    0    0    -1  
$EndComp
$Comp
L power:+12V #PWR?
U 1 1 5F12CB43
P 750 4250
AR Path="/5F12CB43" Ref="#PWR?"  Part="1" 
AR Path="/5F7AC3E6/5F12CB43" Ref="#PWR?"  Part="1" 
F 0 "#PWR?" H 750 4100 50  0001 C CNN
F 1 "+12V" H 765 4423 50  0000 C CNN
F 2 "" H 750 4250 50  0001 C CNN
F 3 "" H 750 4250 50  0001 C CNN
	1    750  4250
	1    0    0    -1  
$EndComp
$Comp
L power:+12V #PWR?
U 1 1 5F13763C
P 12350 1200
AR Path="/5F13763C" Ref="#PWR?"  Part="1" 
AR Path="/5F7AC3E6/5F13763C" Ref="#PWR?"  Part="1" 
F 0 "#PWR?" H 12350 1050 50  0001 C CNN
F 1 "+12V" H 12365 1373 50  0000 C CNN
F 2 "" H 12350 1200 50  0001 C CNN
F 3 "" H 12350 1200 50  0001 C CNN
	1    12350 1200
	1    0    0    -1  
$EndComp
$Comp
L power:+12V #PWR?
U 1 1 5F142CA9
P 11600 1850
AR Path="/5F142CA9" Ref="#PWR?"  Part="1" 
AR Path="/5F7AC3E6/5F142CA9" Ref="#PWR?"  Part="1" 
F 0 "#PWR?" H 11600 1700 50  0001 C CNN
F 1 "+12V" H 11615 2023 50  0000 C CNN
F 2 "" H 11600 1850 50  0001 C CNN
F 3 "" H 11600 1850 50  0001 C CNN
	1    11600 1850
	1    0    0    -1  
$EndComp
$Comp
L power:+12V #PWR?
U 1 1 5F14B8C4
P 6800 3550
AR Path="/5F14B8C4" Ref="#PWR?"  Part="1" 
AR Path="/5F7AC3E6/5F14B8C4" Ref="#PWR?"  Part="1" 
F 0 "#PWR?" H 6800 3400 50  0001 C CNN
F 1 "+12V" H 6815 3723 50  0000 C CNN
F 2 "" H 6800 3550 50  0001 C CNN
F 3 "" H 6800 3550 50  0001 C CNN
	1    6800 3550
	1    0    0    -1  
$EndComp
Wire Wire Line
	6800 3550 6800 3600
Wire Wire Line
	6800 3600 7000 3600
Wire Wire Line
	8000 3600 8000 3700
Connection ~ 6800 3600
Wire Wire Line
	6800 3600 6800 3700
Wire Wire Line
	7900 3700 7900 3600
Connection ~ 7900 3600
Wire Wire Line
	7900 3600 8000 3600
Wire Wire Line
	7800 3700 7800 3600
Connection ~ 7800 3600
Wire Wire Line
	7800 3600 7900 3600
Wire Wire Line
	7700 3700 7700 3600
Connection ~ 7700 3600
Wire Wire Line
	7700 3600 7800 3600
Wire Wire Line
	7500 3700 7500 3600
Connection ~ 7500 3600
Wire Wire Line
	7500 3600 7700 3600
Wire Wire Line
	7400 3700 7400 3600
Connection ~ 7400 3600
Wire Wire Line
	7400 3600 7500 3600
Wire Wire Line
	7300 3700 7300 3600
Connection ~ 7300 3600
Wire Wire Line
	7300 3600 7400 3600
Wire Wire Line
	7200 3700 7200 3600
Connection ~ 7200 3600
Wire Wire Line
	7200 3600 7300 3600
Wire Wire Line
	7000 3700 7000 3600
Connection ~ 7000 3600
Wire Wire Line
	7000 3600 7200 3600
Text Label 8950 4600 0    20   ~ 0
ISEN_A_P
Text Label 8950 4700 0    20   ~ 0
ISEN_A_N
$Comp
L power:+12V #PWR?
U 1 1 5EC8D4A1
P 8200 3200
AR Path="/5EC8D4A1" Ref="#PWR?"  Part="1" 
AR Path="/5F7AC3E6/5EC8D4A1" Ref="#PWR?"  Part="1" 
F 0 "#PWR?" H 8200 3050 50  0001 C CNN
F 1 "+12V" H 8215 3373 50  0000 C CNN
F 2 "" H 8200 3200 50  0001 C CNN
F 3 "" H 8200 3200 50  0001 C CNN
	1    8200 3200
	1    0    0    -1  
$EndComp
$Comp
L power:+5V #PWR?
U 1 1 5ECE0EC9
P 11200 5250
F 0 "#PWR?" H 11200 5100 50  0001 C CNN
F 1 "+5V" H 11215 5423 50  0000 C CNN
F 2 "" H 11200 5250 50  0001 C CNN
F 3 "" H 11200 5250 50  0001 C CNN
	1    11200 5250
	1    0    0    -1  
$EndComp
$Comp
L Device:C C224
U 1 1 5F84F767
P 900 3350
F 0 "C224" H 1015 3441 50  0000 L CNN
F 1 "22uF" H 1015 3350 50  0000 L CNN
F 2 "Capacitor_SMD:C_1210_3225Metric" H 938 3200 50  0001 C CNN
F 3 "~" H 900 3350 50  0001 C CNN
F 4 "25V" H 1015 3259 50  0000 L CNN "info"
F 5 "" H 900 3350 50  0001 C CNN "rs#"
F 6 "AVT-IPE" H 900 3350 50  0001 C CNN "stock"
	1    900  3350
	1    0    0    -1  
$EndComp
$Comp
L Device:C C?
U 1 1 5ECF079F
P 13700 3500
AR Path="/5E09AE40/5ECF079F" Ref="C?"  Part="1" 
AR Path="/5F7AC3E6/5ECF079F" Ref="C259"  Part="1" 
F 0 "C259" H 13815 3546 50  0000 L CNN
F 1 "330uF" H 13815 3455 50  0000 L CNN
F 2 "Capacitor_SMD:C_1210_3225Metric" H 13738 3350 50  0001 C CNN
F 3 "~" H 13700 3500 50  0001 C CNN
F 4 "330µF ±20% 4V Keramikkondensatoren X5R 1210 (3225 metrisch)" H 13700 3500 50  0001 C CNN "info"
F 5 "Murata" H 13700 3500 50  0001 C CNN "manf"
F 6 "GRM32ER60G337ME05L" H 13700 3500 50  0001 C CNN "manf#"
	1    13700 3500
	1    0    0    -1  
$EndComp
$Comp
L Device:C C?
U 1 1 5ED13936
P 14150 3500
AR Path="/5E09AE40/5ED13936" Ref="C?"  Part="1" 
AR Path="/5F7AC3E6/5ED13936" Ref="C261"  Part="1" 
F 0 "C261" H 14265 3546 50  0000 L CNN
F 1 "330uF" H 14265 3455 50  0000 L CNN
F 2 "Capacitor_SMD:C_1210_3225Metric" H 14188 3350 50  0001 C CNN
F 3 "~" H 14150 3500 50  0001 C CNN
F 4 "330µF ±20% 4V Keramikkondensatoren X5R 1210 (3225 metrisch)" H 14150 3500 50  0001 C CNN "info"
F 5 "Murata" H 14150 3500 50  0001 C CNN "manf"
F 6 "GRM32ER60G337ME05L" H 14150 3500 50  0001 C CNN "manf#"
	1    14150 3500
	1    0    0    -1  
$EndComp
$Comp
L Device:D_Zener D3
U 1 1 5EECE4BC
P 9600 3650
F 0 "D3" V 9554 3730 50  0000 L CNN
F 1 "BZT52C3V0LP-7" V 9645 3730 50  0000 L CNN
F 2 "Diode_SMD:D_0402_1005Metric" H 9600 3650 50  0001 C CNN
F 3 "https://www.diodes.com/assets/Datasheets/ds30506.pdf" H 9600 3650 50  0001 C CNN
F 4 "Diodes Incorporated" V 9600 3650 50  0001 C CNN "manf"
F 5 "BZT52C3V0LP-7" V 9600 3650 50  0001 C CNN "manf#"
F 6 "BZT52C3V0LPDICT-ND" V 9600 3650 50  0001 C CNN "digikey#"
	1    9600 3650
	0    1    1    0   
$EndComp
Wire Wire Line
	9600 3500 9600 2800
$Comp
L power:GND #PWR?
U 1 1 5EEF2F76
P 9600 3800
F 0 "#PWR?" H 9600 3550 50  0001 C CNN
F 1 "GND" H 9605 3627 50  0000 C CNN
F 2 "" H 9600 3800 50  0001 C CNN
F 3 "" H 9600 3800 50  0001 C CNN
	1    9600 3800
	1    0    0    -1  
$EndComp
Connection ~ 9600 2800
Wire Wire Line
	9600 2800 10350 2800
Wire Wire Line
	9200 2800 9600 2800
Text GLabel 5700 6700 0    50   Input ~ 0
PMBUS_IRPS5401_SCL
Text GLabel 5700 6800 0    50   BiDi ~ 0
PMBUS_IRPS5401_SDA
Text GLabel 5700 6900 0    50   Output ~ 0
PMBUS_IRPS5401_INT_B
$Comp
L Connector:Conn_01x02_Male J?
U 1 1 5F39A782
P 800 1150
AR Path="/5EF3A6E9/5F39A782" Ref="J?"  Part="1" 
AR Path="/5F7AC3E6/5F39A782" Ref="J5"  Part="1" 
F 0 "J5" H 908 1331 50  0000 C CNN
F 1 "Ext_12V" H 908 1240 50  0000 C CNN
F 2 "Connector_PinHeader_2.54mm:PinHeader_1x02_P2.54mm_Vertical" H 800 1150 50  0001 C CNN
F 3 "~" H 800 1150 50  0001 C CNN
	1    800  1150
	1    0    0    -1  
$EndComp
Wire Wire Line
	1250 1250 1250 1300
$Comp
L power:GND #PWR?
U 1 1 5F39A789
P 1250 1300
AR Path="/5EF3A6E9/5F39A789" Ref="#PWR?"  Part="1" 
AR Path="/5F7AC3E6/5F39A789" Ref="#PWR?"  Part="1" 
F 0 "#PWR?" H 1250 1050 50  0001 C CNN
F 1 "GND" H 1255 1127 50  0000 C CNN
F 2 "" H 1250 1300 50  0001 C CNN
F 3 "" H 1250 1300 50  0001 C CNN
	1    1250 1300
	-1   0    0    -1  
$EndComp
Wire Wire Line
	1250 1250 1000 1250
$Comp
L power:+12V #PWR?
U 1 1 5F39A790
P 1250 1100
AR Path="/5EF3A6E9/5F39A790" Ref="#PWR?"  Part="1" 
AR Path="/5F7AC3E6/5F39A790" Ref="#PWR?"  Part="1" 
AR Path="/5F39A790" Ref="#PWR?"  Part="1" 
F 0 "#PWR?" H 1250 950 50  0001 C CNN
F 1 "+12V" H 1265 1273 50  0000 C CNN
F 2 "" H 1250 1100 50  0001 C CNN
F 3 "" H 1250 1100 50  0001 C CNN
	1    1250 1100
	-1   0    0    -1  
$EndComp
Wire Wire Line
	1250 1100 1250 1150
Wire Wire Line
	1250 1150 1000 1150
Text GLabel 5600 5400 0    50   Input ~ 0
USB_PWR_CPEN
Wire Wire Line
	5600 5400 6050 5400
Text GLabel 5600 5300 0    50   Input ~ 0
EN_PL_VCCINT
Text GLabel 5600 5500 0    50   Input ~ 0
EN_PL_MGTAVTT
Text GLabel 5600 5700 0    50   Input ~ 0
EN_PL_MGTVCCAUX
Text GLabel 5600 5600 0    50   Input ~ 0
EN_PL_MGTAVCC
Wire Wire Line
	6050 5300 5600 5300
Wire Wire Line
	5600 5500 6050 5500
Wire Wire Line
	5600 5600 6050 5600
Wire Wire Line
	5600 5700 6050 5700
Text GLabel 1500 5800 0    50   BiDi ~ 0
B46_IO_[0..23]
Wire Wire Line
	1800 6300 2350 6300
Wire Wire Line
	1800 6200 2350 6200
Wire Wire Line
	1800 6100 2350 6100
Wire Wire Line
	1800 6000 2350 6000
Wire Wire Line
	1800 5900 2350 5900
Text Label 2350 5900 2    50   ~ 0
PG_A
Text Label 2350 6000 2    50   ~ 0
PG_B
Text Label 2350 6100 2    50   ~ 0
PG_C
Text Label 2350 6200 2    50   ~ 0
PG_D
Text Label 2350 6300 2    50   ~ 0
PG_L
Wire Bus Line
	1700 5800 1500 5800
Entry Wire Line
	1700 5800 1800 5900
Entry Wire Line
	1700 5900 1800 6000
Text Label 1850 5900 0    20   ~ 0
B46_IO_13
Entry Wire Line
	1700 6000 1800 6100
Entry Wire Line
	1700 6100 1800 6200
Text Label 1850 6100 0    20   ~ 0
B46_IO_21
Entry Wire Line
	1700 6200 1800 6300
Text Label 1850 6300 0    20   ~ 0
B46_IO_12
$Comp
L Device:R R?
U 1 1 6061EA89
P 5350 6300
AR Path="/5FFD078E/6061EA89" Ref="R?"  Part="1" 
AR Path="/5F7AC3E6/6061EA89" Ref="R103"  Part="1" 
F 0 "R103" V 5300 6400 50  0000 L CNN
F 1 "10k" V 5300 6050 50  0000 L CNN
F 2 "Resistor_SMD:R_0402_1005Metric" V 5280 6300 50  0001 C CNN
F 3 "~" H 5350 6300 50  0001 C CNN
F 4 "AVT-IPE" H 5350 6300 50  0001 C CNN "stock"
	1    5350 6300
	0    1    1    0   
$EndComp
Wire Wire Line
	5500 6300 6050 6300
$Comp
L Device:R R?
U 1 1 6061EA90
P 5350 6200
AR Path="/5FFD078E/6061EA90" Ref="R?"  Part="1" 
AR Path="/5F7AC3E6/6061EA90" Ref="R102"  Part="1" 
F 0 "R102" V 5300 6300 50  0000 L CNN
F 1 "10k" V 5300 5950 50  0000 L CNN
F 2 "Resistor_SMD:R_0402_1005Metric" V 5280 6200 50  0001 C CNN
F 3 "~" H 5350 6200 50  0001 C CNN
F 4 "AVT-IPE" H 5350 6200 50  0001 C CNN "stock"
	1    5350 6200
	0    1    1    0   
$EndComp
Wire Wire Line
	5500 6200 6050 6200
$Comp
L Device:R R?
U 1 1 6061EA97
P 5350 6100
AR Path="/5FFD078E/6061EA97" Ref="R?"  Part="1" 
AR Path="/5F7AC3E6/6061EA97" Ref="R101"  Part="1" 
F 0 "R101" V 5300 6200 50  0000 L CNN
F 1 "10k" V 5300 5850 50  0000 L CNN
F 2 "Resistor_SMD:R_0402_1005Metric" V 5280 6100 50  0001 C CNN
F 3 "~" H 5350 6100 50  0001 C CNN
F 4 "AVT-IPE" H 5350 6100 50  0001 C CNN "stock"
	1    5350 6100
	0    1    1    0   
$EndComp
$Comp
L Device:R R?
U 1 1 6061EA9E
P 5350 6000
AR Path="/5FFD078E/6061EA9E" Ref="R?"  Part="1" 
AR Path="/5F7AC3E6/6061EA9E" Ref="R100"  Part="1" 
F 0 "R100" V 5300 6100 50  0000 L CNN
F 1 "10k" V 5300 5750 50  0000 L CNN
F 2 "Resistor_SMD:R_0402_1005Metric" V 5280 6000 50  0001 C CNN
F 3 "~" H 5350 6000 50  0001 C CNN
F 4 "AVT-IPE" H 5350 6000 50  0001 C CNN "stock"
	1    5350 6000
	0    1    1    0   
$EndComp
Wire Wire Line
	5500 6000 6050 6000
$Comp
L Device:R R?
U 1 1 6061EAA5
P 5350 5900
AR Path="/5FFD078E/6061EAA5" Ref="R?"  Part="1" 
AR Path="/5F7AC3E6/6061EAA5" Ref="R99"  Part="1" 
F 0 "R99" V 5300 6000 50  0000 L CNN
F 1 "10k" V 5300 5650 50  0000 L CNN
F 2 "Resistor_SMD:R_0402_1005Metric" V 5280 5900 50  0001 C CNN
F 3 "~" H 5350 5900 50  0001 C CNN
F 4 "AVT-IPE" H 5350 5900 50  0001 C CNN "stock"
	1    5350 5900
	0    1    1    0   
$EndComp
Wire Wire Line
	5500 5900 6050 5900
Wire Wire Line
	4600 5750 4600 5900
Wire Wire Line
	4600 6300 5200 6300
Connection ~ 4600 5900
Wire Wire Line
	4600 5900 4600 6000
Wire Wire Line
	5200 6000 4600 6000
Connection ~ 4600 6000
Wire Wire Line
	5200 6100 4600 6100
Wire Wire Line
	4600 6000 4600 6100
Connection ~ 4600 6100
Wire Wire Line
	4600 6100 4600 6200
Wire Wire Line
	5200 6200 4600 6200
Connection ~ 4600 6200
Wire Wire Line
	4600 6200 4600 6300
Wire Wire Line
	4600 5900 5200 5900
Text Label 5800 5900 0    50   ~ 0
PG_A
Text Label 5800 6000 0    50   ~ 0
PG_B
Text Label 5800 6100 0    50   ~ 0
PG_C
Text Label 5800 6200 0    50   ~ 0
PG_D
Text Label 5800 6300 0    50   ~ 0
PG_L
$Comp
L KIT_Power:+3V3_STBY #PWR?
U 1 1 606929E8
P 4600 5750
F 0 "#PWR?" H 4600 5600 50  0001 C CNN
F 1 "+3V3_STBY" H 4615 5923 50  0000 C CNN
F 2 "" H 4600 5750 50  0001 C CNN
F 3 "" H 4600 5750 50  0001 C CNN
	1    4600 5750
	1    0    0    -1  
$EndComp
Wire Wire Line
	5500 6100 6050 6100
Text GLabel 9900 2600 0    50   Input ~ 0
EN_PL_VCCINT_PWM
Wire Wire Line
	10250 2600 9900 2600
Wire Wire Line
	10250 2600 10250 2700
Wire Wire Line
	10250 2700 10350 2700
Text Label 1850 6200 0    20   ~ 0
B46_IO_23
Text Label 1850 6000 0    20   ~ 0
B46_IO_18
Wire Wire Line
	14150 3300 14600 3300
Wire Wire Line
	14600 3300 14600 3350
Wire Wire Line
	14600 3650 14600 3700
Wire Wire Line
	14600 3700 14150 3700
$Comp
L Device:C C?
U 1 1 5FD05559
P 14600 3500
AR Path="/5E09AE40/5FD05559" Ref="C?"  Part="1" 
AR Path="/5F7AC3E6/5FD05559" Ref="C299"  Part="1" 
F 0 "C299" H 14715 3546 50  0000 L CNN
F 1 "330uF" H 14715 3455 50  0000 L CNN
F 2 "Capacitor_SMD:C_1210_3225Metric" H 14638 3350 50  0001 C CNN
F 3 "~" H 14600 3500 50  0001 C CNN
F 4 "330µF ±20% 4V Keramikkondensatoren X5R 1210 (3225 metrisch)" H 14600 3500 50  0001 C CNN "info"
F 5 "Murata" H 14600 3500 50  0001 C CNN "manf"
F 6 "GRM32ER60G337ME05L" H 14600 3500 50  0001 C CNN "manf#"
	1    14600 3500
	1    0    0    -1  
$EndComp
Connection ~ 14600 3300
Connection ~ 14600 3700
Connection ~ 14150 3300
Connection ~ 14150 3700
Wire Wire Line
	14600 3300 15050 3300
Wire Wire Line
	14600 3700 15050 3700
Wire Wire Line
	15050 3300 15050 3350
Wire Wire Line
	15050 3650 15050 3700
$Comp
L Device:C C?
U 1 1 5FDA3006
P 15050 3500
AR Path="/5E09AE40/5FDA3006" Ref="C?"  Part="1" 
AR Path="/5F7AC3E6/5FDA3006" Ref="C246"  Part="1" 
F 0 "C246" H 15165 3546 50  0000 L CNN
F 1 "330uF" H 15165 3455 50  0000 L CNN
F 2 "Capacitor_SMD:C_1210_3225Metric" H 15088 3350 50  0001 C CNN
F 3 "~" H 15050 3500 50  0001 C CNN
F 4 "330µF ±20% 4V Keramikkondensatoren X5R 1210 (3225 metrisch)" H 15050 3500 50  0001 C CNN "info"
F 5 "Murata" H 15050 3500 50  0001 C CNN "manf"
F 6 "GRM32ER60G337ME05L" H 15050 3500 50  0001 C CNN "manf#"
	1    15050 3500
	1    0    0    -1  
$EndComp
Connection ~ 15050 3300
Connection ~ 15050 3700
Wire Wire Line
	15050 3300 15500 3300
Wire Wire Line
	15050 3700 15500 3700
Wire Wire Line
	15500 3300 15500 3350
Wire Wire Line
	15500 3650 15500 3700
$Comp
L Device:C C?
U 1 1 60061CA7
P 15500 3500
AR Path="/5E09AE40/60061CA7" Ref="C?"  Part="1" 
AR Path="/5F7AC3E6/60061CA7" Ref="C301"  Part="1" 
F 0 "C301" H 15615 3546 50  0000 L CNN
F 1 "330uF" H 15615 3455 50  0000 L CNN
F 2 "Capacitor_SMD:C_1210_3225Metric" H 15538 3350 50  0001 C CNN
F 3 "~" H 15500 3500 50  0001 C CNN
F 4 "330µF ±20% 4V Keramikkondensatoren X5R 1210 (3225 metrisch)" H 15500 3500 50  0001 C CNN "info"
F 5 "Murata" H 15500 3500 50  0001 C CNN "manf"
F 6 "GRM32ER60G337ME05L" H 15500 3500 50  0001 C CNN "manf#"
	1    15500 3500
	1    0    0    -1  
$EndComp
Connection ~ 15500 3300
Wire Wire Line
	15500 3300 15650 3300
Connection ~ 15500 3700
Wire Wire Line
	15500 3700 15650 3700
Text Notes 11700 9750 0    100  ~ 0
1) +0.85_PL_VCCINT <= VCCINT @ 6A\n4) +5V_USB_VBUS <= \n3) +1V2_PL_MGTAVTT <= MGTAVTT_R @ 1.892A\n2) +0.9V_PL_MGTAVCC <= MGTAVCC @ 1.339A\n3) +1V8_PL_MGTVCCAUX <= MGTAVCCAUX_R @ 0.049A
$Comp
L KIT_Regulator_Switching:IRPS5401MTRPBF U43
U 1 1 5ED9646A
P 7400 5900
F 0 "U43" H 6300 3900 60  0000 C CNN
F 1 "IRPS5401MTRPBF" H 8300 3900 60  0000 C CNN
F 2 "KIT_Package_DFN_QFN:IRPS5401MTRPBF_QFN-56-1EP_7x7mm_P0.4mm_EP5.6x5.6mm_ThermalVias" H 5325 3400 60  0001 L CNN
F 3 "https://www.infineon.com/dgdl/Infineon-IRPS5401M-DS-v02_01-EN.pdf?fileId=5546d4625cc9456a015cd69d402139db" H 8325 7075 60  0001 L CNN
F 4 "IRPS5401MTRPBFCT-ND" H 7475 5875 50  0001 C CNN "digikey#"
	1    7400 5900
	1    0    0    -1  
$EndComp
Wire Bus Line
	1700 5800 1700 6200
$EndSCHEMATC
