EESchema Schematic File Version 4
EELAYER 30 0
EELAYER END
$Descr A4 11693 8268
encoding utf-8
Sheet 4 28
Title "ZynqMP Mezzanine FMC+ (BuZZyBoard)"
Date "2020-10-02"
Rev "1.0"
Comp "Karlsruhe Institute of Technology (KIT)"
Comment1 "Institute for Data Processing and Electronics (IPE)"
Comment2 "Luis Ardila"
Comment3 ""
Comment4 ""
$EndDescr
$Comp
L KIT_FPGA:ZU4EG-B900 U1
U 18 1 5DF1B734
P 8750 5800
F 0 "U1" H 9500 6090 60  0000 C CNN
F 1 "ZU4EG-B900" H 9500 5984 60  0000 C CNN
F 2 "KIT_Package_BGA:BGA-900_30x30_31.0x31.0mm" H 7050 5600 50  0001 C CNN
F 3 "" H 7050 5600 50  0001 C CNN
	18   8750 5800
	1    0    0    -1  
$EndComp
$Comp
L KIT_FPGA:ZU4EG-B900 U1
U 19 1 5DF2469B
P 3600 5300
F 0 "U1" H 4600 5590 60  0000 C CNN
F 1 "ZU4EG-B900" H 4600 5484 60  0000 C CNN
F 2 "KIT_Package_BGA:BGA-900_30x30_31.0x31.0mm" H 1900 5100 50  0001 C CNN
F 3 "" H 1900 5100 50  0001 C CNN
	19   3600 5300
	1    0    0    -1  
$EndComp
$Comp
L KIT_FPGA:ZU4EG-B900 U1
U 20 1 5DF28316
P 4400 7100
F 0 "U1" H 5300 7390 60  0000 C CNN
F 1 "ZU4EG-B900" H 5300 7284 60  0000 C CNN
F 2 "KIT_Package_BGA:BGA-900_30x30_31.0x31.0mm" H 2700 6900 50  0001 C CNN
F 3 "" H 2700 6900 50  0001 C CNN
	20   4400 7100
	1    0    0    -1  
$EndComp
$Comp
L power:GND #PWR?
U 1 1 5E0674CB
P 8650 5850
F 0 "#PWR?" H 8650 5600 50  0001 C CNN
F 1 "GND" H 8655 5677 50  0000 C CNN
F 2 "" H 8650 5850 50  0001 C CNN
F 3 "" H 8650 5850 50  0001 C CNN
	1    8650 5850
	1    0    0    -1  
$EndComp
Wire Wire Line
	8650 5850 8650 5800
Wire Wire Line
	8650 5800 8750 5800
$Comp
L KIT_Power:+1V8_STBY #PWR?
U 1 1 5F2EC4F2
P 8300 3450
F 0 "#PWR?" H 8300 3300 50  0001 C CNN
F 1 "+1V8_STBY" H 8315 3623 50  0000 C CNN
F 2 "" H 8300 3450 50  0001 C CNN
F 3 "" H 8300 3450 50  0001 C CNN
	1    8300 3450
	1    0    0    -1  
$EndComp
$Comp
L power:GND #PWR?
U 1 1 5F2EC4F3
P 8300 3950
F 0 "#PWR?" H 8300 3700 50  0001 C CNN
F 1 "GND" H 8305 3777 50  0000 C CNN
F 2 "" H 8300 3950 50  0001 C CNN
F 3 "" H 8300 3950 50  0001 C CNN
	1    8300 3950
	1    0    0    -1  
$EndComp
$Comp
L KIT_Power:+0.85_PL_VCCINT #PWR?
U 1 1 5F2EC4F4
P 4250 7050
F 0 "#PWR?" H 4250 6900 50  0001 C CNN
F 1 "+0.85_PL_VCCINT" H 4265 7223 50  0000 C CNN
F 2 "" H 4250 7050 50  0001 C CNN
F 3 "" H 4250 7050 50  0001 C CNN
	1    4250 7050
	1    0    0    -1  
$EndComp
Wire Wire Line
	4250 7050 4250 7100
Wire Wire Line
	4250 7100 4400 7100
$Comp
L KIT_Power:+1V8_STBY #PWR?
U 1 1 5E5850B6
P 6350 7050
F 0 "#PWR?" H 6350 6900 50  0001 C CNN
F 1 "+1V8_STBY" H 6365 7223 50  0000 C CNN
F 2 "" H 6350 7050 50  0001 C CNN
F 3 "" H 6350 7050 50  0001 C CNN
	1    6350 7050
	1    0    0    -1  
$EndComp
Wire Wire Line
	6350 7050 6350 7100
Wire Wire Line
	6350 7100 6200 7100
Wire Wire Line
	6350 7200 6350 7100
Wire Wire Line
	6350 7200 6200 7200
Connection ~ 6350 7100
$Comp
L power:GND #PWR?
U 1 1 5F2EC4F6
P 5300 1350
F 0 "#PWR?" H 5300 1100 50  0001 C CNN
F 1 "GND" H 5305 1177 50  0000 C CNN
F 2 "" H 5300 1350 50  0001 C CNN
F 3 "" H 5300 1350 50  0001 C CNN
	1    5300 1350
	1    0    0    -1  
$EndComp
$Comp
L KIT_Power:+0.85_PL_VCCINT #PWR?
U 1 1 5F2EC4F7
P 5300 850
F 0 "#PWR?" H 5300 700 50  0001 C CNN
F 1 "+0.85_PL_VCCINT" H 5315 1023 50  0000 C CNN
F 2 "" H 5300 850 50  0001 C CNN
F 3 "" H 5300 850 50  0001 C CNN
	1    5300 850 
	1    0    0    -1  
$EndComp
Wire Wire Line
	3100 6050 3450 6050
Wire Wire Line
	3450 6050 3450 5900
Wire Wire Line
	3450 5800 3600 5800
Wire Wire Line
	3600 5900 3450 5900
Connection ~ 3450 5900
Wire Wire Line
	3450 5900 3450 5800
$Comp
L Device:C C31
U 1 1 5F2EC4D9
P 7050 3700
F 0 "C31" H 7165 3791 50  0000 L CNN
F 1 "1uF" H 7165 3700 50  0000 L CNN
F 2 "Capacitor_SMD:C_0402_1005Metric" H 7088 3550 50  0001 C CNN
F 3 "~" H 7050 3700 50  0001 C CNN
F 4 "16 V" H 7165 3609 50  0000 L CNN "info"
F 5 "AVT-IPE" H 7050 3700 50  0001 C CNN "stock"
	1    7050 3700
	1    0    0    -1  
$EndComp
$Comp
L Device:C C37
U 1 1 5E340BC8
P 7550 3700
F 0 "C37" H 7665 3791 50  0000 L CNN
F 1 "1uF" H 7665 3700 50  0000 L CNN
F 2 "Capacitor_SMD:C_0402_1005Metric" H 7588 3550 50  0001 C CNN
F 3 "~" H 7550 3700 50  0001 C CNN
F 4 "16 V" H 7665 3609 50  0000 L CNN "info"
F 5 "AVT-IPE" H 7550 3700 50  0001 C CNN "stock"
	1    7550 3700
	1    0    0    -1  
$EndComp
$Comp
L Device:C C44
U 1 1 5E340FF1
P 8050 3700
F 0 "C44" H 8165 3791 50  0000 L CNN
F 1 "1uF" H 8165 3700 50  0000 L CNN
F 2 "Capacitor_SMD:C_0402_1005Metric" H 8088 3550 50  0001 C CNN
F 3 "~" H 8050 3700 50  0001 C CNN
F 4 "16 V" H 8165 3609 50  0000 L CNN "info"
F 5 "AVT-IPE" H 8050 3700 50  0001 C CNN "stock"
	1    8050 3700
	1    0    0    -1  
$EndComp
$Comp
L power:GND #PWR?
U 1 1 5E357325
P 10850 6150
F 0 "#PWR?" H 10850 5900 50  0001 C CNN
F 1 "GND" H 10855 5977 50  0000 C CNN
F 2 "" H 10850 6150 50  0001 C CNN
F 3 "" H 10850 6150 50  0001 C CNN
	1    10850 6150
	1    0    0    -1  
$EndComp
$Comp
L Device:R R16
U 1 1 5E361502
P 10850 6000
F 0 "R16" H 10920 6046 50  0000 L CNN
F 1 "0" H 10920 5955 50  0000 L CNN
F 2 "Resistor_SMD:R_0402_1005Metric" V 10780 6000 50  0001 C CNN
F 3 "~" H 10850 6000 50  0001 C CNN
F 4 "AVT-IPE" H 10850 6000 50  0001 C CNN "stock"
	1    10850 6000
	1    0    0    -1  
$EndComp
$Comp
L Device:C C26
U 1 1 5F2EC4DE
P 6300 1150
F 0 "C26" H 6415 1196 50  0000 L CNN
F 1 "1uF" H 6415 1105 50  0000 L CNN
F 2 "Capacitor_SMD:C_0402_1005Metric" H 6338 1000 50  0001 C CNN
F 3 "~" H 6300 1150 50  0001 C CNN
F 4 "16 V" H 6200 1250 50  0001 C CNN "info"
F 5 "AVT-IPE" H 6300 1150 50  0001 C CNN "stock"
	1    6300 1150
	1    0    0    -1  
$EndComp
Wire Wire Line
	5800 6100 5800 5800
Wire Wire Line
	5800 5800 5600 5800
$Comp
L KIT_Power:+1V8_STBY #PWR?
U 1 1 5E85849E
P 7850 5650
F 0 "#PWR?" H 7850 5500 50  0001 C CNN
F 1 "+1V8_STBY" H 7865 5823 50  0000 C CNN
F 2 "" H 7850 5650 50  0001 C CNN
F 3 "" H 7850 5650 50  0001 C CNN
	1    7850 5650
	1    0    0    -1  
$EndComp
$Comp
L KIT_Power:+1V2_PS_PLL #PWR?
U 1 1 5E85E45A
P 7100 6050
F 0 "#PWR?" H 7100 5900 50  0001 C CNN
F 1 "+1V2_PS_PLL" H 7115 6223 50  0000 C CNN
F 2 "" H 7100 6050 50  0001 C CNN
F 3 "" H 7100 6050 50  0001 C CNN
	1    7100 6050
	1    0    0    -1  
$EndComp
Wire Wire Line
	7100 6050 7100 6100
Wire Wire Line
	6300 950  6300 1000
Wire Wire Line
	5600 5700 7850 5700
Wire Wire Line
	7850 5650 7850 5700
$Comp
L KIT_Power:+0.85V_PS_MGTRAVCC #PWR?
U 1 1 5EC1C183
P 1950 5650
F 0 "#PWR?" H 1950 5500 50  0001 C CNN
F 1 "+0.85V_PS_MGTRAVCC" H 1965 5823 50  0000 C CNN
F 2 "" H 1950 5650 50  0001 C CNN
F 3 "" H 1950 5650 50  0001 C CNN
	1    1950 5650
	1    0    0    -1  
$EndComp
$Comp
L KIT_Power:+1V8_PS_MGTRAVTT #PWR?
U 1 1 5EC1F786
P 950 5650
F 0 "#PWR?" H 950 5500 50  0001 C CNN
F 1 "+1V8_PS_MGTRAVTT" H 965 5823 50  0000 C CNN
F 2 "" H 950 5650 50  0001 C CNN
F 3 "" H 950 5650 50  0001 C CNN
	1    950  5650
	1    0    0    -1  
$EndComp
Wire Wire Line
	1950 5700 1950 5650
$Comp
L power:GND #PWR?
U 1 1 5ED2132A
P 2850 2600
F 0 "#PWR?" H 2850 2350 50  0001 C CNN
F 1 "GND" H 2855 2427 50  0000 C CNN
F 2 "" H 2850 2600 50  0001 C CNN
F 3 "" H 2850 2600 50  0001 C CNN
	1    2850 2600
	1    0    0    -1  
$EndComp
$Comp
L Device:C C38
U 1 1 5ED21348
P 2100 2350
F 0 "C38" H 2215 2441 50  0000 L CNN
F 1 "1uF" H 2215 2350 50  0000 L CNN
F 2 "Capacitor_SMD:C_0402_1005Metric" H 2138 2200 50  0001 C CNN
F 3 "~" H 2100 2350 50  0001 C CNN
F 4 "16 V" H 2215 2259 50  0000 L CNN "info"
F 5 "AVT-IPE" H 2100 2350 50  0001 C CNN "stock"
	1    2100 2350
	1    0    0    -1  
$EndComp
$Comp
L Device:C C45
U 1 1 5ED21354
P 2600 2350
F 0 "C45" H 2715 2441 50  0000 L CNN
F 1 "1uF" H 2715 2350 50  0000 L CNN
F 2 "Capacitor_SMD:C_0402_1005Metric" H 2638 2200 50  0001 C CNN
F 3 "~" H 2600 2350 50  0001 C CNN
F 4 "16 V" H 2715 2259 50  0000 L CNN "info"
F 5 "AVT-IPE" H 2600 2350 50  0001 C CNN "stock"
	1    2600 2350
	1    0    0    -1  
$EndComp
$Comp
L power:GND #PWR?
U 1 1 5F2EC506
P 6050 2600
F 0 "#PWR?" H 6050 2350 50  0001 C CNN
F 1 "GND" H 6055 2427 50  0000 C CNN
F 2 "" H 6050 2600 50  0001 C CNN
F 3 "" H 6050 2600 50  0001 C CNN
	1    6050 2600
	1    0    0    -1  
$EndComp
$Comp
L Device:C C32
U 1 1 5F2EC507
P 4800 2350
F 0 "C32" H 4915 2441 50  0000 L CNN
F 1 "1uF" H 4915 2350 50  0000 L CNN
F 2 "Capacitor_SMD:C_0402_1005Metric" H 4838 2200 50  0001 C CNN
F 3 "~" H 4800 2350 50  0001 C CNN
F 4 "16 V" H 4915 2259 50  0000 L CNN "info"
F 5 "AVT-IPE" H 4800 2350 50  0001 C CNN "stock"
	1    4800 2350
	1    0    0    -1  
$EndComp
$Comp
L Device:C C39
U 1 1 5ED27D7A
P 5300 2350
F 0 "C39" H 5415 2441 50  0000 L CNN
F 1 "1uF" H 5415 2350 50  0000 L CNN
F 2 "Capacitor_SMD:C_0402_1005Metric" H 5338 2200 50  0001 C CNN
F 3 "~" H 5300 2350 50  0001 C CNN
F 4 "16 V" H 5415 2259 50  0000 L CNN "info"
F 5 "AVT-IPE" H 5300 2350 50  0001 C CNN "stock"
	1    5300 2350
	1    0    0    -1  
$EndComp
$Comp
L Device:C C46
U 1 1 5F2EC509
P 5800 2350
F 0 "C46" H 5915 2441 50  0000 L CNN
F 1 "1uF" H 5915 2350 50  0000 L CNN
F 2 "Capacitor_SMD:C_0402_1005Metric" H 5838 2200 50  0001 C CNN
F 3 "~" H 5800 2350 50  0001 C CNN
F 4 "16 V" H 5915 2259 50  0000 L CNN "info"
F 5 "AVT-IPE" H 5800 2350 50  0001 C CNN "stock"
	1    5800 2350
	1    0    0    -1  
$EndComp
$Comp
L KIT_Power:+0.85V_PS_MGTRAVCC #PWR?
U 1 1 5F2EC50A
P 2850 2100
F 0 "#PWR?" H 2850 1950 50  0001 C CNN
F 1 "+0.85V_PS_MGTRAVCC" H 2865 2273 50  0000 C CNN
F 2 "" H 2850 2100 50  0001 C CNN
F 3 "" H 2850 2100 50  0001 C CNN
	1    2850 2100
	1    0    0    -1  
$EndComp
$Comp
L KIT_Power:+1V8_PS_MGTRAVTT #PWR?
U 1 1 5F2EC50B
P 6050 2100
F 0 "#PWR?" H 6050 1950 50  0001 C CNN
F 1 "+1V8_PS_MGTRAVTT" H 6065 2273 50  0000 C CNN
F 2 "" H 6050 2100 50  0001 C CNN
F 3 "" H 6050 2100 50  0001 C CNN
	1    6050 2100
	1    0    0    -1  
$EndComp
$Comp
L Device:C C48
U 1 1 5F2EC50F
P 6800 1150
F 0 "C48" H 6915 1241 50  0000 L CNN
F 1 "1uF" H 6915 1150 50  0000 L CNN
F 2 "Capacitor_SMD:C_0402_1005Metric" H 6838 1000 50  0001 C CNN
F 3 "~" H 6800 1150 50  0001 C CNN
F 4 "16 V" H 6915 1059 50  0000 L CNN "info"
F 5 "AVT-IPE" H 6800 1150 50  0001 C CNN "stock"
	1    6800 1150
	1    0    0    -1  
$EndComp
$Comp
L power:GND #PWR?
U 1 1 5F2EC510
P 7050 1400
F 0 "#PWR?" H 7050 1150 50  0001 C CNN
F 1 "GND" H 7055 1227 50  0000 C CNN
F 2 "" H 7050 1400 50  0001 C CNN
F 3 "" H 7050 1400 50  0001 C CNN
	1    7050 1400
	1    0    0    -1  
$EndComp
$Comp
L KIT_Power:+1V2_PS_PLL #PWR?
U 1 1 5F2EC511
P 7050 900
F 0 "#PWR?" H 7050 750 50  0001 C CNN
F 1 "+1V2_PS_PLL" H 7065 1073 50  0000 C CNN
F 2 "" H 7050 900 50  0001 C CNN
F 3 "" H 7050 900 50  0001 C CNN
	1    7050 900 
	1    0    0    -1  
$EndComp
$Comp
L KIT_Power:+1V2_PL_MGTAVTT #PWR?
U 1 1 5EEAA214
P 2700 5100
F 0 "#PWR?" H 2700 4950 50  0001 C CNN
F 1 "+1V2_PL_MGTAVTT" H 2715 5273 50  0000 C CNN
F 2 "" H 2700 5100 50  0001 C CNN
F 3 "" H 2700 5100 50  0001 C CNN
	1    2700 5100
	1    0    0    -1  
$EndComp
$Comp
L KIT_Power:+0.9V_PL_MGTAVCC #PWR?
U 1 1 5F2EC513
P 3550 5100
F 0 "#PWR?" H 3550 4950 50  0001 C CNN
F 1 "+0.9V_PL_MGTAVCC" H 3565 5273 50  0000 C CNN
F 2 "" H 3550 5100 50  0001 C CNN
F 3 "" H 3550 5100 50  0001 C CNN
	1    3550 5100
	1    0    0    -1  
$EndComp
Wire Wire Line
	3600 5300 3550 5300
Wire Wire Line
	3550 5300 3550 5100
Wire Wire Line
	3600 5400 3250 5400
Wire Wire Line
	3250 5400 3250 5150
Wire Wire Line
	3250 5150 2700 5150
Wire Wire Line
	2700 5150 2700 5100
$Comp
L KIT_Power:+1V2_PL_MGTAVTT #PWR?
U 1 1 5F2EC514
P 6600 5150
F 0 "#PWR?" H 6600 5000 50  0001 C CNN
F 1 "+1V2_PL_MGTAVTT" H 6615 5323 50  0000 C CNN
F 2 "" H 6600 5150 50  0001 C CNN
F 3 "" H 6600 5150 50  0001 C CNN
	1    6600 5150
	-1   0    0    -1  
$EndComp
Wire Wire Line
	6450 5200 6600 5200
$Comp
L Device:R R17
U 1 1 5F2EC515
P 6600 5400
F 0 "R17" H 6670 5446 50  0000 L CNN
F 1 "100" H 6670 5355 50  0000 L CNN
F 2 "Resistor_SMD:R_0402_1005Metric" V 6530 5400 50  0001 C CNN
F 3 "~" H 6600 5400 50  0001 C CNN
F 4 "" V 6600 5400 50  0001 C CNN "info"
F 5 "AVT-IPE" H 6600 5400 50  0001 C CNN "stock"
	1    6600 5400
	1    0    0    -1  
$EndComp
$Comp
L KIT_Power:+1V8_PL_MGTVCCAUX #PWR?
U 1 1 5F09792C
P 1850 5100
F 0 "#PWR?" H 1850 4950 50  0001 C CNN
F 1 "+1V8_PL_MGTVCCAUX" H 1865 5273 50  0000 C CNN
F 2 "" H 1850 5100 50  0001 C CNN
F 3 "" H 1850 5100 50  0001 C CNN
	1    1850 5100
	1    0    0    -1  
$EndComp
Wire Wire Line
	1850 5250 2750 5250
Wire Wire Line
	2750 5250 2750 5500
Wire Wire Line
	2750 5500 3600 5500
Wire Wire Line
	1850 5100 1850 5250
Wire Wire Line
	1950 5700 2350 5700
Wire Wire Line
	2350 5700 2350 5600
Wire Wire Line
	2350 5600 3600 5600
Wire Wire Line
	3600 5700 2500 5700
Wire Wire Line
	2500 5700 2500 5900
Wire Wire Line
	2500 5900 950  5900
Wire Wire Line
	950  5650 950  5900
$Comp
L Device:C C33
U 1 1 5F12B2FF
P 8300 1150
F 0 "C33" H 8415 1241 50  0000 L CNN
F 1 "1uF" H 8415 1150 50  0000 L CNN
F 2 "Capacitor_SMD:C_0402_1005Metric" H 8338 1000 50  0001 C CNN
F 3 "~" H 8300 1150 50  0001 C CNN
F 4 "16 V" H 8415 1059 50  0000 L CNN "info"
F 5 "AVT-IPE" H 8300 1150 50  0001 C CNN "stock"
	1    8300 1150
	1    0    0    -1  
$EndComp
$Comp
L Device:C C40
U 1 1 5F2EC519
P 8800 1150
F 0 "C40" H 8915 1241 50  0000 L CNN
F 1 "1uF" H 8915 1150 50  0000 L CNN
F 2 "Capacitor_SMD:C_0402_1005Metric" H 8838 1000 50  0001 C CNN
F 3 "~" H 8800 1150 50  0001 C CNN
F 4 "16 V" H 8915 1059 50  0000 L CNN "info"
F 5 "AVT-IPE" H 8800 1150 50  0001 C CNN "stock"
	1    8800 1150
	1    0    0    -1  
$EndComp
$Comp
L Device:C C49
U 1 1 5F2EC51A
P 10300 1150
F 0 "C49" H 10415 1241 50  0000 L CNN
F 1 "1uF" H 10415 1150 50  0000 L CNN
F 2 "Capacitor_SMD:C_0402_1005Metric" H 10338 1000 50  0001 C CNN
F 3 "~" H 10300 1150 50  0001 C CNN
F 4 "16 V" H 10415 1059 50  0000 L CNN "info"
F 5 "AVT-IPE" H 10300 1150 50  0001 C CNN "stock"
	1    10300 1150
	1    0    0    -1  
$EndComp
$Comp
L Device:C C29
U 1 1 5F15AFF9
P 9200 2300
F 0 "C29" H 9315 2391 50  0000 L CNN
F 1 "1uF" H 9315 2300 50  0000 L CNN
F 2 "Capacitor_SMD:C_0402_1005Metric" H 9238 2150 50  0001 C CNN
F 3 "~" H 9200 2300 50  0001 C CNN
F 4 "16 V" H 9315 2209 50  0000 L CNN "info"
F 5 "AVT-IPE" H 9200 2300 50  0001 C CNN "stock"
	1    9200 2300
	1    0    0    -1  
$EndComp
$Comp
L Device:C C34
U 1 1 5F2EC51D
P 9700 2300
F 0 "C34" H 9815 2391 50  0000 L CNN
F 1 "1uF" H 9815 2300 50  0000 L CNN
F 2 "Capacitor_SMD:C_0402_1005Metric" H 9738 2150 50  0001 C CNN
F 3 "~" H 9700 2300 50  0001 C CNN
F 4 "16 V" H 9815 2209 50  0000 L CNN "info"
F 5 "AVT-IPE" H 9700 2300 50  0001 C CNN "stock"
	1    9700 2300
	1    0    0    -1  
$EndComp
$Comp
L Device:C C41
U 1 1 5F15B013
P 10200 2300
F 0 "C41" H 10315 2391 50  0000 L CNN
F 1 "1uF" H 10315 2300 50  0000 L CNN
F 2 "Capacitor_SMD:C_0402_1005Metric" H 10238 2150 50  0001 C CNN
F 3 "~" H 10200 2300 50  0001 C CNN
F 4 "16 V" H 10315 2209 50  0000 L CNN "info"
F 5 "AVT-IPE" H 10200 2300 50  0001 C CNN "stock"
	1    10200 2300
	1    0    0    -1  
$EndComp
$Comp
L power:GND #PWR?
U 1 1 5F2EC51F
P 10550 1400
F 0 "#PWR?" H 10550 1150 50  0001 C CNN
F 1 "GND" H 10555 1227 50  0000 C CNN
F 2 "" H 10550 1400 50  0001 C CNN
F 3 "" H 10550 1400 50  0001 C CNN
	1    10550 1400
	1    0    0    -1  
$EndComp
$Comp
L power:GND #PWR?
U 1 1 5F2EC520
P 10550 2550
F 0 "#PWR?" H 10550 2300 50  0001 C CNN
F 1 "GND" H 10555 2377 50  0000 C CNN
F 2 "" H 10550 2550 50  0001 C CNN
F 3 "" H 10550 2550 50  0001 C CNN
	1    10550 2550
	1    0    0    -1  
$EndComp
$Comp
L power:GND #PWR?
U 1 1 5F170904
P 10650 4000
F 0 "#PWR?" H 10650 3750 50  0001 C CNN
F 1 "GND" H 10655 3827 50  0000 C CNN
F 2 "" H 10650 4000 50  0001 C CNN
F 3 "" H 10650 4000 50  0001 C CNN
	1    10650 4000
	1    0    0    -1  
$EndComp
$Comp
L KIT_Power:+1V2_PL_MGTAVTT #PWR?
U 1 1 5F170C45
P 10550 2050
F 0 "#PWR?" H 10550 1900 50  0001 C CNN
F 1 "+1V2_PL_MGTAVTT" H 10565 2223 50  0000 C CNN
F 2 "" H 10550 2050 50  0001 C CNN
F 3 "" H 10550 2050 50  0001 C CNN
	1    10550 2050
	1    0    0    -1  
$EndComp
$Comp
L KIT_Power:+0.9V_PL_MGTAVCC #PWR?
U 1 1 5F170C4B
P 10550 900
F 0 "#PWR?" H 10550 750 50  0001 C CNN
F 1 "+0.9V_PL_MGTAVCC" H 10565 1073 50  0000 C CNN
F 2 "" H 10550 900 50  0001 C CNN
F 3 "" H 10550 900 50  0001 C CNN
	1    10550 900 
	1    0    0    -1  
$EndComp
$Comp
L Device:C C28
U 1 1 5F755F7D
P 4000 1100
F 0 "C28" H 4115 1191 50  0000 L CNN
F 1 "1uF" H 4115 1100 50  0000 L CNN
F 2 "Capacitor_SMD:C_0402_1005Metric" H 4038 950 50  0001 C CNN
F 3 "~" H 4000 1100 50  0001 C CNN
F 4 "16 V" H 4115 1009 50  0000 L CNN "info"
F 5 "AVT-IPE" H 4000 1100 50  0001 C CNN "stock"
	1    4000 1100
	1    0    0    -1  
$EndComp
$Comp
L Device:C C30
U 1 1 5F2EC52A
P 4500 1100
F 0 "C30" H 4615 1191 50  0000 L CNN
F 1 "1uF" H 4615 1100 50  0000 L CNN
F 2 "Capacitor_SMD:C_0402_1005Metric" H 4538 950 50  0001 C CNN
F 3 "~" H 4500 1100 50  0001 C CNN
F 4 "16 V" H 4615 1009 50  0000 L CNN "info"
F 5 "AVT-IPE" H 4500 1100 50  0001 C CNN "stock"
	1    4500 1100
	1    0    0    -1  
$EndComp
$Comp
L Device:C C36
U 1 1 5F2EC52B
P 5000 1100
F 0 "C36" H 5115 1191 50  0000 L CNN
F 1 "1uF" H 5115 1100 50  0000 L CNN
F 2 "Capacitor_SMD:C_0402_1005Metric" H 5038 950 50  0001 C CNN
F 3 "~" H 5000 1100 50  0001 C CNN
F 4 "16 V" H 5115 1009 50  0000 L CNN "info"
F 5 "AVT-IPE" H 5000 1100 50  0001 C CNN "stock"
	1    5000 1100
	1    0    0    -1  
$EndComp
$Comp
L Device:C C43
U 1 1 5F2EC52C
P 3500 1100
F 0 "C43" H 3615 1191 50  0000 L CNN
F 1 "1uF" H 3615 1100 50  0000 L CNN
F 2 "Capacitor_SMD:C_0402_1005Metric" H 3538 950 50  0001 C CNN
F 3 "~" H 3500 1100 50  0001 C CNN
F 4 "16 V" H 3615 1009 50  0000 L CNN "info"
F 5 "AVT-IPE" H 3500 1100 50  0001 C CNN "stock"
	1    3500 1100
	1    0    0    -1  
$EndComp
$Comp
L Device:C C42
U 1 1 5F87E3DF
P 10300 3750
F 0 "C42" H 10415 3841 50  0000 L CNN
F 1 "1uF" H 10415 3750 50  0000 L CNN
F 2 "Capacitor_SMD:C_0402_1005Metric" H 10338 3600 50  0001 C CNN
F 3 "~" H 10300 3750 50  0001 C CNN
F 4 "16 V" H 10415 3659 50  0000 L CNN "info"
F 5 "AVT-IPE" H 10300 3750 50  0001 C CNN "stock"
	1    10300 3750
	1    0    0    -1  
$EndComp
Wire Wire Line
	5800 6100 7100 6100
Wire Wire Line
	10250 5800 10400 5800
Wire Wire Line
	10850 5850 10850 5800
Wire Wire Line
	10400 6100 10250 6100
Wire Wire Line
	10300 3600 10300 3550
Connection ~ 10300 3550
Wire Wire Line
	10300 3900 10300 3950
Connection ~ 10300 3950
Wire Wire Line
	10300 3950 10650 3950
Wire Wire Line
	10300 3550 10650 3550
Wire Wire Line
	9800 3900 9800 3950
Wire Wire Line
	9800 3550 9800 3600
Wire Wire Line
	9800 3550 10300 3550
Wire Wire Line
	9800 3950 10300 3950
$Comp
L Device:C C35
U 1 1 5F2EC51B
P 9800 3750
F 0 "C35" H 9915 3841 50  0000 L CNN
F 1 "1uF" H 9915 3750 50  0000 L CNN
F 2 "Capacitor_SMD:C_0402_1005Metric" H 9838 3600 50  0001 C CNN
F 3 "~" H 9800 3750 50  0001 C CNN
F 4 "16 V" H 9915 3659 50  0000 L CNN "info"
F 5 "AVT-IPE" H 9800 3750 50  0001 C CNN "stock"
	1    9800 3750
	1    0    0    -1  
$EndComp
Wire Wire Line
	9200 2150 9200 2100
Wire Wire Line
	9200 2450 9200 2500
Wire Wire Line
	9200 2500 9700 2500
Wire Wire Line
	9700 2450 9700 2500
Connection ~ 9700 2500
Wire Wire Line
	9700 2500 10200 2500
Wire Wire Line
	9700 2150 9700 2100
Wire Wire Line
	9200 2100 9700 2100
Connection ~ 9700 2100
Wire Wire Line
	9700 2100 10200 2100
Wire Wire Line
	10200 2150 10200 2100
Connection ~ 10200 2100
Wire Wire Line
	10200 2100 10550 2100
Wire Wire Line
	10200 2450 10200 2500
Connection ~ 10200 2500
Wire Wire Line
	10200 2500 10550 2500
Wire Wire Line
	8300 1300 8300 1350
Wire Wire Line
	8300 1350 8800 1350
Wire Wire Line
	8300 1000 8300 950 
Wire Wire Line
	8300 950  8800 950 
Wire Wire Line
	8800 1000 8800 950 
Connection ~ 8800 950 
Wire Wire Line
	8800 950  9300 950 
Wire Wire Line
	8800 1300 8800 1350
Connection ~ 8800 1350
Wire Wire Line
	8800 1350 9300 1350
Wire Wire Line
	10300 1300 10300 1350
Wire Wire Line
	10300 1350 10550 1350
Wire Wire Line
	10300 1000 10300 950 
Wire Wire Line
	10300 950  10550 950 
$Comp
L KIT_Power:+1V8_PL_MGTVCCAUX #PWR?
U 1 1 5F2EC517
P 10650 3500
F 0 "#PWR?" H 10650 3350 50  0001 C CNN
F 1 "+1V8_PL_MGTVCCAUX" H 10665 3673 50  0000 C CNN
F 2 "" H 10650 3500 50  0001 C CNN
F 3 "" H 10650 3500 50  0001 C CNN
	1    10650 3500
	1    0    0    -1  
$EndComp
Wire Wire Line
	6800 1000 6800 950 
Wire Wire Line
	6800 950  7050 950 
Wire Wire Line
	6800 1300 6800 1350
Wire Wire Line
	6800 1350 7050 1350
Wire Wire Line
	5800 2550 5800 2500
Connection ~ 5800 2550
Wire Wire Line
	5800 2550 6050 2550
Wire Wire Line
	5800 2200 5800 2150
Connection ~ 5800 2150
Wire Wire Line
	5800 2150 6050 2150
Wire Wire Line
	4800 2150 4800 2200
Wire Wire Line
	4800 2150 4950 2150
Wire Wire Line
	4800 2500 4800 2550
Wire Wire Line
	4800 2550 5300 2550
Wire Wire Line
	5300 2500 5300 2550
Connection ~ 5300 2550
Wire Wire Line
	5300 2550 5800 2550
Wire Wire Line
	5300 2200 5300 2150
Connection ~ 5300 2150
Wire Wire Line
	5300 2150 5800 2150
Wire Wire Line
	2100 2200 2100 2150
Wire Wire Line
	2100 2150 2200 2150
Wire Wire Line
	2600 2200 2600 2150
Connection ~ 2600 2150
Wire Wire Line
	2600 2150 2850 2150
Wire Wire Line
	2600 2500 2600 2550
Connection ~ 2600 2550
Wire Wire Line
	2600 2550 2850 2550
Wire Wire Line
	7050 3550 7050 3500
Wire Wire Line
	7050 3500 7550 3500
Wire Wire Line
	7050 3850 7050 3900
Wire Wire Line
	7050 3900 7550 3900
Wire Wire Line
	7550 3850 7550 3900
Connection ~ 7550 3900
Wire Wire Line
	7550 3900 8050 3900
Wire Wire Line
	8050 3850 8050 3900
Connection ~ 8050 3900
Wire Wire Line
	8050 3900 8300 3900
Wire Wire Line
	8050 3550 8050 3500
Connection ~ 8050 3500
Wire Wire Line
	8050 3500 8300 3500
Wire Wire Line
	7550 3550 7550 3500
Connection ~ 7550 3500
Wire Wire Line
	7550 3500 8050 3500
Wire Wire Line
	5000 900  5300 900 
Wire Wire Line
	5000 1300 5300 1300
Wire Wire Line
	5600 5500 6450 5500
Wire Wire Line
	6450 5500 6450 5200
Wire Wire Line
	10400 6100 10400 6000
Wire Wire Line
	10250 5900 10400 5900
Connection ~ 10400 5900
Wire Wire Line
	10400 5900 10400 5800
Wire Wire Line
	10250 6000 10400 6000
Connection ~ 10400 6000
Wire Wire Line
	10400 6000 10400 5900
Wire Wire Line
	10400 5800 10850 5800
Connection ~ 10400 5800
Text Label 10450 5800 0    50   ~ 0
RSVDGND
$Comp
L KIT_Power:+0.85_STBY #PWR?
U 1 1 5F2EC4F8
P 3100 6050
F 0 "#PWR?" H 3100 5900 50  0001 C CNN
F 1 "+0.85_STBY" H 3115 6223 50  0000 C CNN
F 2 "" H 3100 6050 50  0001 C CNN
F 3 "" H 3100 6050 50  0001 C CNN
	1    3100 6050
	1    0    0    -1  
$EndComp
$Comp
L KIT_Power:+0.85_STBY #PWR?
U 1 1 5F504A9B
P 950 2000
F 0 "#PWR?" H 950 1850 50  0001 C CNN
F 1 "+0.85_STBY" H 965 2173 50  0000 C CNN
F 2 "" H 950 2000 50  0001 C CNN
F 3 "" H 950 2000 50  0001 C CNN
	1    950  2000
	1    0    0    -1  
$EndComp
Wire Wire Line
	950  2000 950  2150
Wire Wire Line
	950  2150 1350 2150
Wire Wire Line
	1650 2150 1700 2150
Connection ~ 2100 2150
Wire Wire Line
	2850 2600 2850 2550
Wire Wire Line
	2850 2150 2850 2100
Wire Wire Line
	3550 2150 3950 2150
Wire Wire Line
	4250 2150 4350 2150
Connection ~ 4800 2150
Wire Wire Line
	6050 2600 6050 2550
Wire Wire Line
	6050 2150 6050 2100
$Comp
L KIT_Power:+1V8_STBY #PWR?
U 1 1 5F81A289
P 3550 2000
F 0 "#PWR?" H 3550 1850 50  0001 C CNN
F 1 "+1V8_STBY" H 3565 2173 50  0000 C CNN
F 2 "" H 3550 2000 50  0001 C CNN
F 3 "" H 3550 2000 50  0001 C CNN
	1    3550 2000
	1    0    0    -1  
$EndComp
Wire Wire Line
	3550 2000 3550 2150
Wire Wire Line
	10650 4000 10650 3950
Wire Wire Line
	10650 3550 10650 3500
Wire Wire Line
	10550 2550 10550 2500
Wire Wire Line
	10550 2100 10550 2050
Wire Wire Line
	10550 1400 10550 1350
Wire Wire Line
	10550 950  10550 900 
Wire Wire Line
	7050 1400 7050 1350
Wire Wire Line
	7050 950  7050 900 
Wire Wire Line
	8300 3950 8300 3900
Wire Wire Line
	8300 3500 8300 3450
Wire Wire Line
	5300 1350 5300 1300
Wire Wire Line
	5300 900  5300 850 
Connection ~ 6600 5200
Wire Wire Line
	6600 5200 6600 5250
Wire Wire Line
	6600 5150 6600 5200
Wire Wire Line
	6600 5600 6600 5550
Wire Wire Line
	5600 5600 6600 5600
Text Notes 5650 5500 0    50   ~ 0
Route Differential
Wire Wire Line
	6300 950  6800 950 
Connection ~ 6800 950 
Wire Wire Line
	6800 1350 6300 1350
Wire Wire Line
	6300 1350 6300 1300
Connection ~ 6800 1350
Text Label 5650 5600 0    50   ~ 0
MGTRREF
Wire Notes Line
	5650 5650 6350 5650
Wire Notes Line
	6350 5650 6350 5400
Wire Notes Line
	6350 5400 5650 5400
Wire Notes Line
	5650 5400 5650 5650
Text Notes 550  7700 0    50   ~ 0
UG583:\n- Recommended decoupling capacitors:\n   - VCCINT/VCCINT_IO: 1x330uF + 4x100uF + 1x47uF + 1x10uF\n   - VCCBRAM/VCCINT_IO: 1x47uF + 1x10uF\n   - VCCAUX/VCCAUX_IO: 1x47uF + 1x10uF\n   - HDIO/HPIO (per bank): 1x47uF + 1x10uF
$Comp
L Device:C C12
U 1 1 5EEF8BCC
P 2250 1100
F 0 "C12" H 2365 1146 50  0000 L CNN
F 1 "47uF" H 2365 1055 50  0000 L CNN
F 2 "Capacitor_SMD:C_0805_2012Metric" H 2288 950 50  0001 C CNN
F 3 "~" H 2250 1100 50  0001 C CNN
F 4 "10V" H 2250 1100 50  0001 C CNN "info"
F 5 "" H 2250 1100 50  0001 C CNN "manf"
F 6 "" H 2250 1100 50  0001 C CNN "manf#"
F 7 "AVT-IPE" H 2250 1100 50  0001 C CNN "stock"
	1    2250 1100
	1    0    0    -1  
$EndComp
$Comp
L Device:C C15
U 1 1 5EEF9D8F
P 2700 1100
F 0 "C15" H 2815 1146 50  0000 L CNN
F 1 "47uF" H 2815 1055 50  0000 L CNN
F 2 "Capacitor_SMD:C_0603_1608Metric" H 2738 950 50  0001 C CNN
F 3 "~" H 2700 1100 50  0001 C CNN
F 4 "47µF ±20% 2.5V Ceramic Capacitor X6S 0603 (1608 Metric) " H 2700 1100 50  0001 C CNN "info"
F 5 "Murata" H 2700 1100 50  0001 C CNN "manf"
F 6 "GRM188C80E476ME05" H 2700 1100 50  0001 C CNN "manf#"
	1    2700 1100
	1    0    0    -1  
$EndComp
$Comp
L Device:C C16
U 1 1 5EEFADCD
P 3100 1100
F 0 "C16" H 3215 1146 50  0000 L CNN
F 1 "10uF" H 3215 1055 50  0000 L CNN
F 2 "Capacitor_SMD:C_0402_1005Metric" H 3138 950 50  0001 C CNN
F 3 "~" H 3100 1100 50  0001 C CNN
F 4 "10µF ±20% 6.3V Ceramic Capacitor X6S 0402 (1005 Metric) " H 3100 1100 50  0001 C CNN "info"
F 5 "Murata" H 3100 1100 50  0001 C CNN "manf"
F 6 "GRM155C80J106ME11D" H 3100 1100 50  0001 C CNN "manf#"
	1    3100 1100
	1    0    0    -1  
$EndComp
$Comp
L Device:Ferrite_Bead FB?
U 1 1 5F548F0F
P 4100 2150
AR Path="/5DEF958D/5F548F0F" Ref="FB?"  Part="1" 
AR Path="/5E09AE40/5F548F0F" Ref="FB5"  Part="1" 
F 0 "FB5" V 3826 2150 50  0000 C CNN
F 1 "120 Ohms @ 100MHz" V 3917 2150 50  0000 C CNN
F 2 "Inductor_SMD:L_0402_1005Metric" V 4030 2150 50  0001 C CNN
F 3 "https://www.murata.com/en-us/products/productdata/8796740059166/ENFA0018.pdf" H 4100 2150 50  0001 C CNN
F 4 "120 Ohms @ 100MHz 1 Power Line Ferrite Bead 0402 (1005 Metric) 2A 55mOhm" V 4100 2150 50  0001 C CNN "info"
F 5 "Murata" V 4100 2150 50  0001 C CNN "manf"
F 6 "BLM15PX121SN1D" V 4100 2150 50  0001 C CNN "manf#"
	1    4100 2150
	0    1    1    0   
$EndComp
$Comp
L Device:Ferrite_Bead FB?
U 1 1 5F577FB4
P 1500 2150
AR Path="/5DEF958D/5F577FB4" Ref="FB?"  Part="1" 
AR Path="/5E09AE40/5F577FB4" Ref="FB7"  Part="1" 
F 0 "FB7" V 1226 2150 50  0000 C CNN
F 1 "120 Ohms @ 100MHz" V 1317 2150 50  0000 C CNN
F 2 "Inductor_SMD:L_0402_1005Metric" V 1430 2150 50  0001 C CNN
F 3 "https://www.murata.com/en-us/products/productdata/8796740059166/ENFA0018.pdf" H 1500 2150 50  0001 C CNN
F 4 "120 Ohms @ 100MHz 1 Power Line Ferrite Bead 0402 (1005 Metric) 2A 55mOhm" V 1500 2150 50  0001 C CNN "info"
F 5 "Murata" V 1500 2150 50  0001 C CNN "manf"
F 6 "BLM15PX121SN1D" V 1500 2150 50  0001 C CNN "manf#"
	1    1500 2150
	0    1    1    0   
$EndComp
$Comp
L Device:C C168
U 1 1 5ED7CA12
P 1800 1100
F 0 "C168" H 1915 1146 50  0000 L CNN
F 1 "47uF" H 1915 1055 50  0000 L CNN
F 2 "Capacitor_SMD:C_0805_2012Metric" H 1838 950 50  0001 C CNN
F 3 "~" H 1800 1100 50  0001 C CNN
F 4 "10V" H 1800 1100 50  0001 C CNN "info"
F 5 "" H 1800 1100 50  0001 C CNN "manf"
F 6 "" H 1800 1100 50  0001 C CNN "manf#"
F 7 "AVT-IPE" H 1800 1100 50  0001 C CNN "stock"
	1    1800 1100
	1    0    0    -1  
$EndComp
$Comp
L Device:C C167
U 1 1 5ED7DBEB
P 1300 1100
F 0 "C167" H 1415 1146 50  0000 L CNN
F 1 "47uF" H 1415 1055 50  0000 L CNN
F 2 "Capacitor_SMD:C_0805_2012Metric" H 1338 950 50  0001 C CNN
F 3 "~" H 1300 1100 50  0001 C CNN
F 4 "10V" H 1300 1100 50  0001 C CNN "info"
F 5 "" H 1300 1100 50  0001 C CNN "manf"
F 6 "" H 1300 1100 50  0001 C CNN "manf#"
F 7 "AVT-IPE" H 1300 1100 50  0001 C CNN "stock"
	1    1300 1100
	1    0    0    -1  
$EndComp
$Comp
L Device:C C11
U 1 1 5ED90512
P 800 1100
F 0 "C11" H 915 1146 50  0000 L CNN
F 1 "47uF" H 915 1055 50  0000 L CNN
F 2 "Capacitor_SMD:C_0805_2012Metric" H 838 950 50  0001 C CNN
F 3 "~" H 800 1100 50  0001 C CNN
F 4 "10V" H 800 1100 50  0001 C CNN "info"
F 5 "" H 800 1100 50  0001 C CNN "manf"
F 6 "" H 800 1100 50  0001 C CNN "manf#"
F 7 "AVT-IPE" H 800 1100 50  0001 C CNN "stock"
	1    800  1100
	1    0    0    -1  
$EndComp
Wire Wire Line
	800  950  800  900 
Wire Wire Line
	800  900  1300 900 
Wire Wire Line
	800  1250 800  1300
Wire Wire Line
	800  1300 1300 1300
Wire Wire Line
	1300 950  1300 900 
Connection ~ 1300 900 
Wire Wire Line
	1300 900  1800 900 
Wire Wire Line
	1300 1250 1300 1300
Connection ~ 1300 1300
Wire Wire Line
	1300 1300 1800 1300
Wire Wire Line
	1800 950  1800 900 
Connection ~ 1800 900 
Wire Wire Line
	1800 900  2250 900 
Wire Wire Line
	1800 1250 1800 1300
Connection ~ 1800 1300
Wire Wire Line
	1800 1300 2250 1300
Wire Wire Line
	2250 950  2250 900 
Wire Wire Line
	2250 1250 2250 1300
Wire Wire Line
	2250 900  2700 900 
Wire Wire Line
	2250 1300 2700 1300
Wire Wire Line
	2700 950  2700 900 
Wire Wire Line
	2700 1250 2700 1300
Wire Wire Line
	3100 950  3100 900 
Wire Wire Line
	3100 1250 3100 1300
Wire Wire Line
	3500 950  3500 900 
Wire Wire Line
	3500 1250 3500 1300
Wire Wire Line
	3500 900  4000 900 
Wire Wire Line
	3500 1300 4000 1300
Wire Wire Line
	4000 950  4000 900 
Connection ~ 4000 900 
Wire Wire Line
	4000 900  4500 900 
Wire Wire Line
	4000 1250 4000 1300
Connection ~ 4000 1300
Wire Wire Line
	4000 1300 4500 1300
Wire Wire Line
	4500 950  4500 900 
Wire Wire Line
	4500 1250 4500 1300
Wire Wire Line
	4500 900  5000 900 
Wire Wire Line
	4500 1300 5000 1300
Wire Wire Line
	5000 950  5000 900 
Wire Wire Line
	5000 1250 5000 1300
Connection ~ 4500 900 
Connection ~ 4500 1300
Connection ~ 5000 900 
Connection ~ 5000 1300
Connection ~ 2250 900 
Connection ~ 2250 1300
Connection ~ 3500 900 
Connection ~ 3500 1300
$Comp
L Device:C C169
U 1 1 5F0DEE58
P 650 3700
F 0 "C169" H 765 3746 50  0000 L CNN
F 1 "47uF" H 765 3655 50  0000 L CNN
F 2 "Capacitor_SMD:C_0603_1608Metric" H 688 3550 50  0001 C CNN
F 3 "~" H 650 3700 50  0001 C CNN
F 4 "47µF ±20% 2.5V Ceramic Capacitor X6S 0603 (1608 Metric) " H 650 3700 50  0001 C CNN "info"
F 5 "Murata" H 650 3700 50  0001 C CNN "manf"
F 6 "GRM188C80E476ME05" H 650 3700 50  0001 C CNN "manf#"
	1    650  3700
	1    0    0    -1  
$EndComp
Wire Wire Line
	650  3850 650  3900
Connection ~ 2700 900 
Connection ~ 2700 1300
$Comp
L Device:C C170
U 1 1 5F15A651
P 3800 3700
F 0 "C170" H 3915 3746 50  0000 L CNN
F 1 "10uF" H 3915 3655 50  0000 L CNN
F 2 "Capacitor_SMD:C_0402_1005Metric" H 3838 3550 50  0001 C CNN
F 3 "~" H 3800 3700 50  0001 C CNN
F 4 "10µF ±20% 6.3V Ceramic Capacitor X6S 0402 (1005 Metric) " H 3800 3700 50  0001 C CNN "info"
F 5 "Murata" H 3800 3700 50  0001 C CNN "manf"
F 6 "GRM155C80J106ME11D" H 3800 3700 50  0001 C CNN "manf#"
	1    3800 3700
	1    0    0    -1  
$EndComp
Wire Wire Line
	3800 3850 3800 3900
Wire Wire Line
	3100 900  3500 900 
Wire Wire Line
	3100 1300 3500 1300
Wire Wire Line
	2700 900  3100 900 
Wire Wire Line
	2700 1300 3100 1300
Connection ~ 3100 900 
Connection ~ 3100 1300
$Comp
L Device:C C171
U 1 1 5F42158B
P 1650 3700
F 0 "C171" H 1765 3791 50  0000 L CNN
F 1 "1uF" H 1765 3700 50  0000 L CNN
F 2 "Capacitor_SMD:C_0402_1005Metric" H 1688 3550 50  0001 C CNN
F 3 "~" H 1650 3700 50  0001 C CNN
F 4 "16 V" H 1765 3609 50  0000 L CNN "info"
F 5 "AVT-IPE" H 1650 3700 50  0001 C CNN "stock"
	1    1650 3700
	1    0    0    -1  
$EndComp
Wire Wire Line
	1650 3850 1650 3900
Wire Wire Line
	2150 3850 2150 3900
Wire Wire Line
	1650 3500 1650 3550
Wire Wire Line
	2150 3500 2150 3550
Wire Wire Line
	3800 3500 3800 3550
Wire Wire Line
	650  3500 650  3550
$Comp
L Device:C C173
U 1 1 5F51F8F0
P 3350 3700
F 0 "C173" H 3465 3746 50  0000 L CNN
F 1 "47uF" H 3465 3655 50  0000 L CNN
F 2 "Capacitor_SMD:C_0603_1608Metric" H 3388 3550 50  0001 C CNN
F 3 "~" H 3350 3700 50  0001 C CNN
F 4 "47µF ±20% 2.5V Ceramic Capacitor X6S 0603 (1608 Metric) " H 3350 3700 50  0001 C CNN "info"
F 5 "Murata" H 3350 3700 50  0001 C CNN "manf"
F 6 "GRM188C80E476ME05" H 3350 3700 50  0001 C CNN "manf#"
	1    3350 3700
	1    0    0    -1  
$EndComp
Wire Wire Line
	3350 3850 3350 3900
$Comp
L Device:C C174
U 1 1 5F51F8FA
P 1150 3700
F 0 "C174" H 1265 3746 50  0000 L CNN
F 1 "10uF" H 1265 3655 50  0000 L CNN
F 2 "Capacitor_SMD:C_0402_1005Metric" H 1188 3550 50  0001 C CNN
F 3 "~" H 1150 3700 50  0001 C CNN
F 4 "10µF ±20% 6.3V Ceramic Capacitor X6S 0402 (1005 Metric) " H 1150 3700 50  0001 C CNN "info"
F 5 "Murata" H 1150 3700 50  0001 C CNN "manf"
F 6 "GRM155C80J106ME11D" H 1150 3700 50  0001 C CNN "manf#"
	1    1150 3700
	1    0    0    -1  
$EndComp
Wire Wire Line
	1150 3850 1150 3900
$Comp
L Device:C C175
U 1 1 5F51F903
P 4250 3700
F 0 "C175" H 4365 3791 50  0000 L CNN
F 1 "1uF" H 4365 3700 50  0000 L CNN
F 2 "Capacitor_SMD:C_0402_1005Metric" H 4288 3550 50  0001 C CNN
F 3 "~" H 4250 3700 50  0001 C CNN
F 4 "16 V" H 4365 3609 50  0000 L CNN "info"
F 5 "AVT-IPE" H 4250 3700 50  0001 C CNN "stock"
	1    4250 3700
	1    0    0    -1  
$EndComp
$Comp
L Device:C C176
U 1 1 5F51F90B
P 5150 3700
F 0 "C176" H 5265 3791 50  0000 L CNN
F 1 "1uF" H 5265 3700 50  0000 L CNN
F 2 "Capacitor_SMD:C_0402_1005Metric" H 5188 3550 50  0001 C CNN
F 3 "~" H 5150 3700 50  0001 C CNN
F 4 "16 V" H 5265 3609 50  0000 L CNN "info"
F 5 "AVT-IPE" H 5150 3700 50  0001 C CNN "stock"
	1    5150 3700
	1    0    0    -1  
$EndComp
Wire Wire Line
	4250 3850 4250 3900
Wire Wire Line
	5150 3850 5150 3900
Wire Wire Line
	5150 3500 5450 3500
Wire Wire Line
	5450 3500 5450 3450
Wire Wire Line
	4700 3500 5150 3500
Connection ~ 5150 3500
Wire Wire Line
	4250 3500 4250 3550
Wire Wire Line
	5150 3500 5150 3550
Wire Wire Line
	1150 3500 1150 3550
Wire Wire Line
	3350 3500 3350 3550
Wire Wire Line
	5450 3900 5450 3950
Wire Wire Line
	4700 3900 5150 3900
Connection ~ 5150 3900
Wire Wire Line
	5150 3900 5450 3900
$Comp
L power:GND #PWR?
U 1 1 5F51F927
P 5450 3950
F 0 "#PWR?" H 5450 3700 50  0001 C CNN
F 1 "GND" H 5455 3777 50  0000 C CNN
F 2 "" H 5450 3950 50  0001 C CNN
F 3 "" H 5450 3950 50  0001 C CNN
	1    5450 3950
	1    0    0    -1  
$EndComp
$Comp
L KIT_Power:+0.85_STBY #PWR?
U 1 1 5F51F92D
P 5450 3450
F 0 "#PWR?" H 5450 3300 50  0001 C CNN
F 1 "+0.85_STBY" H 5465 3623 50  0000 C CNN
F 2 "" H 5450 3450 50  0001 C CNN
F 3 "" H 5450 3450 50  0001 C CNN
	1    5450 3450
	1    0    0    -1  
$EndComp
Wire Wire Line
	2900 3500 3350 3500
Wire Wire Line
	2900 3900 3350 3900
Wire Wire Line
	650  3500 1150 3500
Wire Wire Line
	650  3900 1150 3900
Wire Wire Line
	1650 3500 2150 3500
Wire Wire Line
	1650 3900 2150 3900
$Comp
L Device:C C177
U 1 1 5F66F5A3
P 4700 3700
F 0 "C177" H 4815 3791 50  0000 L CNN
F 1 "1uF" H 4815 3700 50  0000 L CNN
F 2 "Capacitor_SMD:C_0402_1005Metric" H 4738 3550 50  0001 C CNN
F 3 "~" H 4700 3700 50  0001 C CNN
F 4 "16 V" H 4815 3609 50  0000 L CNN "info"
F 5 "AVT-IPE" H 4700 3700 50  0001 C CNN "stock"
	1    4700 3700
	1    0    0    -1  
$EndComp
Wire Wire Line
	4700 3850 4700 3900
Wire Wire Line
	4700 3500 4700 3550
Wire Wire Line
	4250 3500 4700 3500
Wire Wire Line
	4250 3900 4700 3900
Connection ~ 4700 3500
Connection ~ 4700 3900
$Comp
L Device:C C47
U 1 1 5F74DC5B
P 6600 3700
F 0 "C47" H 6715 3746 50  0000 L CNN
F 1 "10uF" H 6715 3655 50  0000 L CNN
F 2 "Capacitor_SMD:C_0402_1005Metric" H 6638 3550 50  0001 C CNN
F 3 "~" H 6600 3700 50  0001 C CNN
F 4 "10µF ±20% 6.3V Ceramic Capacitor X6S 0402 (1005 Metric) " H 6600 3700 50  0001 C CNN "info"
F 5 "Murata" H 6600 3700 50  0001 C CNN "manf"
F 6 "GRM155C80J106ME11D" H 6600 3700 50  0001 C CNN "manf#"
	1    6600 3700
	1    0    0    -1  
$EndComp
Wire Wire Line
	7050 3500 6600 3500
Wire Wire Line
	6150 3500 6150 3550
Wire Wire Line
	6150 3900 6600 3900
Wire Wire Line
	6150 3850 6150 3900
Connection ~ 7050 3500
Connection ~ 7050 3900
Wire Wire Line
	6600 3500 6600 3550
Wire Wire Line
	6600 3850 6600 3900
Connection ~ 6600 3500
Wire Wire Line
	6600 3500 6150 3500
Connection ~ 6600 3900
Wire Wire Line
	6600 3900 7050 3900
$Comp
L Device:C C27
U 1 1 5F8089DD
P 6150 3700
F 0 "C27" H 6265 3746 50  0000 L CNN
F 1 "10uF" H 6265 3655 50  0000 L CNN
F 2 "Capacitor_SMD:C_0402_1005Metric" H 6188 3550 50  0001 C CNN
F 3 "~" H 6150 3700 50  0001 C CNN
F 4 "10µF ±20% 6.3V Ceramic Capacitor X6S 0402 (1005 Metric) " H 6150 3700 50  0001 C CNN "info"
F 5 "Murata" H 6150 3700 50  0001 C CNN "manf"
F 6 "GRM155C80J106ME11D" H 6150 3700 50  0001 C CNN "manf#"
	1    6150 3700
	1    0    0    -1  
$EndComp
$Comp
L Device:C C178
U 1 1 5F867EEF
P 5900 1150
F 0 "C178" H 6015 1196 50  0000 L CNN
F 1 "10uF" H 6015 1105 50  0000 L CNN
F 2 "Capacitor_SMD:C_0402_1005Metric" H 5938 1000 50  0001 C CNN
F 3 "~" H 5900 1150 50  0001 C CNN
F 4 "10µF ±20% 6.3V Ceramic Capacitor X6S 0402 (1005 Metric) " H 5900 1150 50  0001 C CNN "info"
F 5 "Murata" H 5900 1150 50  0001 C CNN "manf"
F 6 "GRM155C80J106ME11D" H 5900 1150 50  0001 C CNN "manf#"
	1    5900 1150
	1    0    0    -1  
$EndComp
Wire Wire Line
	6300 950  5900 950 
Wire Wire Line
	5900 950  5900 1000
Wire Wire Line
	5900 1350 6300 1350
Wire Wire Line
	5900 1300 5900 1350
Connection ~ 6300 950 
Connection ~ 6300 1350
$Comp
L Device:C C179
U 1 1 5F88236D
P 6800 2300
F 0 "C179" H 6915 2346 50  0000 L CNN
F 1 "10uF" H 6915 2255 50  0000 L CNN
F 2 "Capacitor_SMD:C_0402_1005Metric" H 6838 2150 50  0001 C CNN
F 3 "~" H 6800 2300 50  0001 C CNN
F 4 "10µF ±20% 6.3V Ceramic Capacitor X6S 0402 (1005 Metric) " H 6800 2300 50  0001 C CNN "info"
F 5 "Murata" H 6800 2300 50  0001 C CNN "manf"
F 6 "GRM155C80J106ME11D" H 6800 2300 50  0001 C CNN "manf#"
	1    6800 2300
	1    0    0    -1  
$EndComp
Wire Wire Line
	6800 2100 6800 2150
Wire Wire Line
	6800 2450 6800 2500
$Comp
L Device:C C180
U 1 1 5F893CF6
P 7850 1150
F 0 "C180" H 7965 1196 50  0000 L CNN
F 1 "10uF" H 7965 1105 50  0000 L CNN
F 2 "Capacitor_SMD:C_0402_1005Metric" H 7888 1000 50  0001 C CNN
F 3 "~" H 7850 1150 50  0001 C CNN
F 4 "10µF ±20% 6.3V Ceramic Capacitor X6S 0402 (1005 Metric) " H 7850 1150 50  0001 C CNN "info"
F 5 "Murata" H 7850 1150 50  0001 C CNN "manf"
F 6 "GRM155C80J106ME11D" H 7850 1150 50  0001 C CNN "manf#"
	1    7850 1150
	1    0    0    -1  
$EndComp
Wire Wire Line
	8300 950  7850 950 
Wire Wire Line
	7850 950  7850 1000
Wire Wire Line
	7850 1350 8300 1350
Wire Wire Line
	7850 1300 7850 1350
Connection ~ 8300 950 
Connection ~ 8300 1350
$Comp
L Device:C C181
U 1 1 5F9AC555
P 9400 3750
F 0 "C181" H 9515 3796 50  0000 L CNN
F 1 "10uF" H 9515 3705 50  0000 L CNN
F 2 "Capacitor_SMD:C_0402_1005Metric" H 9438 3600 50  0001 C CNN
F 3 "~" H 9400 3750 50  0001 C CNN
F 4 "10µF ±20% 6.3V Ceramic Capacitor X6S 0402 (1005 Metric) " H 9400 3750 50  0001 C CNN "info"
F 5 "Murata" H 9400 3750 50  0001 C CNN "manf"
F 6 "GRM155C80J106ME11D" H 9400 3750 50  0001 C CNN "manf#"
	1    9400 3750
	1    0    0    -1  
$EndComp
Wire Wire Line
	9800 3550 9400 3550
Wire Wire Line
	9400 3550 9400 3600
Wire Wire Line
	9400 3950 9800 3950
Wire Wire Line
	9400 3900 9400 3950
$Comp
L Device:C C184
U 1 1 5F9E9751
P 8200 2300
F 0 "C184" H 8315 2391 50  0000 L CNN
F 1 "1uF" H 8315 2300 50  0000 L CNN
F 2 "Capacitor_SMD:C_0402_1005Metric" H 8238 2150 50  0001 C CNN
F 3 "~" H 8200 2300 50  0001 C CNN
F 4 "16 V" H 8315 2209 50  0000 L CNN "info"
F 5 "AVT-IPE" H 8200 2300 50  0001 C CNN "stock"
	1    8200 2300
	1    0    0    -1  
$EndComp
$Comp
L Device:C C185
U 1 1 5F9E9759
P 8700 2300
F 0 "C185" H 8815 2391 50  0000 L CNN
F 1 "1uF" H 8815 2300 50  0000 L CNN
F 2 "Capacitor_SMD:C_0402_1005Metric" H 8738 2150 50  0001 C CNN
F 3 "~" H 8700 2300 50  0001 C CNN
F 4 "16 V" H 8815 2209 50  0000 L CNN "info"
F 5 "AVT-IPE" H 8700 2300 50  0001 C CNN "stock"
	1    8700 2300
	1    0    0    -1  
$EndComp
Wire Wire Line
	8200 2150 8200 2100
Wire Wire Line
	8200 2450 8200 2500
Wire Wire Line
	8200 2500 8700 2500
Wire Wire Line
	8700 2450 8700 2500
Connection ~ 8700 2500
Wire Wire Line
	8700 2500 9200 2500
Wire Wire Line
	8700 2150 8700 2100
Wire Wire Line
	8200 2100 8700 2100
Connection ~ 8700 2100
Wire Wire Line
	8700 2100 9200 2100
Connection ~ 9200 2100
Connection ~ 9200 2500
$Comp
L Device:C C182
U 1 1 5FA9DAE3
P 7250 2300
F 0 "C182" H 7365 2391 50  0000 L CNN
F 1 "1uF" H 7365 2300 50  0000 L CNN
F 2 "Capacitor_SMD:C_0402_1005Metric" H 7288 2150 50  0001 C CNN
F 3 "~" H 7250 2300 50  0001 C CNN
F 4 "16 V" H 7365 2209 50  0000 L CNN "info"
F 5 "AVT-IPE" H 7250 2300 50  0001 C CNN "stock"
	1    7250 2300
	1    0    0    -1  
$EndComp
$Comp
L Device:C C183
U 1 1 5FA9DAEB
P 7700 2300
F 0 "C183" H 7815 2391 50  0000 L CNN
F 1 "1uF" H 7815 2300 50  0000 L CNN
F 2 "Capacitor_SMD:C_0402_1005Metric" H 7738 2150 50  0001 C CNN
F 3 "~" H 7700 2300 50  0001 C CNN
F 4 "16 V" H 7815 2209 50  0000 L CNN "info"
F 5 "AVT-IPE" H 7700 2300 50  0001 C CNN "stock"
	1    7700 2300
	1    0    0    -1  
$EndComp
Wire Wire Line
	7250 2150 7250 2100
Wire Wire Line
	7250 2450 7250 2500
Wire Wire Line
	7700 2450 7700 2500
Wire Wire Line
	7700 2500 8200 2500
Wire Wire Line
	7700 2150 7700 2100
Wire Wire Line
	7700 2100 8200 2100
Wire Wire Line
	7700 2100 7250 2100
Connection ~ 7700 2100
Connection ~ 7250 2100
Wire Wire Line
	7250 2100 6800 2100
Wire Wire Line
	6800 2500 7250 2500
Connection ~ 7700 2500
Connection ~ 7250 2500
Wire Wire Line
	7250 2500 7700 2500
$Comp
L Device:C C187
U 1 1 5FB219F2
P 9300 1150
F 0 "C187" H 9415 1241 50  0000 L CNN
F 1 "1uF" H 9415 1150 50  0000 L CNN
F 2 "Capacitor_SMD:C_0402_1005Metric" H 9338 1000 50  0001 C CNN
F 3 "~" H 9300 1150 50  0001 C CNN
F 4 "16 V" H 9415 1059 50  0000 L CNN "info"
F 5 "AVT-IPE" H 9300 1150 50  0001 C CNN "stock"
	1    9300 1150
	1    0    0    -1  
$EndComp
$Comp
L Device:C C188
U 1 1 5FB219FA
P 9800 1150
F 0 "C188" H 9915 1241 50  0000 L CNN
F 1 "1uF" H 9915 1150 50  0000 L CNN
F 2 "Capacitor_SMD:C_0402_1005Metric" H 9838 1000 50  0001 C CNN
F 3 "~" H 9800 1150 50  0001 C CNN
F 4 "16 V" H 9915 1059 50  0000 L CNN "info"
F 5 "AVT-IPE" H 9800 1150 50  0001 C CNN "stock"
	1    9800 1150
	1    0    0    -1  
$EndComp
Wire Wire Line
	9300 1300 9300 1350
Wire Wire Line
	9300 1350 9800 1350
Wire Wire Line
	9300 1000 9300 950 
Wire Wire Line
	9300 950  9800 950 
Wire Wire Line
	9800 1000 9800 950 
Connection ~ 9800 950 
Wire Wire Line
	9800 950  10300 950 
Wire Wire Line
	9800 1300 9800 1350
Connection ~ 9800 1350
Wire Wire Line
	9800 1350 10300 1350
Connection ~ 9300 950 
Connection ~ 9300 1350
Connection ~ 10300 950 
Connection ~ 10300 1350
$Comp
L Device:C C266
U 1 1 5ECAD1E4
P 4350 2350
F 0 "C266" H 4465 2396 50  0000 L CNN
F 1 "10uF" H 4465 2305 50  0000 L CNN
F 2 "Capacitor_SMD:C_0402_1005Metric" H 4388 2200 50  0001 C CNN
F 3 "~" H 4350 2350 50  0001 C CNN
F 4 "10µF ±20% 6.3V Ceramic Capacitor X6S 0402 (1005 Metric) " H 4350 2350 50  0001 C CNN "info"
F 5 "Murata" H 4350 2350 50  0001 C CNN "manf"
F 6 "GRM155C80J106ME11D" H 4350 2350 50  0001 C CNN "manf#"
	1    4350 2350
	1    0    0    -1  
$EndComp
Wire Wire Line
	4350 2500 4350 2550
Wire Wire Line
	4350 2550 4800 2550
Connection ~ 4800 2550
Wire Wire Line
	4350 2150 4350 2200
Connection ~ 4350 2150
Wire Wire Line
	4350 2150 4800 2150
$Comp
L Device:C C233
U 1 1 5EDD5520
P 1700 2350
F 0 "C233" H 1815 2396 50  0000 L CNN
F 1 "10uF" H 1815 2305 50  0000 L CNN
F 2 "Capacitor_SMD:C_0402_1005Metric" H 1738 2200 50  0001 C CNN
F 3 "~" H 1700 2350 50  0001 C CNN
F 4 "10µF ±20% 6.3V Ceramic Capacitor X6S 0402 (1005 Metric) " H 1700 2350 50  0001 C CNN "info"
F 5 "Murata" H 1700 2350 50  0001 C CNN "manf"
F 6 "GRM155C80J106ME11D" H 1700 2350 50  0001 C CNN "manf#"
	1    1700 2350
	1    0    0    -1  
$EndComp
Wire Wire Line
	1700 2500 1700 2550
Wire Wire Line
	1700 2550 2100 2550
Wire Wire Line
	1700 2200 1700 2150
Connection ~ 1700 2150
Wire Wire Line
	1700 2150 2100 2150
Wire Wire Line
	2100 2500 2100 2550
Connection ~ 2100 2550
Wire Wire Line
	2100 2550 2600 2550
$Comp
L Device:C C279
U 1 1 5ED3E596
P 2900 3700
F 0 "C279" H 3015 3746 50  0000 L CNN
F 1 "47uF" H 3015 3655 50  0000 L CNN
F 2 "Capacitor_SMD:C_0805_2012Metric" H 2938 3550 50  0001 C CNN
F 3 "~" H 2900 3700 50  0001 C CNN
F 4 "10V" H 2900 3700 50  0001 C CNN "info"
F 5 "" H 2900 3700 50  0001 C CNN "manf"
F 6 "" H 2900 3700 50  0001 C CNN "manf#"
F 7 "AVT-IPE" H 2900 3700 50  0001 C CNN "stock"
	1    2900 3700
	1    0    0    -1  
$EndComp
Wire Wire Line
	2900 3550 2900 3500
Wire Wire Line
	1150 3500 1650 3500
Wire Wire Line
	2900 3850 2900 3900
Wire Wire Line
	1150 3900 1650 3900
$Comp
L power:PWR_FLAG #FLG?
U 1 1 5F088702
P 10850 5750
F 0 "#FLG?" H 10850 5825 50  0001 C CNN
F 1 "PWR_FLAG" H 10850 5923 50  0000 C CNN
F 2 "" H 10850 5750 50  0001 C CNN
F 3 "~" H 10850 5750 50  0001 C CNN
	1    10850 5750
	1    0    0    -1  
$EndComp
Wire Wire Line
	10850 5750 10850 5800
Connection ~ 10850 5800
$Comp
L power:PWR_FLAG #FLG?
U 1 1 5F0C41F7
P 2200 2100
F 0 "#FLG?" H 2200 2175 50  0001 C CNN
F 1 "PWR_FLAG" H 2200 2273 50  0000 C CNN
F 2 "" H 2200 2100 50  0001 C CNN
F 3 "~" H 2200 2100 50  0001 C CNN
	1    2200 2100
	1    0    0    -1  
$EndComp
Wire Wire Line
	2200 2100 2200 2150
Connection ~ 2200 2150
Wire Wire Line
	2200 2150 2600 2150
$Comp
L power:PWR_FLAG #FLG?
U 1 1 5F0F92A3
P 4950 2100
F 0 "#FLG?" H 4950 2175 50  0001 C CNN
F 1 "PWR_FLAG" H 4950 2273 50  0000 C CNN
F 2 "" H 4950 2100 50  0001 C CNN
F 3 "~" H 4950 2100 50  0001 C CNN
	1    4950 2100
	1    0    0    -1  
$EndComp
Wire Wire Line
	4950 2100 4950 2150
Connection ~ 4950 2150
Wire Wire Line
	4950 2150 5300 2150
Wire Wire Line
	4400 7300 4250 7300
Wire Wire Line
	4250 7300 4250 7200
Connection ~ 4250 7100
Wire Wire Line
	4400 7200 4250 7200
Connection ~ 4250 7200
Wire Wire Line
	4250 7200 4250 7100
$Comp
L Device:C C172
U 1 1 5F421593
P 2150 3700
F 0 "C172" H 2265 3791 50  0000 L CNN
F 1 "1uF" H 2265 3700 50  0000 L CNN
F 2 "Capacitor_SMD:C_0402_1005Metric" H 2188 3550 50  0001 C CNN
F 3 "~" H 2150 3700 50  0001 C CNN
F 4 "16 V" H 2265 3609 50  0000 L CNN "info"
F 5 "AVT-IPE" H 2150 3700 50  0001 C CNN "stock"
	1    2150 3700
	1    0    0    -1  
$EndComp
Connection ~ 1150 3500
Connection ~ 1150 3900
Connection ~ 1650 3500
Connection ~ 1650 3900
$Comp
L power:GND #PWR?
U 1 1 5F5AFA84
P 2450 3950
F 0 "#PWR?" H 2450 3700 50  0001 C CNN
F 1 "GND" H 2455 3777 50  0000 C CNN
F 2 "" H 2450 3950 50  0001 C CNN
F 3 "" H 2450 3950 50  0001 C CNN
	1    2450 3950
	1    0    0    -1  
$EndComp
$Comp
L KIT_Power:+0.85_PL_VCCINT #PWR?
U 1 1 5F5AFA8A
P 2450 3450
F 0 "#PWR?" H 2450 3300 50  0001 C CNN
F 1 "+0.85_PL_VCCINT" H 2465 3623 50  0000 C CNN
F 2 "" H 2450 3450 50  0001 C CNN
F 3 "" H 2450 3450 50  0001 C CNN
	1    2450 3450
	1    0    0    -1  
$EndComp
Wire Wire Line
	2150 3500 2450 3500
Wire Wire Line
	2150 3900 2450 3900
Wire Wire Line
	2450 3950 2450 3900
Wire Wire Line
	2450 3500 2450 3450
Connection ~ 2150 3500
Connection ~ 2150 3900
Wire Wire Line
	3800 3500 4250 3500
Wire Wire Line
	3800 3900 4250 3900
Wire Wire Line
	3350 3500 3800 3500
Wire Wire Line
	3350 3900 3800 3900
Connection ~ 3800 3500
Connection ~ 3800 3900
Connection ~ 3350 3500
Connection ~ 3350 3900
Connection ~ 4250 3500
Connection ~ 4250 3900
$EndSCHEMATC
