EESchema Schematic File Version 4
EELAYER 30 0
EELAYER END
$Descr A3 16535 11693
encoding utf-8
Sheet 11 28
Title "ZynqMP Mezzanine FMC+ (BuZZyBoard)"
Date "2020-10-02"
Rev "1.0"
Comp "Karlsruhe Institute of Technology (KIT)"
Comment1 "Institute for Data Processing and Electronics (IPE)"
Comment2 "Luis Ardila"
Comment3 ""
Comment4 ""
$EndDescr
$Comp
L KIT_Power:+1V2_PS_PLL #PWR?
U 1 1 5F84F787
P 10450 6750
F 0 "#PWR?" H 10450 6600 50  0001 C CNN
F 1 "+1V2_PS_PLL" H 10465 6923 50  0000 C CNN
F 2 "" H 10450 6750 50  0001 C CNN
F 3 "" H 10450 6750 50  0001 C CNN
	1    10450 6750
	1    0    0    -1  
$EndComp
$Comp
L KIT_Power:+1V8_STBY #PWR?
U 1 1 5ED1358A
P 10450 5900
F 0 "#PWR?" H 10450 5750 50  0001 C CNN
F 1 "+1V8_STBY" H 10465 6073 50  0000 C CNN
F 2 "" H 10450 5900 50  0001 C CNN
F 3 "" H 10450 5900 50  0001 C CNN
	1    10450 5900
	1    0    0    -1  
$EndComp
$Comp
L KIT_Power:+0.85_STBY #PWR?
U 1 1 5ED27E6C
P 10450 5100
F 0 "#PWR?" H 10450 4950 50  0001 C CNN
F 1 "+0.85_STBY" H 10465 5273 50  0000 C CNN
F 2 "" H 10450 5100 50  0001 C CNN
F 3 "" H 10450 5100 50  0001 C CNN
	1    10450 5100
	1    0    0    -1  
$EndComp
$Comp
L KIT_Power:+3V3_STBY #PWR?
U 1 1 605A4A6E
P 6050 2550
F 0 "#PWR?" H 6050 2400 50  0001 C CNN
F 1 "+3V3_STBY" H 6065 2723 50  0000 C CNN
F 2 "" H 6050 2550 50  0001 C CNN
F 3 "" H 6050 2550 50  0001 C CNN
	1    6050 2550
	1    0    0    -1  
$EndComp
$Comp
L power:GND #PWR?
U 1 1 605E63EE
P 800 3300
F 0 "#PWR?" H 800 3050 50  0001 C CNN
F 1 "GND" H 805 3127 50  0000 C CNN
F 2 "" H 800 3300 50  0001 C CNN
F 3 "" H 800 3300 50  0001 C CNN
	1    800  3300
	1    0    0    -1  
$EndComp
$Comp
L Device:C C214
U 1 1 605E87A4
P 9850 5350
F 0 "C214" H 9965 5441 50  0000 L CNN
F 1 "22uF" H 9965 5350 50  0000 L CNN
F 2 "Capacitor_SMD:C_0603_1608Metric" H 9888 5200 50  0001 C CNN
F 3 "~" H 9850 5350 50  0001 C CNN
F 4 "AVT-IPE" H 9850 5350 50  0001 C CNN "stock"
F 5 "10V" H 9965 5259 50  0000 L CNN "info"
	1    9850 5350
	1    0    0    -1  
$EndComp
$Comp
L Device:C C220
U 1 1 605E4D62
P 10450 7000
F 0 "C220" H 10565 7091 50  0000 L CNN
F 1 "22uF" H 10565 7000 50  0000 L CNN
F 2 "Capacitor_SMD:C_0603_1608Metric" H 10488 6850 50  0001 C CNN
F 3 "~" H 10450 7000 50  0001 C CNN
F 4 "AVT-IPE" H 10450 7000 50  0001 C CNN "stock"
F 5 "10V" H 10565 6909 50  0000 L CNN "info"
	1    10450 7000
	1    0    0    -1  
$EndComp
$Comp
L Device:L L5
U 1 1 5F84F7AF
P 8800 5150
F 0 "L5" V 8990 5150 50  0000 C CNN
F 1 "0.4uH" V 8899 5150 50  0000 C CNN
F 2 "Inductor_SMD:L_Coilcraft_XxL4020" H 8800 5150 50  0001 C CNN
F 3 "https://www.mouser.de/datasheet/2/597/xal4000-270751.pdf" H 8800 5150 50  0001 C CNN
F 4 " 994-XAL4020-401MEC " V 8800 5150 50  0001 C CNN "mouser#"
	1    8800 5150
	0    -1   -1   0   
$EndComp
$Comp
L Device:Net-Tie_2 NT8
U 1 1 6060AB1C
P 8800 5650
F 0 "NT8" H 8800 5739 50  0000 C CNN
F 1 "Net-Tie" H 8800 5740 50  0001 C CNN
F 2 "KIT_NetTie:NetTie-2_SMD_Pad0.3mm" H 8800 5650 50  0001 C CNN
F 3 "~" H 8800 5650 50  0001 C CNN
	1    8800 5650
	-1   0    0    -1  
$EndComp
$Comp
L Device:C C206
U 1 1 6060B797
P 8400 5150
F 0 "C206" V 8148 5150 50  0000 C CNN
F 1 "0.22uF" V 8239 5150 50  0000 C CNN
F 2 "Resistor_SMD:R_0201_0603Metric" H 8438 5000 50  0001 C CNN
F 3 "~" H 8400 5150 50  0001 C CNN
	1    8400 5150
	0    1    1    0   
$EndComp
$Comp
L Device:C C210
U 1 1 6061D354
P 9350 5350
F 0 "C210" H 9465 5441 50  0000 L CNN
F 1 "330uF" H 9465 5350 50  0000 L CNN
F 2 "Capacitor_SMD:C_1210_3225Metric" H 9388 5200 50  0001 C CNN
F 3 "~" H 9350 5350 50  0001 C CNN
F 4 "330µF ±20% 4V Keramikkondensatoren X5R 1210 (3225 metrisch)" H 9350 5350 50  0001 C CNN "info"
	1    9350 5350
	1    0    0    -1  
$EndComp
$Comp
L Device:C C218
U 1 1 606298B7
P 10300 5350
F 0 "C218" H 10415 5441 50  0000 L CNN
F 1 "1uF" H 10415 5350 50  0000 L CNN
F 2 "Capacitor_SMD:C_0402_1005Metric" H 10338 5200 50  0001 C CNN
F 3 "~" H 10300 5350 50  0001 C CNN
F 4 "16 V" H 10415 5259 50  0000 L CNN "info"
F 5 "AVT-IPE" H 10300 5350 50  0001 C CNN "stock"
	1    10300 5350
	1    0    0    -1  
$EndComp
Wire Wire Line
	8150 5150 8250 5150
Wire Wire Line
	10450 5150 10450 5100
Wire Wire Line
	8950 5150 9100 5150
Wire Wire Line
	8550 5150 8600 5150
Wire Wire Line
	8150 5650 8700 5650
Wire Wire Line
	9100 5650 9100 5150
Wire Wire Line
	8900 5650 9100 5650
Connection ~ 9100 5150
Wire Wire Line
	9100 5150 9350 5150
$Comp
L power:GND #PWR?
U 1 1 6063FE1C
P 9350 5600
F 0 "#PWR?" H 9350 5350 50  0001 C CNN
F 1 "GND" H 9355 5427 50  0000 C CNN
F 2 "" H 9350 5600 50  0001 C CNN
F 3 "" H 9350 5600 50  0001 C CNN
	1    9350 5600
	1    0    0    -1  
$EndComp
Wire Wire Line
	9350 5600 9350 5550
Wire Wire Line
	9350 5550 9350 5500
Wire Wire Line
	9850 5500 9850 5550
Connection ~ 9850 5550
Wire Wire Line
	9850 5550 9350 5550
Wire Wire Line
	10300 5500 10300 5550
Wire Wire Line
	10300 5550 9850 5550
Wire Wire Line
	10300 5200 10300 5150
Connection ~ 10300 5150
Wire Wire Line
	10300 5150 10450 5150
Wire Wire Line
	9850 5200 9850 5150
Connection ~ 9850 5150
Wire Wire Line
	9850 5150 10300 5150
Wire Wire Line
	9350 5200 9350 5150
Connection ~ 9350 5150
Wire Wire Line
	9350 5150 9850 5150
Wire Wire Line
	8150 5450 8250 5450
Wire Wire Line
	8600 5550 8600 5150
Connection ~ 8600 5150
Wire Wire Line
	8600 5150 8650 5150
Wire Wire Line
	8150 5250 8250 5250
Wire Wire Line
	8250 5250 8250 5350
Wire Wire Line
	8250 5550 8600 5550
Wire Wire Line
	8150 5350 8250 5350
Connection ~ 8250 5350
Wire Wire Line
	8250 5350 8250 5450
$Comp
L Device:C C215
U 1 1 5F84F7B5
P 9850 6150
F 0 "C215" H 9965 6241 50  0000 L CNN
F 1 "22uF" H 9965 6150 50  0000 L CNN
F 2 "Capacitor_SMD:C_0603_1608Metric" H 9888 6000 50  0001 C CNN
F 3 "~" H 9850 6150 50  0001 C CNN
F 4 "AVT-IPE" H 9850 6150 50  0001 C CNN "stock"
F 5 "10V" H 9965 6059 50  0000 L CNN "info"
	1    9850 6150
	1    0    0    -1  
$EndComp
$Comp
L Device:L L6
U 1 1 5F84F7B6
P 8800 5950
F 0 "L6" V 8990 5950 50  0000 C CNN
F 1 "2.2uH" V 8899 5950 50  0000 C CNN
F 2 "Inductor_SMD:L_Coilcraft_XxL4020" H 8800 5950 50  0001 C CNN
F 3 "https://www.mouser.de/datasheet/2/597/xal4000-270751.pdf" H 8800 5950 50  0001 C CNN
F 4 " 994-XAL4020-222MEC " V 8800 5950 50  0001 C CNN "mouser#"
	1    8800 5950
	0    -1   -1   0   
$EndComp
$Comp
L Device:Net-Tie_2 NT9
U 1 1 5F84F7B7
P 8800 6450
F 0 "NT9" H 8800 6539 50  0000 C CNN
F 1 "Net-Tie" H 8800 6540 50  0001 C CNN
F 2 "KIT_NetTie:NetTie-2_SMD_Pad0.3mm" H 8800 6450 50  0001 C CNN
F 3 "~" H 8800 6450 50  0001 C CNN
	1    8800 6450
	-1   0    0    -1  
$EndComp
$Comp
L Device:C C207
U 1 1 5F84F7B8
P 8400 5950
F 0 "C207" V 8148 5950 50  0000 C CNN
F 1 "0.22uF" V 8239 5950 50  0000 C CNN
F 2 "Resistor_SMD:R_0201_0603Metric" H 8438 5800 50  0001 C CNN
F 3 "~" H 8400 5950 50  0001 C CNN
	1    8400 5950
	0    1    1    0   
$EndComp
$Comp
L Device:C C219
U 1 1 5F84F7B9
P 10300 6150
F 0 "C219" H 10415 6241 50  0000 L CNN
F 1 "1uF" H 10415 6150 50  0000 L CNN
F 2 "Capacitor_SMD:C_0402_1005Metric" H 10338 6000 50  0001 C CNN
F 3 "~" H 10300 6150 50  0001 C CNN
F 4 "16 V" H 10415 6059 50  0000 L CNN "info"
F 5 "AVT-IPE" H 10300 6150 50  0001 C CNN "stock"
	1    10300 6150
	1    0    0    -1  
$EndComp
Wire Wire Line
	8150 5950 8250 5950
Wire Wire Line
	10450 5950 10450 5900
Wire Wire Line
	8950 5950 9100 5950
Wire Wire Line
	8550 5950 8600 5950
Wire Wire Line
	8150 6450 8700 6450
Wire Wire Line
	9100 6450 9100 5950
Wire Wire Line
	8900 6450 9100 6450
Connection ~ 9100 5950
Wire Wire Line
	9100 5950 9350 5950
Wire Wire Line
	9350 6350 9350 6300
Wire Wire Line
	9850 6300 9850 6350
Connection ~ 9850 6350
Wire Wire Line
	9850 6350 9350 6350
Wire Wire Line
	10300 6300 10300 6350
Wire Wire Line
	10300 6350 9850 6350
Wire Wire Line
	10300 6000 10300 5950
Connection ~ 10300 5950
Wire Wire Line
	10300 5950 10450 5950
Wire Wire Line
	9850 6000 9850 5950
Connection ~ 9850 5950
Wire Wire Line
	9850 5950 10300 5950
Wire Wire Line
	9350 6000 9350 5950
Connection ~ 9350 5950
Wire Wire Line
	9350 5950 9850 5950
Wire Wire Line
	8600 6350 8600 5950
Connection ~ 8600 5950
Wire Wire Line
	8600 5950 8650 5950
Wire Wire Line
	8150 6050 8250 6050
Wire Wire Line
	8250 6050 8250 6150
Wire Wire Line
	8250 6350 8600 6350
Wire Wire Line
	8150 6150 8250 6150
Connection ~ 8250 6150
Wire Wire Line
	8250 6150 8250 6250
Connection ~ 9350 5550
$Comp
L power:GND #PWR?
U 1 1 5F84F7BA
P 9350 6400
F 0 "#PWR?" H 9350 6150 50  0001 C CNN
F 1 "GND" H 9355 6227 50  0000 C CNN
F 2 "" H 9350 6400 50  0001 C CNN
F 3 "" H 9350 6400 50  0001 C CNN
	1    9350 6400
	1    0    0    -1  
$EndComp
Wire Wire Line
	9350 6400 9350 6350
Connection ~ 9350 6350
$Comp
L Device:C C213
U 1 1 5F84F7BB
P 9850 4550
F 0 "C213" H 9965 4641 50  0000 L CNN
F 1 "22uF" H 9965 4550 50  0000 L CNN
F 2 "Capacitor_SMD:C_0603_1608Metric" H 9888 4400 50  0001 C CNN
F 3 "~" H 9850 4550 50  0001 C CNN
F 4 "AVT-IPE" H 9850 4550 50  0001 C CNN "stock"
F 5 "10V" H 9965 4459 50  0000 L CNN "info"
	1    9850 4550
	1    0    0    -1  
$EndComp
$Comp
L Device:Net-Tie_2 NT7
U 1 1 606A17DA
P 8800 4750
F 0 "NT7" H 8800 4839 50  0000 C CNN
F 1 "Net-Tie" H 8800 4840 50  0001 C CNN
F 2 "KIT_NetTie:NetTie-2_SMD_Pad0.3mm" H 8800 4750 50  0001 C CNN
F 3 "~" H 8800 4750 50  0001 C CNN
	1    8800 4750
	-1   0    0    -1  
$EndComp
$Comp
L Device:C C205
U 1 1 606A17E0
P 8400 4350
F 0 "C205" V 8148 4350 50  0000 C CNN
F 1 "0.22uF" V 8239 4350 50  0000 C CNN
F 2 "Resistor_SMD:R_0201_0603Metric" H 8438 4200 50  0001 C CNN
F 3 "~" H 8400 4350 50  0001 C CNN
	1    8400 4350
	0    1    1    0   
$EndComp
$Comp
L Device:C C209
U 1 1 606A17E6
P 9350 4550
F 0 "C209" H 9465 4641 50  0000 L CNN
F 1 "100uF" H 9465 4550 50  0000 L CNN
F 2 "Capacitor_SMD:C_1210_3225Metric" H 9388 4400 50  0001 C CNN
F 3 "~" H 9350 4550 50  0001 C CNN
F 4 "10V" H 9350 4550 50  0001 C CNN "info"
F 5 "AVT-IPE" H 9350 4550 50  0001 C CNN "stock"
	1    9350 4550
	1    0    0    -1  
$EndComp
$Comp
L Device:C C217
U 1 1 606A17EE
P 10300 4550
F 0 "C217" H 10415 4641 50  0000 L CNN
F 1 "1uF" H 10415 4550 50  0000 L CNN
F 2 "Capacitor_SMD:C_0402_1005Metric" H 10338 4400 50  0001 C CNN
F 3 "~" H 10300 4550 50  0001 C CNN
F 4 "16 V" H 10415 4459 50  0000 L CNN "info"
F 5 "AVT-IPE" H 10300 4550 50  0001 C CNN "stock"
	1    10300 4550
	1    0    0    -1  
$EndComp
Wire Wire Line
	8150 4350 8250 4350
Wire Wire Line
	10450 4350 10450 4300
Wire Wire Line
	8950 4350 9100 4350
Wire Wire Line
	8550 4350 8600 4350
Wire Wire Line
	8150 4750 8700 4750
Wire Wire Line
	9100 4750 9100 4350
Wire Wire Line
	8900 4750 9100 4750
Connection ~ 9100 4350
Wire Wire Line
	9100 4350 9350 4350
$Comp
L power:GND #PWR?
U 1 1 5F84F7C0
P 9350 4800
F 0 "#PWR?" H 9350 4550 50  0001 C CNN
F 1 "GND" H 9355 4627 50  0000 C CNN
F 2 "" H 9350 4800 50  0001 C CNN
F 3 "" H 9350 4800 50  0001 C CNN
	1    9350 4800
	1    0    0    -1  
$EndComp
Wire Wire Line
	9350 4800 9350 4750
Wire Wire Line
	9350 4750 9350 4700
Wire Wire Line
	9850 4700 9850 4750
Connection ~ 9850 4750
Wire Wire Line
	9850 4750 9350 4750
Wire Wire Line
	10300 4700 10300 4750
Wire Wire Line
	10300 4750 9850 4750
Wire Wire Line
	10300 4400 10300 4350
Connection ~ 10300 4350
Wire Wire Line
	10300 4350 10450 4350
Wire Wire Line
	9850 4400 9850 4350
Connection ~ 9850 4350
Wire Wire Line
	9850 4350 10300 4350
Wire Wire Line
	9350 4400 9350 4350
Connection ~ 9350 4350
Wire Wire Line
	9350 4350 9850 4350
Wire Wire Line
	8150 4650 8250 4650
Wire Wire Line
	8600 4650 8600 4350
Connection ~ 8600 4350
Wire Wire Line
	8600 4350 8650 4350
Connection ~ 8250 4650
Wire Wire Line
	8250 4650 8600 4650
Wire Wire Line
	8150 4550 8250 4550
Wire Wire Line
	8250 4550 8250 4650
Connection ~ 9350 4750
$Comp
L Device:R R126
U 1 1 5F84F773
P 8500 6850
F 0 "R126" H 8430 6804 50  0000 R CNN
F 1 "1.4k" H 8430 6895 50  0000 R CNN
F 2 "Resistor_SMD:R_0402_1005Metric" V 8430 6850 50  0001 C CNN
F 3 "~" H 8500 6850 50  0001 C CNN
	1    8500 6850
	-1   0    0    1   
$EndComp
Wire Wire Line
	8200 6750 8150 6750
Wire Wire Line
	10450 6750 10450 6800
$Comp
L power:GND #PWR?
U 1 1 5EA2AFD6
P 8500 7400
F 0 "#PWR?" H 8500 7150 50  0001 C CNN
F 1 "GND" H 8505 7227 50  0000 C CNN
F 2 "" H 8500 7400 50  0001 C CNN
F 3 "" H 8500 7400 50  0001 C CNN
	1    8500 7400
	1    0    0    -1  
$EndComp
Wire Wire Line
	10450 6850 10450 6800
Wire Wire Line
	10450 6800 9000 6800
Wire Wire Line
	9000 6800 9000 6650
Wire Wire Line
	9000 6650 8500 6650
Connection ~ 10450 6800
Wire Wire Line
	8500 7000 8500 7050
Wire Wire Line
	8200 7050 8200 6750
Wire Wire Line
	8200 7050 8500 7050
Connection ~ 8500 7050
Wire Wire Line
	8500 7050 8500 7100
Wire Wire Line
	8500 6700 8500 6650
Connection ~ 8500 6650
Wire Wire Line
	8500 6650 8150 6650
$Comp
L power:GND #PWR?
U 1 1 5EA957C2
P 10450 7150
F 0 "#PWR?" H 10450 6900 50  0001 C CNN
F 1 "GND" H 10455 6977 50  0000 C CNN
F 2 "" H 10450 7150 50  0001 C CNN
F 3 "" H 10450 7150 50  0001 C CNN
	1    10450 7150
	1    0    0    -1  
$EndComp
$Comp
L Device:R R127
U 1 1 5F84F774
P 8500 7250
F 0 "R127" H 8570 7296 50  0000 L CNN
F 1 "1k" H 8570 7205 50  0000 L CNN
F 2 "Resistor_SMD:R_0402_1005Metric" V 8430 7250 50  0001 C CNN
F 3 "~" H 8500 7250 50  0001 C CNN
F 4 "AVT-IPE" H 8500 7250 50  0001 C CNN "stock"
	1    8500 7250
	1    0    0    -1  
$EndComp
Wire Wire Line
	7150 2750 7150 2650
Wire Wire Line
	7150 2650 7050 2650
Wire Wire Line
	6250 2750 6250 2650
Wire Wire Line
	6550 2750 6550 2650
Connection ~ 6550 2650
Wire Wire Line
	6650 2750 6650 2650
Connection ~ 6650 2650
Wire Wire Line
	6650 2650 6550 2650
Wire Wire Line
	6750 2750 6750 2650
Connection ~ 6750 2650
Wire Wire Line
	6750 2650 6650 2650
Connection ~ 6950 2650
Wire Wire Line
	6950 2650 6750 2650
Wire Wire Line
	7050 2750 7050 2650
Connection ~ 7050 2650
Wire Wire Line
	7050 2650 6950 2650
Wire Wire Line
	6950 2650 6950 2750
Wire Wire Line
	7450 2250 7450 2300
$Comp
L Device:C C190
U 1 1 5E8E3E19
P 950 3050
F 0 "C190" H 1065 3141 50  0000 L CNN
F 1 "100uF" H 1065 3050 50  0000 L CNN
F 2 "Capacitor_SMD:C_1210_3225Metric" H 988 2900 50  0001 C CNN
F 3 "~" H 950 3050 50  0001 C CNN
F 4 "10V" H 1065 2959 50  0000 L CNN "info"
F 5 "AVT-IPE" H 950 3050 50  0001 C CNN "stock"
	1    950  3050
	1    0    0    -1  
$EndComp
$Comp
L Device:C C211
U 1 1 5E8FA525
P 9350 6150
F 0 "C211" H 9465 6241 50  0000 L CNN
F 1 "100uF" H 9465 6150 50  0000 L CNN
F 2 "Capacitor_SMD:C_1210_3225Metric" H 9388 6000 50  0001 C CNN
F 3 "~" H 9350 6150 50  0001 C CNN
F 4 "10V" H 9350 6150 50  0001 C CNN "info"
F 5 "AVT-IPE" H 9350 6150 50  0001 C CNN "stock"
	1    9350 6150
	1    0    0    -1  
$EndComp
$Comp
L Device:C C193
U 1 1 5E906D92
P 1400 3050
F 0 "C193" H 1515 3141 50  0000 L CNN
F 1 "1uF" H 1515 3050 50  0000 L CNN
F 2 "Capacitor_SMD:C_0402_1005Metric" H 1438 2900 50  0001 C CNN
F 3 "~" H 1400 3050 50  0001 C CNN
F 4 "16 V" H 1515 2959 50  0000 L CNN "info"
F 5 "AVT-IPE" H 1400 3050 50  0001 C CNN "stock"
	1    1400 3050
	1    0    0    -1  
$EndComp
$Comp
L KIT_Power:+3V3_STBY #PWR?
U 1 1 5F84F765
P 800 2800
F 0 "#PWR?" H 800 2650 50  0001 C CNN
F 1 "+3V3_STBY" H 815 2973 50  0000 C CNN
F 2 "" H 800 2800 50  0001 C CNN
F 3 "" H 800 2800 50  0001 C CNN
	1    800  2800
	1    0    0    -1  
$EndComp
Wire Wire Line
	800  2800 800  2850
Wire Wire Line
	1400 3200 1400 3250
Wire Wire Line
	1400 3250 950  3250
Wire Wire Line
	950  3200 950  3250
Connection ~ 950  3250
Wire Wire Line
	950  3250 800  3250
Wire Wire Line
	800  3250 800  3300
Wire Wire Line
	1400 2900 1400 2850
Wire Wire Line
	1400 2850 950  2850
Wire Wire Line
	950  2900 950  2850
Connection ~ 950  2850
Wire Wire Line
	950  2850 800  2850
$Comp
L power:GND #PWR?
U 1 1 5F84F766
P 800 4400
F 0 "#PWR?" H 800 4150 50  0001 C CNN
F 1 "GND" H 805 4227 50  0000 C CNN
F 2 "" H 800 4400 50  0001 C CNN
F 3 "" H 800 4400 50  0001 C CNN
	1    800  4400
	1    0    0    -1  
$EndComp
$Comp
L Device:C C194
U 1 1 5F84F768
P 1400 4150
F 0 "C194" H 1515 4241 50  0000 L CNN
F 1 "1uF" H 1515 4150 50  0000 L CNN
F 2 "Capacitor_SMD:C_0402_1005Metric" H 1438 4000 50  0001 C CNN
F 3 "~" H 1400 4150 50  0001 C CNN
F 4 "16 V" H 1515 4059 50  0000 L CNN "info"
F 5 "AVT-IPE" H 1400 4150 50  0001 C CNN "stock"
	1    1400 4150
	1    0    0    -1  
$EndComp
$Comp
L KIT_Power:+3V3_STBY #PWR?
U 1 1 5F84F769
P 800 3900
F 0 "#PWR?" H 800 3750 50  0001 C CNN
F 1 "+3V3_STBY" H 815 4073 50  0000 C CNN
F 2 "" H 800 3900 50  0001 C CNN
F 3 "" H 800 3900 50  0001 C CNN
	1    800  3900
	1    0    0    -1  
$EndComp
Wire Wire Line
	800  3900 800  3950
Wire Wire Line
	1400 4300 1400 4350
Wire Wire Line
	1400 4350 950  4350
Wire Wire Line
	950  4300 950  4350
Connection ~ 950  4350
Wire Wire Line
	950  4350 800  4350
Wire Wire Line
	800  4350 800  4400
Wire Wire Line
	1400 4000 1400 3950
Wire Wire Line
	1400 3950 950  3950
Wire Wire Line
	950  4000 950  3950
Connection ~ 950  3950
Wire Wire Line
	950  3950 800  3950
$Comp
L power:GND #PWR?
U 1 1 5F84F76A
P 800 5550
F 0 "#PWR?" H 800 5300 50  0001 C CNN
F 1 "GND" H 805 5377 50  0000 C CNN
F 2 "" H 800 5550 50  0001 C CNN
F 3 "" H 800 5550 50  0001 C CNN
	1    800  5550
	1    0    0    -1  
$EndComp
$Comp
L Device:C C195
U 1 1 5E9529F4
P 1400 5300
F 0 "C195" H 1515 5391 50  0000 L CNN
F 1 "1uF" H 1515 5300 50  0000 L CNN
F 2 "Capacitor_SMD:C_0402_1005Metric" H 1438 5150 50  0001 C CNN
F 3 "~" H 1400 5300 50  0001 C CNN
F 4 "16 V" H 1515 5209 50  0000 L CNN "info"
F 5 "AVT-IPE" H 1400 5300 50  0001 C CNN "stock"
	1    1400 5300
	1    0    0    -1  
$EndComp
$Comp
L KIT_Power:+3V3_STBY #PWR?
U 1 1 5F84F76C
P 800 5050
F 0 "#PWR?" H 800 4900 50  0001 C CNN
F 1 "+3V3_STBY" H 815 5223 50  0000 C CNN
F 2 "" H 800 5050 50  0001 C CNN
F 3 "" H 800 5050 50  0001 C CNN
	1    800  5050
	1    0    0    -1  
$EndComp
Wire Wire Line
	800  5050 800  5100
Wire Wire Line
	1400 5450 1400 5500
Wire Wire Line
	1400 5500 950  5500
Wire Wire Line
	950  5450 950  5500
Connection ~ 950  5500
Wire Wire Line
	950  5500 800  5500
Wire Wire Line
	800  5500 800  5550
Wire Wire Line
	1400 5150 1400 5100
Wire Wire Line
	1400 5100 950  5100
Wire Wire Line
	950  5150 950  5100
Connection ~ 950  5100
Wire Wire Line
	950  5100 800  5100
$Comp
L Device:C C191
U 1 1 5E94CA54
P 950 4150
F 0 "C191" H 1065 4241 50  0000 L CNN
F 1 "100uF" H 1065 4150 50  0000 L CNN
F 2 "Capacitor_SMD:C_1210_3225Metric" H 988 4000 50  0001 C CNN
F 3 "~" H 950 4150 50  0001 C CNN
F 4 "10V" H 1065 4059 50  0000 L CNN "info"
F 5 "AVT-IPE" H 950 4150 50  0001 C CNN "stock"
	1    950  4150
	1    0    0    -1  
$EndComp
$Comp
L Device:C C192
U 1 1 5E999EB4
P 950 5300
F 0 "C192" H 1065 5391 50  0000 L CNN
F 1 "100uF" H 1065 5300 50  0000 L CNN
F 2 "Capacitor_SMD:C_1210_3225Metric" H 988 5150 50  0001 C CNN
F 3 "~" H 950 5300 50  0001 C CNN
F 4 "10V" H 1065 5209 50  0000 L CNN "info"
F 5 "AVT-IPE" H 950 5300 50  0001 C CNN "stock"
	1    950  5300
	1    0    0    -1  
$EndComp
$Comp
L power:GND #PWR?
U 1 1 5F84F76F
P 7650 2650
F 0 "#PWR?" H 7650 2400 50  0001 C CNN
F 1 "GND" H 7655 2477 50  0000 C CNN
F 2 "" H 7650 2650 50  0001 C CNN
F 3 "" H 7650 2650 50  0001 C CNN
	1    7650 2650
	1    0    0    -1  
$EndComp
Wire Wire Line
	7450 2300 7650 2300
Wire Wire Line
	7650 2300 7650 2350
Connection ~ 7450 2300
Wire Wire Line
	7450 2300 7450 2750
$Comp
L Device:C C203
U 1 1 605E63E8
P 7650 2500
F 0 "C203" H 7765 2591 50  0000 L CNN
F 1 "10uF" H 7765 2500 50  0000 L CNN
F 2 "Capacitor_SMD:C_0603_1608Metric" H 7688 2350 50  0001 C CNN
F 3 "~" H 7650 2500 50  0001 C CNN
F 4 "AVT-IPE" H 7650 2500 50  0001 C CNN "stock"
F 5 "25V" H 7765 2409 50  0000 L CNN "info"
	1    7650 2500
	1    0    0    -1  
$EndComp
$Comp
L Device:C C196
U 1 1 5F84F771
P 1750 9700
F 0 "C196" H 1865 9791 50  0000 L CNN
F 1 "10uF" H 1865 9700 50  0000 L CNN
F 2 "Capacitor_SMD:C_0603_1608Metric" H 1788 9550 50  0001 C CNN
F 3 "~" H 1750 9700 50  0001 C CNN
F 4 "AVT-IPE" H 1750 9700 50  0001 C CNN "stock"
F 5 "25V" H 1865 9609 50  0000 L CNN "info"
	1    1750 9700
	1    0    0    -1  
$EndComp
Wire Wire Line
	2550 9500 2350 9500
Wire Wire Line
	1750 9500 1750 9550
Connection ~ 1750 9500
$Comp
L Device:C C199
U 1 1 5F84F777
P 4150 10000
F 0 "C199" H 4265 10091 50  0000 L CNN
F 1 "10uF" H 4265 10000 50  0000 L CNN
F 2 "Capacitor_SMD:C_0603_1608Metric" H 4188 9850 50  0001 C CNN
F 3 "~" H 4150 10000 50  0001 C CNN
F 4 "AVT-IPE" H 4150 10000 50  0001 C CNN "stock"
F 5 "25V" H 4265 9909 50  0000 L CNN "info"
	1    4150 10000
	1    0    0    -1  
$EndComp
$Comp
L power:GND #PWR?
U 1 1 5F84F778
P 4150 10150
F 0 "#PWR?" H 4150 9900 50  0001 C CNN
F 1 "GND" H 4155 9977 50  0000 C CNN
F 2 "" H 4150 10150 50  0001 C CNN
F 3 "" H 4150 10150 50  0001 C CNN
	1    4150 10150
	1    0    0    -1  
$EndComp
$Comp
L power:GND #PWR?
U 1 1 5F84F779
P 1750 9900
F 0 "#PWR?" H 1750 9650 50  0001 C CNN
F 1 "GND" H 1755 9727 50  0000 C CNN
F 2 "" H 1750 9900 50  0001 C CNN
F 3 "" H 1750 9900 50  0001 C CNN
	1    1750 9900
	1    0    0    -1  
$EndComp
$Comp
L KIT_Power:+3V3_STBY #PWR?
U 1 1 5EB181E5
P 1750 9450
F 0 "#PWR?" H 1750 9300 50  0001 C CNN
F 1 "+3V3_STBY" H 1765 9623 50  0000 C CNN
F 2 "" H 1750 9450 50  0001 C CNN
F 3 "" H 1750 9450 50  0001 C CNN
	1    1750 9450
	1    0    0    -1  
$EndComp
$Comp
L Device:C C200
U 1 1 5EB70845
P 4600 2850
F 0 "C200" H 4715 2941 50  0000 L CNN
F 1 "1uF" H 4715 2850 50  0000 L CNN
F 2 "Capacitor_SMD:C_0402_1005Metric" H 4638 2700 50  0001 C CNN
F 3 "~" H 4600 2850 50  0001 C CNN
F 4 "16 V" H 4715 2759 50  0000 L CNN "info"
F 5 "AVT-IPE" H 4600 2850 50  0001 C CNN "stock"
	1    4600 2850
	1    0    0    -1  
$EndComp
$Comp
L power:GND #PWR?
U 1 1 5F84F780
P 4600 3000
F 0 "#PWR?" H 4600 2750 50  0001 C CNN
F 1 "GND" H 4605 2827 50  0000 C CNN
F 2 "" H 4600 3000 50  0001 C CNN
F 3 "" H 4600 3000 50  0001 C CNN
	1    4600 3000
	1    0    0    -1  
$EndComp
Wire Wire Line
	4600 2700 4600 2650
$Comp
L Device:R R124
U 1 1 5EBAE6DF
P 5100 3250
F 0 "R124" H 5170 3296 50  0000 L CNN
F 1 "2.2" H 5170 3205 50  0000 L CNN
F 2 "Resistor_SMD:R_0402_1005Metric" V 5030 3250 50  0001 C CNN
F 3 "~" H 5100 3250 50  0001 C CNN
	1    5100 3250
	1    0    0    -1  
$EndComp
Wire Wire Line
	5100 3450 5100 3400
Wire Wire Line
	5100 3050 5100 3100
Wire Wire Line
	5100 3050 5100 2650
Wire Wire Line
	4600 2650 5100 2650
Connection ~ 5100 3050
$Comp
L Device:C C202
U 1 1 5EC1EA88
P 5100 3650
F 0 "C202" H 5215 3741 50  0000 L CNN
F 1 "1uF" H 5215 3650 50  0000 L CNN
F 2 "Capacitor_SMD:C_0402_1005Metric" H 5138 3500 50  0001 C CNN
F 3 "~" H 5100 3650 50  0001 C CNN
F 4 "16 V" H 5215 3559 50  0000 L CNN "info"
F 5 "AVT-IPE" H 5100 3650 50  0001 C CNN "stock"
	1    5100 3650
	1    0    0    -1  
$EndComp
$Comp
L power:GND #PWR?
U 1 1 5EC1EA8E
P 5100 3800
F 0 "#PWR?" H 5100 3550 50  0001 C CNN
F 1 "GND" H 5105 3627 50  0000 C CNN
F 2 "" H 5100 3800 50  0001 C CNN
F 3 "" H 5100 3800 50  0001 C CNN
	1    5100 3800
	1    0    0    -1  
$EndComp
Connection ~ 5100 2650
Wire Wire Line
	5100 2650 5850 2650
Wire Wire Line
	5100 3050 5300 3050
Wire Wire Line
	5100 3450 5300 3450
Wire Wire Line
	5100 3500 5100 3450
Connection ~ 5100 3450
$Comp
L Device:C C197
U 1 1 5F84F784
P 3900 4050
F 0 "C197" H 4015 4141 50  0000 L CNN
F 1 "1uF" H 4015 4050 50  0000 L CNN
F 2 "Capacitor_SMD:C_0402_1005Metric" H 3938 3900 50  0001 C CNN
F 3 "~" H 3900 4050 50  0001 C CNN
F 4 "16 V" H 4015 3959 50  0000 L CNN "info"
F 5 "AVT-IPE" H 3900 4050 50  0001 C CNN "stock"
	1    3900 4050
	1    0    0    -1  
$EndComp
$Comp
L power:GND #PWR?
U 1 1 5EC5CB36
P 3900 4200
F 0 "#PWR?" H 3900 3950 50  0001 C CNN
F 1 "GND" H 3905 4027 50  0000 C CNN
F 2 "" H 3900 4200 50  0001 C CNN
F 3 "" H 3900 4200 50  0001 C CNN
	1    3900 4200
	1    0    0    -1  
$EndComp
Wire Wire Line
	3900 3900 3900 3850
$Comp
L Device:R R118
U 1 1 5EC8AC87
P 4550 4550
F 0 "R118" H 4620 4596 50  0000 L CNN
F 1 "10k" H 4620 4505 50  0000 L CNN
F 2 "Resistor_SMD:R_0402_1005Metric" V 4480 4550 50  0001 C CNN
F 3 "~" H 4550 4550 50  0001 C CNN
F 4 "AVT-IPE" H 4550 4550 50  0001 C CNN "stock"
	1    4550 4550
	1    0    0    -1  
$EndComp
Wire Wire Line
	4550 4700 4550 4750
Wire Wire Line
	4550 4750 5200 4750
Wire Wire Line
	5300 4350 5200 4350
Wire Wire Line
	5200 4350 5200 4450
Connection ~ 5200 4750
Wire Wire Line
	5200 4750 5300 4750
Wire Wire Line
	5300 4650 5200 4650
Connection ~ 5200 4650
Wire Wire Line
	5200 4650 5200 4750
Wire Wire Line
	5300 4550 5200 4550
Connection ~ 5200 4550
Wire Wire Line
	5200 4550 5200 4650
Wire Wire Line
	5300 4450 5200 4450
Connection ~ 5200 4450
Wire Wire Line
	5200 4450 5200 4550
$Comp
L KIT_Power:+3V3_STBY #PWR?
U 1 1 5ECAFA47
P 4550 4400
F 0 "#PWR?" H 4550 4250 50  0001 C CNN
F 1 "+3V3_STBY" H 4565 4573 50  0000 C CNN
F 2 "" H 4550 4400 50  0001 C CNN
F 3 "" H 4550 4400 50  0001 C CNN
	1    4550 4400
	1    0    0    -1  
$EndComp
Text Label 5000 4150 0    50   ~ 0
1V8
$Comp
L power:GND #PWR?
U 1 1 5EEDCBAA
P 6850 7250
F 0 "#PWR?" H 6850 7000 50  0001 C CNN
F 1 "GND" H 6855 7077 50  0000 C CNN
F 2 "" H 6850 7250 50  0001 C CNN
F 3 "" H 6850 7250 50  0001 C CNN
	1    6850 7250
	1    0    0    -1  
$EndComp
Wire Wire Line
	6850 7100 6850 7150
$Comp
L Device:Net-Tie_2 NT5
U 1 1 5EEF2A77
P 6650 7150
F 0 "NT5" H 6650 7061 50  0000 C CNN
F 1 "Net-Tie" H 6650 7240 50  0001 C CNN
F 2 "KIT_NetTie:NetTie-2_SMD_Pad0.2mm" H 6650 7150 50  0001 C CNN
F 3 "~" H 6650 7150 50  0001 C CNN
	1    6650 7150
	1    0    0    -1  
$EndComp
Wire Wire Line
	6750 7150 6850 7150
Connection ~ 6850 7150
Wire Wire Line
	6850 7150 6850 7250
Wire Wire Line
	6450 7100 6450 7150
Wire Wire Line
	6450 7150 6550 7150
$Comp
L KIT_Power:+3V3_STBY #PWR?
U 1 1 5EF59E99
P 4500 6400
F 0 "#PWR?" H 4500 6250 50  0001 C CNN
F 1 "+3V3_STBY" H 4515 6573 50  0000 C CNN
F 2 "" H 4500 6400 50  0001 C CNN
F 3 "" H 4500 6400 50  0001 C CNN
	1    4500 6400
	1    0    0    -1  
$EndComp
$Comp
L Device:R R125
U 1 1 5F84F794
P 5150 6650
F 0 "R125" H 5080 6604 50  0000 R CNN
F 1 "10k" H 5080 6695 50  0000 R CNN
F 2 "Resistor_SMD:R_0402_1005Metric" V 5080 6650 50  0001 C CNN
F 3 "~" H 5150 6650 50  0001 C CNN
F 4 "AVT-IPE" H 5150 6650 50  0001 C CNN "stock"
	1    5150 6650
	-1   0    0    1   
$EndComp
$Comp
L Device:C C201
U 1 1 5EFBD435
P 4750 6650
F 0 "C201" H 4865 6696 50  0000 L CNN
F 1 "10nF" H 4865 6605 50  0000 L CNN
F 2 "Capacitor_SMD:C_0402_1005Metric" H 4788 6500 50  0001 C CNN
F 3 "~" H 4750 6650 50  0001 C CNN
F 4 "AVT-IPE" H 4750 6650 50  0001 C CNN "stock"
	1    4750 6650
	1    0    0    -1  
$EndComp
Wire Wire Line
	4750 6500 4750 6450
Wire Wire Line
	4750 6450 5150 6450
Wire Wire Line
	5150 6500 5150 6450
Connection ~ 5150 6450
Wire Wire Line
	5150 6450 5300 6450
Wire Wire Line
	5150 6800 5150 7150
Wire Wire Line
	5150 7150 4750 7150
Wire Wire Line
	4750 7150 4750 6800
Connection ~ 6450 7150
Connection ~ 5150 7150
$Comp
L Device:R R117
U 1 1 5F064F46
P 4300 6650
F 0 "R117" H 4230 6604 50  0000 R CNN
F 1 "10k" H 4230 6695 50  0000 R CNN
F 2 "Resistor_SMD:R_0402_1005Metric" V 4230 6650 50  0001 C CNN
F 3 "~" H 4300 6650 50  0001 C CNN
F 4 "AVT-IPE" H 4300 6650 50  0001 C CNN "stock"
	1    4300 6650
	-1   0    0    1   
$EndComp
$Comp
L Device:C C198
U 1 1 5F84F797
P 3900 6650
F 0 "C198" H 4015 6696 50  0000 L CNN
F 1 "10nF" H 4015 6605 50  0000 L CNN
F 2 "Capacitor_SMD:C_0402_1005Metric" H 3938 6500 50  0001 C CNN
F 3 "~" H 3900 6650 50  0001 C CNN
F 4 "AVT-IPE" H 3900 6650 50  0001 C CNN "stock"
	1    3900 6650
	1    0    0    -1  
$EndComp
Wire Wire Line
	5300 6150 4300 6150
Wire Wire Line
	4300 6150 4300 6500
Wire Wire Line
	4300 6150 3900 6150
Wire Wire Line
	3900 6150 3900 6500
Connection ~ 4300 6150
Wire Wire Line
	3900 6800 3900 7150
Wire Wire Line
	3900 7150 4300 7150
Connection ~ 4750 7150
Wire Wire Line
	4300 6800 4300 7150
Connection ~ 4300 7150
Wire Wire Line
	4300 7150 4750 7150
Text Notes 4150 7700 0    50   ~ 0
ADDR_PROT\n10k ==> +13  I2C Address Offset\n           7 BIT I2C ADDR = 0x1D\n           7 BIT PMBUS = 0x4D\nMTP Resistor\n10k ==> +13 MTP segment selected
$Comp
L power:GND #PWR?
U 1 1 5F84F798
P 5300 6250
F 0 "#PWR?" H 5300 6000 50  0001 C CNN
F 1 "GND" V 5305 6122 50  0000 R CNN
F 2 "" H 5300 6250 50  0001 C CNN
F 3 "" H 5300 6250 50  0001 C CNN
	1    5300 6250
	0    1    1    0   
$EndComp
Wire Wire Line
	4600 6350 4600 6450
Wire Wire Line
	4600 6450 4500 6450
Wire Wire Line
	4500 6450 4500 6400
Wire Wire Line
	4600 6350 5300 6350
$Comp
L Device:C C212
U 1 1 5F17B640
P 9850 3450
F 0 "C212" H 9965 3541 50  0000 L CNN
F 1 "22uF" H 9965 3450 50  0000 L CNN
F 2 "Capacitor_SMD:C_0603_1608Metric" H 9888 3300 50  0001 C CNN
F 3 "~" H 9850 3450 50  0001 C CNN
F 4 "AVT-IPE" H 9850 3450 50  0001 C CNN "stock"
F 5 "10V" H 9965 3359 50  0000 L CNN "info"
	1    9850 3450
	1    0    0    -1  
$EndComp
$Comp
L Device:Net-Tie_2 NT6
U 1 1 5F17B64C
P 8950 3850
F 0 "NT6" H 8950 3939 50  0000 C CNN
F 1 "Net-Tie" H 8950 3940 50  0001 C CNN
F 2 "KIT_NetTie:NetTie-2_SMD_Pad0.3mm" H 8950 3850 50  0001 C CNN
F 3 "~" H 8950 3850 50  0001 C CNN
	1    8950 3850
	-1   0    0    -1  
$EndComp
$Comp
L Device:C C204
U 1 1 5F84F79C
P 8400 3250
F 0 "C204" V 8148 3250 50  0000 C CNN
F 1 "0.22uF" V 8239 3250 50  0000 C CNN
F 2 "Resistor_SMD:R_0201_0603Metric" H 8438 3100 50  0001 C CNN
F 3 "~" H 8400 3250 50  0001 C CNN
	1    8400 3250
	0    1    1    0   
$EndComp
$Comp
L Device:C C208
U 1 1 5F84F79D
P 9350 3450
F 0 "C208" H 9465 3541 50  0000 L CNN
F 1 "100uF" H 9465 3450 50  0000 L CNN
F 2 "Capacitor_SMD:C_1210_3225Metric" H 9388 3300 50  0001 C CNN
F 3 "~" H 9350 3450 50  0001 C CNN
F 4 "10V" H 9350 3450 50  0001 C CNN "info"
F 5 "AVT-IPE" H 9350 3450 50  0001 C CNN "stock"
	1    9350 3450
	1    0    0    -1  
$EndComp
$Comp
L Device:C C216
U 1 1 5F17B660
P 10300 3450
F 0 "C216" H 10415 3541 50  0000 L CNN
F 1 "1uF" H 10415 3450 50  0000 L CNN
F 2 "Capacitor_SMD:C_0402_1005Metric" H 10338 3300 50  0001 C CNN
F 3 "~" H 10300 3450 50  0001 C CNN
F 4 "16 V" H 10415 3359 50  0000 L CNN "info"
F 5 "AVT-IPE" H 10300 3450 50  0001 C CNN "stock"
	1    10300 3450
	1    0    0    -1  
$EndComp
Wire Wire Line
	8150 3250 8250 3250
Wire Wire Line
	10450 3250 10450 3200
Wire Wire Line
	8950 3250 9100 3250
Wire Wire Line
	8550 3250 8600 3250
Wire Wire Line
	8150 3850 8850 3850
Wire Wire Line
	9100 3850 9100 3250
Wire Wire Line
	9050 3850 9100 3850
Connection ~ 9100 3250
Wire Wire Line
	9100 3250 9350 3250
$Comp
L power:GND #PWR?
U 1 1 5F84F79F
P 10450 3700
F 0 "#PWR?" H 10450 3450 50  0001 C CNN
F 1 "GND" H 10455 3527 50  0000 C CNN
F 2 "" H 10450 3700 50  0001 C CNN
F 3 "" H 10450 3700 50  0001 C CNN
	1    10450 3700
	1    0    0    -1  
$EndComp
Wire Wire Line
	10450 3700 10450 3650
Wire Wire Line
	9350 3650 9350 3600
Wire Wire Line
	9850 3600 9850 3650
Connection ~ 9850 3650
Wire Wire Line
	9850 3650 9350 3650
Wire Wire Line
	10300 3600 10300 3650
Wire Wire Line
	10300 3650 9850 3650
Wire Wire Line
	10300 3300 10300 3250
Connection ~ 10300 3250
Wire Wire Line
	10300 3250 10450 3250
Wire Wire Line
	9850 3300 9850 3250
Connection ~ 9850 3250
Wire Wire Line
	9850 3250 10300 3250
Wire Wire Line
	9350 3300 9350 3250
Connection ~ 9350 3250
Wire Wire Line
	9350 3250 9850 3250
Wire Wire Line
	8150 3550 8250 3550
Wire Wire Line
	8600 3550 8600 3250
Connection ~ 8600 3250
Wire Wire Line
	8600 3250 8650 3250
Connection ~ 8250 3550
Wire Wire Line
	8250 3550 8600 3550
Wire Wire Line
	8250 3450 8250 3550
$Comp
L Device:L L4
U 1 1 5F84F7A0
P 8800 4350
F 0 "L4" V 8990 4350 50  0000 C CNN
F 1 "2.2uH" V 8899 4350 50  0000 C CNN
F 2 "Inductor_SMD:L_Coilcraft_XxL4020" H 8800 4350 50  0001 C CNN
F 3 "https://www.mouser.de/datasheet/2/597/xal4000-270751.pdf" H 8800 4350 50  0001 C CNN
F 4 " 994-XAL4020-222MEC " V 8800 4350 50  0001 C CNN "mouser#"
	1    8800 4350
	0    -1   -1   0   
$EndComp
NoConn ~ 8150 3150
Wire Wire Line
	10450 3650 10300 3650
Connection ~ 10300 3650
Wire Wire Line
	9350 3650 9350 3950
Wire Wire Line
	9350 3950 9050 3950
Connection ~ 9350 3650
$Comp
L Device:Net-Tie_2 NT10
U 1 1 5F84F7A1
P 8950 3950
F 0 "NT10" H 8950 3861 50  0000 C CNN
F 1 "Net-Tie" H 8950 4100 50  0001 C CNN
F 2 "KIT_NetTie:NetTie-2_SMD_Pad0.3mm" H 8950 3950 50  0001 C CNN
F 3 "~" H 8950 3950 50  0001 C CNN
	1    8950 3950
	1    0    0    -1  
$EndComp
Wire Wire Line
	8850 3950 8150 3950
Text Notes 8300 3950 0    50   ~ 0
ROUTE DIFFERENTIALLY
$Comp
L power:GND #PWR?
U 1 1 5F84F7A2
P 8300 3650
F 0 "#PWR?" H 8300 3400 50  0001 C CNN
F 1 "GND" V 8305 3522 50  0000 R CNN
F 2 "" H 8300 3650 50  0001 C CNN
F 3 "" H 8300 3650 50  0001 C CNN
	1    8300 3650
	0    -1   -1   0   
$EndComp
Wire Wire Line
	8300 3650 8250 3650
Wire Wire Line
	8150 3750 8250 3750
Wire Wire Line
	8250 3750 8250 3650
Connection ~ 8250 3650
Wire Wire Line
	8250 3650 8150 3650
Wire Wire Line
	3900 3850 4850 3850
Wire Wire Line
	4850 3850 4850 4150
Wire Wire Line
	4850 4150 5300 4150
Text Label 8350 3550 0    20   ~ 0
SWA
Text Label 8350 4650 0    20   ~ 0
SWB
Text Label 8350 5550 0    20   ~ 0
SWC
Text Label 8350 6350 0    20   ~ 0
SWD
Text Label 8250 7050 0    20   ~ 0
FB_L
Text Label 8350 6450 0    20   ~ 0
FB_D
Text Label 8350 5650 0    20   ~ 0
FB_C
Text Label 8350 4750 0    20   ~ 0
FB_B
Text Label 8200 3950 0    20   ~ 0
FB_A_N
Text Label 8200 4350 0    20   ~ 0
BOOT_B
Text Label 8200 5150 0    20   ~ 0
BOOT_C
Text Label 8200 5950 0    20   ~ 0
BOOT_D
Text Label 8200 3250 0    20   ~ 0
BOOT_A
Text Label 5650 7150 0    20   ~ 0
AGND
Text Label 4900 6150 0    20   ~ 0
ADDR_PROT
Text Label 4900 6450 0    20   ~ 0
MTP
Text Label 5200 3450 0    20   ~ 0
VDRV
Text Label 4750 4750 0    50   ~ 0
EN_ALL
$Comp
L power:GND #PWR?
U 1 1 5F84F7A3
P 800 2250
F 0 "#PWR?" H 800 2000 50  0001 C CNN
F 1 "GND" H 805 2077 50  0000 C CNN
F 2 "" H 800 2250 50  0001 C CNN
F 3 "" H 800 2250 50  0001 C CNN
	1    800  2250
	1    0    0    -1  
$EndComp
$Comp
L Device:C C221
U 1 1 5F84F7A4
P 950 2000
F 0 "C221" H 1065 2091 50  0000 L CNN
F 1 "100uF" H 1065 2000 50  0000 L CNN
F 2 "Capacitor_SMD:C_1210_3225Metric" H 988 1850 50  0001 C CNN
F 3 "~" H 950 2000 50  0001 C CNN
F 4 "10V" H 1065 1909 50  0000 L CNN "info"
F 5 "AVT-IPE" H 950 2000 50  0001 C CNN "stock"
	1    950  2000
	1    0    0    -1  
$EndComp
$Comp
L Device:C C222
U 1 1 5F64F6B2
P 1400 2000
F 0 "C222" H 1515 2091 50  0000 L CNN
F 1 "1uF" H 1515 2000 50  0000 L CNN
F 2 "Capacitor_SMD:C_0402_1005Metric" H 1438 1850 50  0001 C CNN
F 3 "~" H 1400 2000 50  0001 C CNN
F 4 "16 V" H 1515 1909 50  0000 L CNN "info"
F 5 "AVT-IPE" H 1400 2000 50  0001 C CNN "stock"
	1    1400 2000
	1    0    0    -1  
$EndComp
$Comp
L KIT_Power:+3V3_STBY #PWR?
U 1 1 5F64F6B8
P 800 1750
F 0 "#PWR?" H 800 1600 50  0001 C CNN
F 1 "+3V3_STBY" H 815 1923 50  0000 C CNN
F 2 "" H 800 1750 50  0001 C CNN
F 3 "" H 800 1750 50  0001 C CNN
	1    800  1750
	1    0    0    -1  
$EndComp
Wire Wire Line
	800  1750 800  1800
Wire Wire Line
	1400 2150 1400 2200
Wire Wire Line
	1400 2200 950  2200
Wire Wire Line
	950  2150 950  2200
Connection ~ 950  2200
Wire Wire Line
	950  2200 800  2200
Wire Wire Line
	800  2200 800  2250
Wire Wire Line
	1400 1850 1400 1800
Wire Wire Line
	1400 1800 950  1800
Wire Wire Line
	950  1850 950  1800
Connection ~ 950  1800
Wire Wire Line
	950  1800 800  1800
$Comp
L KIT_Power:+5V_STBY #PWR?
U 1 1 602A171F
P 4600 9750
F 0 "#PWR?" H 4600 9600 50  0001 C CNN
F 1 "+5V_STBY" H 4615 9923 50  0000 C CNN
F 2 "" H 4600 9750 50  0001 C CNN
F 3 "" H 4600 9750 50  0001 C CNN
	1    4600 9750
	1    0    0    -1  
$EndComp
Wire Wire Line
	4600 9750 4600 9800
Wire Wire Line
	4600 9800 4150 9800
$Comp
L KIT_Power:+1V2_STBY #PWR?
U 1 1 5EB6C147
P 10450 4300
F 0 "#PWR?" H 10450 4150 50  0001 C CNN
F 1 "+1V2_STBY" H 10465 4473 50  0000 C CNN
F 2 "" H 10450 4300 50  0001 C CNN
F 3 "" H 10450 4300 50  0001 C CNN
	1    10450 4300
	1    0    0    -1  
$EndComp
$Comp
L KIT_Power:+2V5_STBY #PWR?
U 1 1 60579551
P 10450 3200
F 0 "#PWR?" H 10450 3050 50  0001 C CNN
F 1 "+2V5_STBY" H 10465 3373 50  0000 C CNN
F 2 "" H 10450 3200 50  0001 C CNN
F 3 "" H 10450 3200 50  0001 C CNN
	1    10450 3200
	1    0    0    -1  
$EndComp
$Comp
L Device:L L3
U 1 1 5EAE3FED
P 8800 3250
F 0 "L3" V 8990 3250 50  0000 C CNN
F 1 "2.2uH" V 8899 3250 50  0000 C CNN
F 2 "Inductor_SMD:L_Coilcraft_XxL4020" H 8800 3250 50  0001 C CNN
F 3 "https://www.mouser.de/datasheet/2/597/xal4000-270751.pdf" H 8800 3250 50  0001 C CNN
F 4 " 994-XAL4020-222MEC " V 8800 3250 50  0001 C CNN "mouser#"
	1    8800 3250
	0    -1   -1   0   
$EndComp
$Comp
L KIT_Regulator_Linear:TPS51206DSQR U39
U 1 1 5EE1057D
P 7550 9550
F 0 "U39" H 8300 9950 60  0000 C CNN
F 1 "TPS51206DSQR" H 8300 9850 60  0000 C CNN
F 2 "KIT_Package_SON:WSON-10-1EP_2x2mm_P0.4mm_EP1x1.5mm" H 8550 9890 60  0001 C CNN
F 3 "http://www.ti.com/lit/ds/symlink/tps51206.pdf" H 7550 9550 60  0001 C CNN
F 4 "Texas Instruments" H 7550 9550 50  0001 C CNN "manf"
F 5 "TPS51206DSQR" H 7550 9550 50  0001 C CNN "manf#"
F 6 "296-28767-1-ND" H 7550 9550 50  0001 C CNN "digikey#"
	1    7550 9550
	1    0    0    -1  
$EndComp
$Comp
L KIT_Power:+DDR_VREFA #PWR?
U 1 1 5EE10583
P 9450 10000
F 0 "#PWR?" H 9450 9850 50  0001 C CNN
F 1 "+DDR_VREFA" H 9465 10173 50  0000 C CNN
F 2 "" H 9450 10000 50  0001 C CNN
F 3 "" H 9450 10000 50  0001 C CNN
	1    9450 10000
	1    0    0    -1  
$EndComp
$Comp
L KIT_Power:+DDR_VTT #PWR?
U 1 1 5EE10589
P 10150 9400
F 0 "#PWR?" H 10150 9250 50  0001 C CNN
F 1 "+DDR_VTT" H 10165 9573 50  0000 C CNN
F 2 "" H 10150 9400 50  0001 C CNN
F 3 "" H 10150 9400 50  0001 C CNN
	1    10150 9400
	1    0    0    -1  
$EndComp
$Comp
L Device:Net-Tie_2 NT4
U 1 1 5EE1058F
P 9600 9700
F 0 "NT4" H 9600 9789 50  0000 C CNN
F 1 "Net-Tie" H 9600 9800 50  0001 C CNN
F 2 "KIT_NetTie:NetTie-2_SMD_Pad0.2mm" H 9600 9700 50  0001 C CNN
F 3 "~" H 9600 9700 50  0001 C CNN
	1    9600 9700
	1    0    0    -1  
$EndComp
Wire Wire Line
	10150 9450 10150 9400
$Comp
L Device:C C189
U 1 1 5EE10598
P 10150 9650
F 0 "C189" H 10265 9741 50  0000 L CNN
F 1 "10uF" H 10265 9650 50  0000 L CNN
F 2 "Capacitor_SMD:C_0603_1608Metric" H 10188 9500 50  0001 C CNN
F 3 "~" H 10150 9650 50  0001 C CNN
F 4 "AVT-IPE" H 10150 9650 50  0001 C CNN "stock"
F 5 "25V" H 10265 9559 50  0000 L CNN "info"
	1    10150 9650
	1    0    0    -1  
$EndComp
Wire Wire Line
	10150 9500 10150 9450
Connection ~ 10150 9450
Wire Wire Line
	9050 9700 9500 9700
Wire Wire Line
	9050 9450 9800 9450
Wire Wire Line
	9800 9700 9800 9450
Wire Wire Line
	9700 9700 9800 9700
Connection ~ 9800 9450
Wire Wire Line
	9800 9450 10150 9450
$Comp
L power:GND #PWR?
U 1 1 5EE105A6
P 10150 9800
F 0 "#PWR?" H 10150 9550 50  0001 C CNN
F 1 "GND" H 10155 9627 50  0000 C CNN
F 2 "" H 10150 9800 50  0001 C CNN
F 3 "" H 10150 9800 50  0001 C CNN
	1    10150 9800
	1    0    0    -1  
$EndComp
$Comp
L Device:C C186
U 1 1 5EE105AE
P 9450 10250
F 0 "C186" H 9565 10341 50  0000 L CNN
F 1 "10uF" H 9565 10250 50  0000 L CNN
F 2 "Capacitor_SMD:C_0603_1608Metric" H 9488 10100 50  0001 C CNN
F 3 "~" H 9450 10250 50  0001 C CNN
F 4 "AVT-IPE" H 9450 10250 50  0001 C CNN "stock"
F 5 "25V" H 9565 10159 50  0000 L CNN "info"
	1    9450 10250
	1    0    0    -1  
$EndComp
$Comp
L power:GND #PWR?
U 1 1 5EE105B4
P 9450 10400
F 0 "#PWR?" H 9450 10150 50  0001 C CNN
F 1 "GND" H 9455 10227 50  0000 C CNN
F 2 "" H 9450 10400 50  0001 C CNN
F 3 "" H 9450 10400 50  0001 C CNN
	1    9450 10400
	1    0    0    -1  
$EndComp
Wire Wire Line
	9450 10100 9450 10050
Wire Wire Line
	9450 10050 9050 10050
Wire Wire Line
	9450 10000 9450 10050
Connection ~ 9450 10050
$Comp
L power:GND #PWR?
U 1 1 5EE105BE
P 8200 10650
F 0 "#PWR?" H 8200 10400 50  0001 C CNN
F 1 "GND" H 8205 10477 50  0000 C CNN
F 2 "" H 8200 10650 50  0001 C CNN
F 3 "" H 8200 10650 50  0001 C CNN
	1    8200 10650
	1    0    0    -1  
$EndComp
Wire Wire Line
	8200 10650 8200 10600
Wire Wire Line
	8200 10600 8100 10600
Wire Wire Line
	8100 10600 8100 10550
Wire Wire Line
	8200 10550 8200 10600
Connection ~ 8200 10600
Wire Wire Line
	8200 10600 8300 10600
Wire Wire Line
	8300 10600 8300 10550
Wire Wire Line
	7400 9450 7550 9450
$Comp
L KIT_Power:+1V2_STBY #PWR?
U 1 1 5EE105D3
P 6500 9500
F 0 "#PWR?" H 6500 9350 50  0001 C CNN
F 1 "+1V2_STBY" H 6515 9673 50  0000 C CNN
F 2 "" H 6500 9500 50  0001 C CNN
F 3 "" H 6500 9500 50  0001 C CNN
	1    6500 9500
	1    0    0    -1  
$EndComp
Wire Wire Line
	6500 9500 6500 9700
Wire Wire Line
	7550 10000 7350 10000
Wire Wire Line
	7350 10000 7350 10100
Connection ~ 7350 10100
Wire Wire Line
	7350 10100 7550 10100
Wire Wire Line
	7000 10100 7350 10100
Wire Wire Line
	6500 9700 7350 9700
$Comp
L KIT_Power:+5V_STBY #PWR?
U 1 1 5FC46A8A
P 4600 2600
F 0 "#PWR?" H 4600 2450 50  0001 C CNN
F 1 "+5V_STBY" H 4615 2773 50  0000 C CNN
F 2 "" H 4600 2600 50  0001 C CNN
F 3 "" H 4600 2600 50  0001 C CNN
	1    4600 2600
	1    0    0    -1  
$EndComp
Wire Wire Line
	4600 2600 4600 2650
Connection ~ 4600 2650
$Comp
L KIT_Regulator_Switching:TPS61232DRCT U5
U 1 1 5FCAAF34
P 3050 9850
F 0 "U5" H 3050 10465 50  0000 C CNN
F 1 "TPS61232DRCT" H 3050 10374 50  0000 C CNN
F 2 "KIT_Package_SON:TPS61232DRCT_VSON-10-1EP_3x3mm_P0.5mm_EP1.65x2.4mm_ThermalVias" H 3050 10440 50  0001 C CNN
F 3 "http://www.ti.com/lit/ds/symlink/tps61232.pdf" H 3050 10381 60  0001 C CNN
F 4 " 296-44498-1-ND " H 3050 9850 50  0001 C CNN "digikey#"
	1    3050 9850
	1    0    0    -1  
$EndComp
$Comp
L Device:L L2
U 1 1 5FD17CF4
P 3050 9100
F 0 "L2" V 3240 9100 50  0000 C CNN
F 1 "0.4uH" V 3149 9100 50  0000 C CNN
F 2 "Inductor_SMD:L_Coilcraft_XxL4020" H 3050 9100 50  0001 C CNN
F 3 "https://www.mouser.de/datasheet/2/597/xal4000-270751.pdf" H 3050 9100 50  0001 C CNN
F 4 " 994-XAL4020-401MEC " V 3050 9100 50  0001 C CNN "mouser#"
	1    3050 9100
	0    -1   -1   0   
$EndComp
Wire Wire Line
	1750 9450 1750 9500
Wire Wire Line
	2550 9600 2350 9600
Wire Wire Line
	2350 9600 2350 9500
Connection ~ 2350 9500
Wire Wire Line
	2350 9500 1750 9500
Wire Wire Line
	4150 9850 4150 9800
Wire Wire Line
	3550 9800 3850 9800
Connection ~ 4150 9800
Wire Wire Line
	3550 9900 3850 9900
Wire Wire Line
	3850 9900 3850 9800
Connection ~ 3850 9800
Wire Wire Line
	3850 9800 4150 9800
Wire Wire Line
	3550 9600 3750 9600
Wire Wire Line
	3750 9600 3750 9500
Wire Wire Line
	3750 9100 3200 9100
Wire Wire Line
	3550 9500 3750 9500
Connection ~ 3750 9500
Wire Wire Line
	3750 9500 3750 9100
Wire Wire Line
	2900 9100 2350 9100
Wire Wire Line
	2350 9100 2350 9500
Wire Wire Line
	3850 10100 3850 9900
Connection ~ 3850 9900
$Comp
L Device:C C129
U 1 1 5FED51AB
P 2200 10100
F 0 "C129" H 2315 10146 50  0000 L CNN
F 1 "10nF" H 2315 10055 50  0000 L CNN
F 2 "Capacitor_SMD:C_0402_1005Metric" H 2238 9950 50  0001 C CNN
F 3 "~" H 2200 10100 50  0001 C CNN
F 4 "AVT-IPE" H 2200 10100 50  0001 C CNN "stock"
	1    2200 10100
	1    0    0    -1  
$EndComp
Wire Wire Line
	2550 10300 2200 10300
Wire Wire Line
	2200 10300 2200 10250
Wire Wire Line
	2550 9900 2200 9900
Wire Wire Line
	2200 9900 2200 9950
NoConn ~ 2550 9800
NoConn ~ 3550 10300
$Comp
L power:GND #PWR?
U 1 1 5FF50AB8
P 2200 10350
F 0 "#PWR?" H 2200 10100 50  0001 C CNN
F 1 "GND" H 2205 10177 50  0000 C CNN
F 2 "" H 2200 10350 50  0001 C CNN
F 3 "" H 2200 10350 50  0001 C CNN
	1    2200 10350
	1    0    0    -1  
$EndComp
Wire Wire Line
	2200 10350 2200 10300
Connection ~ 2200 10300
Wire Wire Line
	1750 9900 1750 9850
Text Label 3250 9100 0    50   ~ 0
SW_5V_STBY
Text Label 8200 3850 0    20   ~ 0
FB_A_P
$Comp
L Device:C C149
U 1 1 5EBED566
P 7050 9300
F 0 "C149" H 7165 9391 50  0000 L CNN
F 1 "1uF" H 7165 9300 50  0000 L CNN
F 2 "Capacitor_SMD:C_0402_1005Metric" H 7088 9150 50  0001 C CNN
F 3 "~" H 7050 9300 50  0001 C CNN
F 4 "16 V" H 7165 9209 50  0000 L CNN "info"
F 5 "AVT-IPE" H 7050 9300 50  0001 C CNN "stock"
	1    7050 9300
	1    0    0    -1  
$EndComp
$Comp
L power:GND #PWR?
U 1 1 5EBED56C
P 7050 9450
F 0 "#PWR?" H 7050 9200 50  0001 C CNN
F 1 "GND" H 7055 9277 50  0000 C CNN
F 2 "" H 7050 9450 50  0001 C CNN
F 3 "" H 7050 9450 50  0001 C CNN
	1    7050 9450
	1    0    0    -1  
$EndComp
$Comp
L KIT_Power:+3V3_STBY #PWR?
U 1 1 5EC0A691
P 7050 9050
F 0 "#PWR?" H 7050 8900 50  0001 C CNN
F 1 "+3V3_STBY" H 7065 9223 50  0000 C CNN
F 2 "" H 7050 9050 50  0001 C CNN
F 3 "" H 7050 9050 50  0001 C CNN
	1    7050 9050
	1    0    0    -1  
$EndComp
Wire Wire Line
	7400 9100 7050 9100
Wire Wire Line
	7050 9100 7050 9050
Wire Wire Line
	7400 9100 7400 9450
Wire Wire Line
	7050 9150 7050 9100
Connection ~ 7050 9100
Wire Wire Line
	4950 5750 5300 5750
Wire Wire Line
	5300 5850 4950 5850
Wire Wire Line
	4950 5950 5300 5950
$Comp
L Device:C C150
U 1 1 5F258FFD
P 3400 5750
F 0 "C150" H 3515 5841 50  0000 L CNN
F 1 "1uF" H 3515 5750 50  0000 L CNN
F 2 "Capacitor_SMD:C_0402_1005Metric" H 3438 5600 50  0001 C CNN
F 3 "~" H 3400 5750 50  0001 C CNN
F 4 "16 V" H 3515 5659 50  0000 L CNN "info"
F 5 "AVT-IPE" H 3400 5750 50  0001 C CNN "stock"
	1    3400 5750
	1    0    0    -1  
$EndComp
$Comp
L power:GND #PWR?
U 1 1 5F259003
P 3400 5900
F 0 "#PWR?" H 3400 5650 50  0001 C CNN
F 1 "GND" H 3405 5727 50  0000 C CNN
F 2 "" H 3400 5900 50  0001 C CNN
F 3 "" H 3400 5900 50  0001 C CNN
	1    3400 5900
	1    0    0    -1  
$EndComp
Wire Wire Line
	3400 5600 3400 5550
Wire Wire Line
	3400 5500 3400 5550
Connection ~ 3400 5550
Wire Wire Line
	3400 5550 5300 5550
$Comp
L KIT_Power:+3V3_STBY #PWR?
U 1 1 5F2981DA
P 3400 5500
F 0 "#PWR?" H 3400 5350 50  0001 C CNN
F 1 "+3V3_STBY" H 3415 5673 50  0000 C CNN
F 2 "" H 3400 5500 50  0001 C CNN
F 3 "" H 3400 5500 50  0001 C CNN
	1    3400 5500
	1    0    0    -1  
$EndComp
Text Label 7000 10100 0    50   ~ 0
PG_B
Text Notes 11850 9800 0    100  ~ 0
+3V3_STBY <= VDDO+VDDA_Si5395@ 0.433A\n               IRPS5401MTRPBF @ 2.25A (70% eff)\n\n              @ 2.68A (7.43W)\n\n3) +2V5_STBY <= VPP_DDR4x2 @ 0.060A\n\n3) +1V2_STBY <= VCCO_PSDDR_504 @ 0.354A\n                 VDD_DDR4x2 @ 0.660A\n                 ETH_PHY  @ 0.221A\n\n                 @ 1.235A\n\n1) +0.85V_STBY <=  VCCINT_IO @ 0.058A\n                   VCCRAM @ 0.011A\n                   VCC_PSINTFP @ 1.062A\n                   VCC_PSINTLP @  0.171A\n                   VCC_PSINTFP_DDR @ 0.677A\n                   -      - PS_MGTRAVCC @ 0.641A\n\n                   @ 2.62A\n\n2) +1V8_STBY <= VCCAUX @ 0.117A\n                VCCAUX_IO @ 0.041A\n                VCC_PSAUX @ 0.002A\n                VCCO @ 0.053A\n                 -      - VCC_PSDDR_PLL @ 0.026A\n                 -      - VCC_PSADC @ 0.011A\n                 -      - VCCADC @ 0.008A\n                 -      - PS_MGTRAVTT @ 0.1A\n                VDD_Si5395 @ 0.270A\n                VCC_QSPI @ 0.062A\n\n               @  0.690A\n\n2) +1V2_PS_PLL <= VCC_PS_PLL @ 0.026A
$Comp
L power:PWR_FLAG #FLG?
U 1 1 5FAEAA01
P 9850 5150
F 0 "#FLG?" H 9850 5225 50  0001 C CNN
F 1 "PWR_FLAG" H 9850 5323 50  0000 C CNN
F 2 "" H 9850 5150 50  0001 C CNN
F 3 "~" H 9850 5150 50  0001 C CNN
	1    9850 5150
	1    0    0    -1  
$EndComp
$Comp
L power:PWR_FLAG #FLG?
U 1 1 5FAEADC6
P 9850 4350
F 0 "#FLG?" H 9850 4425 50  0001 C CNN
F 1 "PWR_FLAG" H 9850 4523 50  0000 C CNN
F 2 "" H 9850 4350 50  0001 C CNN
F 3 "~" H 9850 4350 50  0001 C CNN
	1    9850 4350
	1    0    0    -1  
$EndComp
$Comp
L power:PWR_FLAG #FLG?
U 1 1 5FAEB249
P 9850 5950
F 0 "#FLG?" H 9850 6025 50  0001 C CNN
F 1 "PWR_FLAG" H 9850 6123 50  0000 C CNN
F 2 "" H 9850 5950 50  0001 C CNN
F 3 "~" H 9850 5950 50  0001 C CNN
	1    9850 5950
	1    0    0    -1  
$EndComp
$Comp
L power:PWR_FLAG #FLG?
U 1 1 5FAF6B98
P 9850 3250
F 0 "#FLG?" H 9850 3325 50  0001 C CNN
F 1 "PWR_FLAG" H 9850 3423 50  0000 C CNN
F 2 "" H 9850 3250 50  0001 C CNN
F 3 "~" H 9850 3250 50  0001 C CNN
	1    9850 3250
	1    0    0    -1  
$EndComp
$Comp
L power:PWR_FLAG #FLG?
U 1 1 5EC31E5C
P 6450 7250
F 0 "#FLG?" H 6450 7325 50  0001 C CNN
F 1 "PWR_FLAG" H 6450 7423 50  0000 C CNN
F 2 "" H 6450 7250 50  0001 C CNN
F 3 "~" H 6450 7250 50  0001 C CNN
	1    6450 7250
	-1   0    0    1   
$EndComp
Wire Wire Line
	6450 7250 6450 7150
Wire Wire Line
	8150 4450 8250 4450
Wire Wire Line
	8250 4450 8250 4550
Connection ~ 8250 4550
Wire Wire Line
	8250 5550 8250 5450
Connection ~ 8250 5450
Wire Wire Line
	8150 5550 8250 5550
Connection ~ 8250 5550
Wire Wire Line
	8150 6350 8250 6350
Connection ~ 8250 6350
Wire Wire Line
	8150 6250 8250 6250
Connection ~ 8250 6250
Wire Wire Line
	8250 6250 8250 6350
Wire Wire Line
	8150 3450 8250 3450
Wire Wire Line
	8150 3350 8250 3350
Wire Wire Line
	8250 3350 8250 3450
Connection ~ 8250 3450
Wire Wire Line
	5850 2750 5850 2650
Connection ~ 6250 2650
Wire Wire Line
	6250 2650 6450 2650
Wire Wire Line
	6050 2550 6050 2650
Wire Wire Line
	6050 2650 6250 2650
Connection ~ 6050 2650
Wire Wire Line
	6050 2650 6050 2750
Wire Wire Line
	6450 2750 6450 2650
Connection ~ 6450 2650
Wire Wire Line
	6450 2650 6550 2650
Wire Wire Line
	7150 2650 7250 2650
Wire Wire Line
	7250 2650 7250 2750
Connection ~ 7150 2650
Text GLabel 1550 6100 0    50   BiDi ~ 0
B46_IO_[0..23]
Wire Notes Line
	13400 7050 13900 7050
Wire Notes Line
	13900 7050 13900 7150
Wire Notes Line
	13900 7150 13400 7150
Wire Notes Line
	13400 7150 13400 7050
Wire Notes Line
	13250 8300 13750 8300
Wire Notes Line
	13750 8300 13750 8400
Wire Notes Line
	13750 8400 13250 8400
Wire Notes Line
	13250 8400 13250 8300
Wire Notes Line
	13250 8450 13750 8450
Wire Notes Line
	13750 8450 13750 8550
Wire Notes Line
	13750 8550 13250 8550
Wire Notes Line
	13250 8550 13250 8450
Wire Notes Line
	13250 8600 13750 8600
Wire Notes Line
	13750 8600 13750 8700
Wire Notes Line
	13750 8700 13250 8700
Wire Notes Line
	13250 8700 13250 8600
Wire Notes Line
	13250 8750 13750 8750
Wire Notes Line
	13750 8750 13750 8850
Wire Notes Line
	13750 8850 13250 8850
Wire Notes Line
	13250 8750 13250 8850
Wire Wire Line
	7550 9800 7350 9800
Wire Wire Line
	7350 9800 7350 9700
Connection ~ 7350 9700
Wire Wire Line
	7350 9700 7550 9700
$Comp
L Device:C C81
U 1 1 5FB0221C
P 6500 9900
F 0 "C81" H 6615 9991 50  0000 L CNN
F 1 "1uF" H 6615 9900 50  0000 L CNN
F 2 "Capacitor_SMD:C_0402_1005Metric" H 6538 9750 50  0001 C CNN
F 3 "~" H 6500 9900 50  0001 C CNN
F 4 "16 V" H 6615 9809 50  0000 L CNN "info"
F 5 "AVT-IPE" H 6500 9900 50  0001 C CNN "stock"
	1    6500 9900
	1    0    0    -1  
$EndComp
$Comp
L power:GND #PWR?
U 1 1 5FB02222
P 6500 10050
F 0 "#PWR?" H 6500 9800 50  0001 C CNN
F 1 "GND" H 6505 9877 50  0000 C CNN
F 2 "" H 6500 10050 50  0001 C CNN
F 3 "" H 6500 10050 50  0001 C CNN
	1    6500 10050
	1    0    0    -1  
$EndComp
Wire Wire Line
	6500 9750 6500 9700
Connection ~ 6500 9700
Text Label 9100 9700 0    50   ~ 0
VTTSNS
$Comp
L Device:Net-Tie_2 NT1
U 1 1 5EE1E2FE
P 3700 10100
F 0 "NT1" H 3700 10189 50  0000 C CNN
F 1 "Net-Tie" H 3700 10190 50  0001 C CNN
F 2 "KIT_NetTie:NetTie-2_SMD_Pad0.2mm" H 3700 10100 50  0001 C CNN
F 3 "~" H 3700 10100 50  0001 C CNN
	1    3700 10100
	1    0    0    -1  
$EndComp
Wire Wire Line
	3850 10100 3800 10100
Wire Wire Line
	3600 10100 3550 10100
Text GLabel 4950 5750 0    50   Input ~ 0
PMBUS_IRPS5401_SCL
Text GLabel 4950 5850 0    50   BiDi ~ 0
PMBUS_IRPS5401_SDA
Text GLabel 4950 5950 0    50   Output ~ 0
PMBUS_IRPS5401_INT_B
$Comp
L Connector:Conn_01x02_Male J?
U 1 1 5F3E7F63
P 850 850
AR Path="/5EF3A6E9/5F3E7F63" Ref="J?"  Part="1" 
AR Path="/5FFD078E/5F3E7F63" Ref="J4"  Part="1" 
F 0 "J4" H 958 1031 50  0000 C CNN
F 1 "Ext_3V3" H 958 940 50  0000 C CNN
F 2 "Connector_PinHeader_2.54mm:PinHeader_1x02_P2.54mm_Vertical" H 850 850 50  0001 C CNN
F 3 "~" H 850 850 50  0001 C CNN
	1    850  850 
	1    0    0    -1  
$EndComp
Wire Wire Line
	1300 950  1300 1000
$Comp
L power:GND #PWR?
U 1 1 5F3E7F6A
P 1300 1000
AR Path="/5EF3A6E9/5F3E7F6A" Ref="#PWR?"  Part="1" 
AR Path="/5FFD078E/5F3E7F6A" Ref="#PWR?"  Part="1" 
F 0 "#PWR?" H 1300 750 50  0001 C CNN
F 1 "GND" H 1305 827 50  0000 C CNN
F 2 "" H 1300 1000 50  0001 C CNN
F 3 "" H 1300 1000 50  0001 C CNN
	1    1300 1000
	-1   0    0    -1  
$EndComp
Wire Wire Line
	1300 950  1050 950 
Wire Wire Line
	1300 800  1300 850 
Wire Wire Line
	1300 850  1050 850 
$Comp
L KIT_Power:+3V3_STBY #PWR?
U 1 1 5F3E7F73
P 1300 800
AR Path="/5EF3A6E9/5F3E7F73" Ref="#PWR?"  Part="1" 
AR Path="/5FFD078E/5F3E7F73" Ref="#PWR?"  Part="1" 
F 0 "#PWR?" H 1300 650 50  0001 C CNN
F 1 "+3V3_STBY" H 1315 973 50  0000 C CNN
F 2 "" H 1300 800 50  0001 C CNN
F 3 "" H 1300 800 50  0001 C CNN
	1    1300 800 
	-1   0    0    -1  
$EndComp
$Comp
L KIT_Power_Management:TPS22990[N] U23
U 1 1 5F70A7BC
P 13000 1750
F 0 "U23" H 13000 2488 60  0000 C CNN
F 1 "TPS22990[N]" H 13000 2382 60  0000 C CNN
F 2 "KIT_Package_SON:TI_TPS22990" H 13000 1690 60  0001 C CNN
F 3 "https://www.ti.com/lit/ds/symlink/tps22990.pdf?ts=1593363961446&ref_url=https%253A%252F%252Fwww.ti.com%252Fproduct%252FTPS22990" H 13000 1750 60  0001 C CNN
F 4 "Texas Instruments" H 13000 1750 50  0001 C CNN "manf"
F 5 "TPS22990NDMLR" H 13000 1750 50  0001 C CNN "manf#"
F 6 "296-48730-1-ND‎" H 13000 1750 50  0001 C CNN "digikey#"
	1    13000 1750
	1    0    0    -1  
$EndComp
$Comp
L KIT_Power:+0.85_STBY #PWR?
U 1 1 5F70EA43
P 10300 900
F 0 "#PWR?" H 10300 750 50  0001 C CNN
F 1 "+0.85_STBY" H 10315 1073 50  0000 C CNN
F 2 "" H 10300 900 50  0001 C CNN
F 3 "" H 10300 900 50  0001 C CNN
	1    10300 900 
	1    0    0    -1  
$EndComp
Wire Wire Line
	12100 1450 11900 1450
Wire Wire Line
	12100 1350 11900 1350
Connection ~ 11900 1350
Wire Wire Line
	11900 1350 11900 1450
$Comp
L KIT_Power:+3V3_STBY #PWR?
U 1 1 5F77EFC8
P 9350 900
F 0 "#PWR?" H 9350 750 50  0001 C CNN
F 1 "+3V3_STBY" H 9365 1073 50  0000 C CNN
F 2 "" H 9350 900 50  0001 C CNN
F 3 "" H 9350 900 50  0001 C CNN
	1    9350 900 
	1    0    0    -1  
$EndComp
Wire Wire Line
	9350 900  9350 950 
NoConn ~ 12100 2250
$Comp
L power:GND #PWR?
U 1 1 5F7D95A7
P 14000 2200
F 0 "#PWR?" H 14000 1950 50  0001 C CNN
F 1 "GND" H 14005 2027 50  0000 C CNN
F 2 "" H 14000 2200 50  0001 C CNN
F 3 "" H 14000 2200 50  0001 C CNN
	1    14000 2200
	1    0    0    -1  
$EndComp
Wire Wire Line
	14000 2200 14000 2150
Wire Wire Line
	14000 2150 13900 2150
$Comp
L KIT_Power:+0.85_PL_VCCINT #PWR?
U 1 1 5F8072DB
P 15600 900
AR Path="/5F7AC3E6/5F8072DB" Ref="#PWR?"  Part="1" 
AR Path="/5FFD078E/5F8072DB" Ref="#PWR?"  Part="1" 
F 0 "#PWR?" H 15600 750 50  0001 C CNN
F 1 "+0.85_PL_VCCINT" H 15615 1073 50  0000 C CNN
F 2 "" H 15600 900 50  0001 C CNN
F 3 "" H 15600 900 50  0001 C CNN
	1    15600 900 
	1    0    0    -1  
$EndComp
Wire Wire Line
	13900 1350 14200 1350
Wire Wire Line
	15600 900  15600 1000
Wire Wire Line
	14200 1350 14200 1450
Wire Wire Line
	14200 1450 13900 1450
Wire Wire Line
	13900 1550 14200 1550
Wire Wire Line
	14200 1550 14200 1450
Connection ~ 14200 1450
$Comp
L Device:C C286
U 1 1 5F8A169B
P 9500 1150
F 0 "C286" H 9615 1241 50  0000 L CNN
F 1 "1uF" H 9615 1150 50  0000 L CNN
F 2 "Capacitor_SMD:C_0402_1005Metric" H 9538 1000 50  0001 C CNN
F 3 "~" H 9500 1150 50  0001 C CNN
F 4 "16 V" H 9615 1059 50  0000 L CNN "info"
F 5 "AVT-IPE" H 9500 1150 50  0001 C CNN "stock"
	1    9500 1150
	1    0    0    -1  
$EndComp
$Comp
L power:GND #PWR?
U 1 1 5F8A16A1
P 9500 1300
F 0 "#PWR?" H 9500 1050 50  0001 C CNN
F 1 "GND" H 9505 1127 50  0000 C CNN
F 2 "" H 9500 1300 50  0001 C CNN
F 3 "" H 9500 1300 50  0001 C CNN
	1    9500 1300
	1    0    0    -1  
$EndComp
Wire Wire Line
	9500 1000 9500 950 
NoConn ~ 12100 2050
Text GLabel 6000 1400 0    50   Input ~ 0
EN_PL_VCCCINT_STBY
Text GLabel 15000 2300 2    50   Output ~ 0
PG_PL_VCCCINT_STBY
Text Notes 9400 2100 0    50   ~ 0
ON: The minimum voltage that guarantees logic high is 1.2 V\n  -> 1V8 MIO is OK\n  --> put level translator
$Comp
L Device:R R?
U 1 1 5FB5EA77
P 8500 1200
AR Path="/5F4D38EE/5FB5EA77" Ref="R?"  Part="1" 
AR Path="/5EF3A6EF/5FB5EA77" Ref="R?"  Part="1" 
AR Path="/5F0BF924/5FB5EA77" Ref="R?"  Part="1" 
AR Path="/5FFD078E/5FB5EA77" Ref="R2"  Part="1" 
F 0 "R2" H 8430 1154 50  0000 R CNN
F 1 "10k" H 8430 1245 50  0000 R CNN
F 2 "Resistor_SMD:R_0402_1005Metric" V 8430 1200 50  0001 C CNN
F 3 "~" H 8500 1200 50  0001 C CNN
F 4 "AVT-IPE" H 8500 1200 50  0001 C CNN "stock"
	1    8500 1200
	-1   0    0    1   
$EndComp
Wire Wire Line
	8500 1400 8500 1450
$Comp
L power:GND #PWR?
U 1 1 5FB82C9D
P 8500 1750
F 0 "#PWR?" H 8500 1500 50  0001 C CNN
F 1 "GND" H 8505 1577 50  0000 C CNN
F 2 "" H 8500 1750 50  0001 C CNN
F 3 "" H 8500 1750 50  0001 C CNN
	1    8500 1750
	1    0    0    -1  
$EndComp
$Comp
L Device:R R?
U 1 1 5FBBAEF0
P 14900 2100
AR Path="/5F4D38EE/5FBBAEF0" Ref="R?"  Part="1" 
AR Path="/5EF3A6EF/5FBBAEF0" Ref="R?"  Part="1" 
AR Path="/5F0BF924/5FBBAEF0" Ref="R?"  Part="1" 
AR Path="/5FFD078E/5FBBAEF0" Ref="R72"  Part="1" 
F 0 "R72" H 14830 2054 50  0000 R CNN
F 1 "10k" H 14830 2145 50  0000 R CNN
F 2 "Resistor_SMD:R_0402_1005Metric" V 14830 2100 50  0001 C CNN
F 3 "~" H 14900 2100 50  0001 C CNN
F 4 "AVT-IPE" H 14900 2100 50  0001 C CNN "stock"
	1    14900 2100
	1    0    0    1   
$EndComp
$Comp
L KIT_Power:+1V8_STBY #PWR?
U 1 1 5FBE07BC
P 14900 1950
F 0 "#PWR?" H 14900 1800 50  0001 C CNN
F 1 "+1V8_STBY" H 14915 2123 50  0000 C CNN
F 2 "" H 14900 1950 50  0001 C CNN
F 3 "" H 14900 1950 50  0001 C CNN
	1    14900 1950
	1    0    0    -1  
$EndComp
Wire Wire Line
	15000 2300 14900 2300
Wire Wire Line
	14900 2250 14900 2300
Text Notes 14850 2500 0    50   ~ 0
Open Collector, 1V8 MIO\n
$Comp
L Device:C C?
U 1 1 5FDD51FA
P 10450 1150
AR Path="/5E09AE40/5FDD51FA" Ref="C?"  Part="1" 
AR Path="/5FFD078E/5FDD51FA" Ref="C287"  Part="1" 
F 0 "C287" H 10565 1196 50  0000 L CNN
F 1 "47uF" H 10565 1105 50  0000 L CNN
F 2 "Capacitor_SMD:C_0603_1608Metric" H 10488 1000 50  0001 C CNN
F 3 "~" H 10450 1150 50  0001 C CNN
F 4 "47µF ±20% 2.5V Ceramic Capacitor X6S 0603 (1608 Metric) " H 10450 1150 50  0001 C CNN "info"
F 5 "Murata" H 10450 1150 50  0001 C CNN "manf"
F 6 "GRM188C80E476ME05" H 10450 1150 50  0001 C CNN "manf#"
	1    10450 1150
	1    0    0    -1  
$EndComp
Wire Wire Line
	10450 950  10450 1000
$Comp
L Device:C C?
U 1 1 5FDD5205
P 10950 1150
AR Path="/5E09AE40/5FDD5205" Ref="C?"  Part="1" 
AR Path="/5FFD078E/5FDD5205" Ref="C288"  Part="1" 
F 0 "C288" H 11065 1196 50  0000 L CNN
F 1 "47uF" H 11065 1105 50  0000 L CNN
F 2 "Capacitor_SMD:C_0603_1608Metric" H 10988 1000 50  0001 C CNN
F 3 "~" H 10950 1150 50  0001 C CNN
F 4 "47µF ±20% 2.5V Ceramic Capacitor X6S 0603 (1608 Metric) " H 10950 1150 50  0001 C CNN "info"
F 5 "Murata" H 10950 1150 50  0001 C CNN "manf"
F 6 "GRM188C80E476ME05" H 10950 1150 50  0001 C CNN "manf#"
	1    10950 1150
	1    0    0    -1  
$EndComp
$Comp
L Device:C C?
U 1 1 5FDD520F
P 11450 1150
AR Path="/5E09AE40/5FDD520F" Ref="C?"  Part="1" 
AR Path="/5FFD078E/5FDD520F" Ref="C289"  Part="1" 
F 0 "C289" H 11565 1196 50  0000 L CNN
F 1 "10uF" H 11565 1105 50  0000 L CNN
F 2 "Capacitor_SMD:C_0402_1005Metric" H 11488 1000 50  0001 C CNN
F 3 "~" H 11450 1150 50  0001 C CNN
F 4 "10µF ±20% 6.3V Ceramic Capacitor X6S 0402 (1005 Metric) " H 11450 1150 50  0001 C CNN "info"
F 5 "Murata" H 11450 1150 50  0001 C CNN "manf"
F 6 "GRM155C80J106ME11D" H 11450 1150 50  0001 C CNN "manf#"
	1    11450 1150
	1    0    0    -1  
$EndComp
Wire Wire Line
	11450 950  11450 1000
Wire Wire Line
	10950 950  10950 1000
$Comp
L power:GND #PWR?
U 1 1 5FE616BE
P 10450 1300
F 0 "#PWR?" H 10450 1050 50  0001 C CNN
F 1 "GND" H 10455 1127 50  0000 C CNN
F 2 "" H 10450 1300 50  0001 C CNN
F 3 "" H 10450 1300 50  0001 C CNN
	1    10450 1300
	1    0    0    -1  
$EndComp
$Comp
L power:GND #PWR?
U 1 1 5FE61A64
P 10950 1300
F 0 "#PWR?" H 10950 1050 50  0001 C CNN
F 1 "GND" H 10955 1127 50  0000 C CNN
F 2 "" H 10950 1300 50  0001 C CNN
F 3 "" H 10950 1300 50  0001 C CNN
	1    10950 1300
	1    0    0    -1  
$EndComp
$Comp
L power:GND #PWR?
U 1 1 5FE61C77
P 11450 1300
F 0 "#PWR?" H 11450 1050 50  0001 C CNN
F 1 "GND" H 11455 1127 50  0000 C CNN
F 2 "" H 11450 1300 50  0001 C CNN
F 3 "" H 11450 1300 50  0001 C CNN
	1    11450 1300
	1    0    0    -1  
$EndComp
Wire Wire Line
	10300 900  10300 950 
Wire Wire Line
	10300 950  10450 950 
Wire Wire Line
	11900 950  11900 1350
Connection ~ 10450 950 
Wire Wire Line
	10450 950  10950 950 
Connection ~ 10950 950 
Wire Wire Line
	10950 950  11450 950 
Connection ~ 11450 950 
Wire Wire Line
	11450 950  11900 950 
Wire Wire Line
	9350 950  9500 950 
$Comp
L Device:C C?
U 1 1 5FF94DA9
P 14800 1200
AR Path="/5E09AE40/5FF94DA9" Ref="C?"  Part="1" 
AR Path="/5FFD078E/5FF94DA9" Ref="C290"  Part="1" 
F 0 "C290" H 14915 1246 50  0000 L CNN
F 1 "47uF" H 14915 1155 50  0000 L CNN
F 2 "Capacitor_SMD:C_0603_1608Metric" H 14838 1050 50  0001 C CNN
F 3 "~" H 14800 1200 50  0001 C CNN
F 4 "47µF ±20% 2.5V Ceramic Capacitor X6S 0603 (1608 Metric) " H 14800 1200 50  0001 C CNN "info"
F 5 "Murata" H 14800 1200 50  0001 C CNN "manf"
F 6 "GRM188C80E476ME05" H 14800 1200 50  0001 C CNN "manf#"
	1    14800 1200
	1    0    0    -1  
$EndComp
Wire Wire Line
	14800 1000 14800 1050
$Comp
L Device:C C?
U 1 1 5FF94DB3
P 15300 1200
AR Path="/5E09AE40/5FF94DB3" Ref="C?"  Part="1" 
AR Path="/5FFD078E/5FF94DB3" Ref="C291"  Part="1" 
F 0 "C291" H 15415 1246 50  0000 L CNN
F 1 "47uF" H 15415 1155 50  0000 L CNN
F 2 "Capacitor_SMD:C_0603_1608Metric" H 15338 1050 50  0001 C CNN
F 3 "~" H 15300 1200 50  0001 C CNN
F 4 "47µF ±20% 2.5V Ceramic Capacitor X6S 0603 (1608 Metric) " H 15300 1200 50  0001 C CNN "info"
F 5 "Murata" H 15300 1200 50  0001 C CNN "manf"
F 6 "GRM188C80E476ME05" H 15300 1200 50  0001 C CNN "manf#"
	1    15300 1200
	1    0    0    -1  
$EndComp
Wire Wire Line
	15300 1000 15300 1050
$Comp
L power:GND #PWR?
U 1 1 5FF94DBA
P 14800 1350
F 0 "#PWR?" H 14800 1100 50  0001 C CNN
F 1 "GND" H 14805 1177 50  0000 C CNN
F 2 "" H 14800 1350 50  0001 C CNN
F 3 "" H 14800 1350 50  0001 C CNN
	1    14800 1350
	1    0    0    -1  
$EndComp
$Comp
L power:GND #PWR?
U 1 1 5FF94DC0
P 15300 1350
F 0 "#PWR?" H 15300 1100 50  0001 C CNN
F 1 "GND" H 15305 1177 50  0000 C CNN
F 2 "" H 15300 1350 50  0001 C CNN
F 3 "" H 15300 1350 50  0001 C CNN
	1    15300 1350
	1    0    0    -1  
$EndComp
Wire Wire Line
	14900 2300 14400 2300
Wire Wire Line
	14400 2300 14400 1950
Wire Wire Line
	14400 1950 13900 1950
Connection ~ 14900 2300
Wire Wire Line
	15600 1000 15300 1000
Wire Wire Line
	14200 1000 14200 1350
Connection ~ 14800 1000
Wire Wire Line
	14800 1000 14200 1000
Connection ~ 15300 1000
Wire Wire Line
	15300 1000 14800 1000
Connection ~ 14200 1350
$Comp
L Device:R R98
U 1 1 6012668D
P 4600 5350
F 0 "R98" V 4550 5450 50  0000 L CNN
F 1 "10k" V 4550 5100 50  0000 L CNN
F 2 "Resistor_SMD:R_0402_1005Metric" V 4530 5350 50  0001 C CNN
F 3 "~" H 4600 5350 50  0001 C CNN
F 4 "AVT-IPE" H 4600 5350 50  0001 C CNN "stock"
	1    4600 5350
	0    1    1    0   
$EndComp
Wire Wire Line
	4750 5350 5300 5350
$Comp
L Device:R R97
U 1 1 6014DB7A
P 4600 5250
F 0 "R97" V 4550 5350 50  0000 L CNN
F 1 "10k" V 4550 5000 50  0000 L CNN
F 2 "Resistor_SMD:R_0402_1005Metric" V 4530 5250 50  0001 C CNN
F 3 "~" H 4600 5250 50  0001 C CNN
F 4 "AVT-IPE" H 4600 5250 50  0001 C CNN "stock"
	1    4600 5250
	0    1    1    0   
$EndComp
Wire Wire Line
	4750 5250 5300 5250
$Comp
L Device:R R96
U 1 1 601723ED
P 4600 5150
F 0 "R96" V 4550 5250 50  0000 L CNN
F 1 "10k" V 4550 4900 50  0000 L CNN
F 2 "Resistor_SMD:R_0402_1005Metric" V 4530 5150 50  0001 C CNN
F 3 "~" H 4600 5150 50  0001 C CNN
F 4 "AVT-IPE" H 4600 5150 50  0001 C CNN "stock"
	1    4600 5150
	0    1    1    0   
$EndComp
Wire Wire Line
	4750 5150 5300 5150
$Comp
L Device:R R95
U 1 1 60197080
P 4600 5050
F 0 "R95" V 4550 5150 50  0000 L CNN
F 1 "10k" V 4550 4800 50  0000 L CNN
F 2 "Resistor_SMD:R_0402_1005Metric" V 4530 5050 50  0001 C CNN
F 3 "~" H 4600 5050 50  0001 C CNN
F 4 "AVT-IPE" H 4600 5050 50  0001 C CNN "stock"
	1    4600 5050
	0    1    1    0   
$EndComp
Wire Wire Line
	4750 5050 5300 5050
$Comp
L Device:R R94
U 1 1 601BC079
P 4600 4950
F 0 "R94" V 4550 5050 50  0000 L CNN
F 1 "10k" V 4550 4700 50  0000 L CNN
F 2 "Resistor_SMD:R_0402_1005Metric" V 4530 4950 50  0001 C CNN
F 3 "~" H 4600 4950 50  0001 C CNN
F 4 "AVT-IPE" H 4600 4950 50  0001 C CNN "stock"
	1    4600 4950
	0    1    1    0   
$EndComp
Wire Wire Line
	4750 4950 5300 4950
$Comp
L KIT_Power:+3V3_STBY #PWR?
U 1 1 6020A7E0
P 4050 4800
F 0 "#PWR?" H 4050 4650 50  0001 C CNN
F 1 "+3V3_STBY" H 4065 4973 50  0000 C CNN
F 2 "" H 4050 4800 50  0001 C CNN
F 3 "" H 4050 4800 50  0001 C CNN
	1    4050 4800
	1    0    0    -1  
$EndComp
Wire Wire Line
	4050 4800 4050 4950
Wire Wire Line
	4050 5350 4450 5350
Connection ~ 4050 4950
Wire Wire Line
	4050 4950 4050 5050
Wire Wire Line
	4450 5050 4050 5050
Connection ~ 4050 5050
Wire Wire Line
	4450 5150 4050 5150
Wire Wire Line
	4050 5050 4050 5150
Connection ~ 4050 5150
Wire Wire Line
	4050 5150 4050 5250
Wire Wire Line
	4450 5250 4050 5250
Connection ~ 4050 5250
Wire Wire Line
	4050 5250 4050 5350
Wire Wire Line
	4050 4950 4450 4950
Text Label 5050 4950 0    50   ~ 0
PG_A
Text Label 5050 5050 0    50   ~ 0
PG_B
Text Label 5050 5150 0    50   ~ 0
PG_C
Text Label 5050 5250 0    50   ~ 0
PG_D
Text Label 5050 5350 0    50   ~ 0
PG_L
Wire Wire Line
	1850 6600 2400 6600
Wire Wire Line
	1850 6500 2400 6500
Wire Wire Line
	1850 6400 2400 6400
Wire Wire Line
	1850 6300 2400 6300
Wire Wire Line
	1850 6200 2400 6200
Text Label 2400 6200 2    50   ~ 0
PG_A
Text Label 2400 6300 2    50   ~ 0
PG_B
Text Label 2400 6400 2    50   ~ 0
PG_C
Text Label 2400 6500 2    50   ~ 0
PG_D
Text Label 2400 6600 2    50   ~ 0
PG_L
Wire Bus Line
	1750 6100 1550 6100
Entry Wire Line
	1750 6100 1850 6200
Entry Wire Line
	1750 6200 1850 6300
Text Label 1900 6200 0    20   ~ 0
B46_IO_4
Text Label 1900 6300 0    20   ~ 0
B46_IO_5
Entry Wire Line
	1750 6300 1850 6400
Entry Wire Line
	1750 6400 1850 6500
Text Label 1900 6400 0    20   ~ 0
B46_IO_6
Text Label 1900 6500 0    20   ~ 0
B46_IO_7
Entry Wire Line
	1750 6500 1850 6600
Text Label 1900 6600 0    20   ~ 0
B46_IO_9
$Comp
L Connector:Conn_01x02_Male J?
U 1 1 5F198550
P 1450 7300
AR Path="/5EF3A6E9/5F198550" Ref="J?"  Part="1" 
AR Path="/5F7AC3E6/5F198550" Ref="J?"  Part="1" 
AR Path="/5F0BF924/5F198550" Ref="J?"  Part="1" 
AR Path="/5FFD078E/5F198550" Ref="J7"  Part="1" 
F 0 "J7" H 1423 7182 50  0000 R CNN
F 1 "EN_ALL_STBY" H 1423 7273 50  0000 R CNN
F 2 "Connector_PinHeader_2.54mm:PinHeader_1x02_P2.54mm_Vertical" H 1450 7300 50  0001 C CNN
F 3 "~" H 1450 7300 50  0001 C CNN
	1    1450 7300
	1    0    0    1   
$EndComp
$Comp
L power:GND #PWR?
U 1 1 5F1C1968
P 2000 7350
F 0 "#PWR?" H 2000 7100 50  0001 C CNN
F 1 "GND" H 2005 7177 50  0000 C CNN
F 2 "" H 2000 7350 50  0001 C CNN
F 3 "" H 2000 7350 50  0001 C CNN
	1    2000 7350
	1    0    0    -1  
$EndComp
Wire Wire Line
	2000 7350 2000 7300
Wire Wire Line
	2000 7300 1650 7300
Text Label 2000 7200 2    50   ~ 0
EN_ALL
Wire Wire Line
	2000 7200 1650 7200
Wire Wire Line
	6450 7150 5150 7150
$Comp
L KIT_Regulator_Switching:IRPS5401MTRPBF U29
U 1 1 5E97A29B
P 6650 4950
F 0 "U29" H 5600 2950 60  0000 C CNN
F 1 "IRPS5401MTRPBF" H 7550 2950 60  0000 C CNN
F 2 "KIT_Package_DFN_QFN:IRPS5401MTRPBF_QFN-56-1EP_7x7mm_P0.4mm_EP5.6x5.6mm_ThermalVias" H 7575 6300 60  0001 L CNN
F 3 "https://www.infineon.com/dgdl/Infineon-IRPS5401M-DS-v02_01-EN.pdf?fileId=5546d4625cc9456a015cd69d402139db" H 7575 6100 60  0001 L CNN
F 4 "IRPS5401MTRPBFCT-ND" H 6725 2774 50  0001 C CNN "digikey#"
	1    6650 4950
	1    0    0    -1  
$EndComp
$Comp
L KIT_Power:+3V3_STBY #PWR?
U 1 1 5FEF10AA
P 7450 2250
F 0 "#PWR?" H 7450 2100 50  0001 C CNN
F 1 "+3V3_STBY" H 7465 2423 50  0000 C CNN
F 2 "" H 7450 2250 50  0001 C CNN
F 3 "" H 7450 2250 50  0001 C CNN
	1    7450 2250
	1    0    0    -1  
$EndComp
$Comp
L KIT_Logic_LevelTranslator:SN74AVC1T45DRLR U?
U 1 1 5FDDA722
P 6200 1200
AR Path="/5DEF958D/5FDDA722" Ref="U?"  Part="1" 
AR Path="/5FFD078E/5FDDA722" Ref="U28"  Part="1" 
F 0 "U28" H 6700 1490 60  0000 C CNN
F 1 "SN74AVC1T45DRLR" H 6700 1384 60  0000 C CNN
F 2 "Package_TO_SOT_SMD:SOT-666" H 6750 800 50  0001 C CNN
F 3 "https://www.ti.com/lit/ds/symlink/sn74avc1t45.pdf" H 6200 1200 50  0001 C CNN
F 4 "296-21022-1-ND" H 6200 1200 50  0001 C CNN "digikey#"
	1    6200 1200
	1    0    0    -1  
$EndComp
Wire Wire Line
	7200 1400 8500 1400
Wire Wire Line
	6200 1400 6000 1400
Wire Wire Line
	6200 1300 6100 1300
Wire Wire Line
	6100 1300 6100 1600
$Comp
L power:GND #PWR?
U 1 1 5FDDA72C
P 6100 1600
AR Path="/5DEF958D/5FDDA72C" Ref="#PWR?"  Part="1" 
AR Path="/5FFD078E/5FDDA72C" Ref="#PWR?"  Part="1" 
F 0 "#PWR?" H 6100 1350 50  0001 C CNN
F 1 "GND" H 6105 1427 50  0000 C CNN
F 2 "" H 6100 1600 50  0001 C CNN
F 3 "" H 6100 1600 50  0001 C CNN
	1    6100 1600
	1    0    0    -1  
$EndComp
Wire Wire Line
	7300 700  7300 750 
Wire Wire Line
	7300 1200 7200 1200
Wire Wire Line
	6200 1200 6100 1200
Wire Wire Line
	6100 1200 6100 750 
$Comp
L KIT_Power:+1V8_STBY #PWR?
U 1 1 5FDDA73C
P 6100 700
AR Path="/5DEF958D/5FDDA73C" Ref="#PWR?"  Part="1" 
AR Path="/5FFD078E/5FDDA73C" Ref="#PWR?"  Part="1" 
F 0 "#PWR?" H 6100 550 50  0001 C CNN
F 1 "+1V8_STBY" H 6115 873 50  0000 C CNN
F 2 "" H 6100 700 50  0001 C CNN
F 3 "" H 6100 700 50  0001 C CNN
	1    6100 700 
	1    0    0    -1  
$EndComp
Wire Wire Line
	7200 1300 7300 1300
Wire Wire Line
	7300 1300 7300 1200
Connection ~ 7300 1200
Text Notes 6500 1650 0    50   ~ 0
A --> B\n
$Comp
L Device:C C?
U 1 1 5FDDA746
P 5700 950
AR Path="/5DEF958D/5FDDA746" Ref="C?"  Part="1" 
AR Path="/5FFD078E/5FDDA746" Ref="C303"  Part="1" 
F 0 "C303" H 5815 996 50  0000 L CNN
F 1 "0.1uF" H 5815 905 50  0000 L CNN
F 2 "Capacitor_SMD:C_0402_1005Metric" H 5738 800 50  0001 C CNN
F 3 "~" H 5700 950 50  0001 C CNN
F 4 "16 V" H 5700 950 50  0001 C CNN "info"
F 5 "AVT-IPE" H 5700 950 50  0001 C CNN "stock"
	1    5700 950 
	1    0    0    -1  
$EndComp
$Comp
L power:GND #PWR?
U 1 1 5FDDA74C
P 5700 1100
AR Path="/5DEF958D/5FDDA74C" Ref="#PWR?"  Part="1" 
AR Path="/5FFD078E/5FDDA74C" Ref="#PWR?"  Part="1" 
F 0 "#PWR?" H 5700 850 50  0001 C CNN
F 1 "GND" H 5705 927 50  0000 C CNN
F 2 "" H 5700 1100 50  0001 C CNN
F 3 "" H 5700 1100 50  0001 C CNN
	1    5700 1100
	1    0    0    -1  
$EndComp
$Comp
L Device:C C?
U 1 1 5FDDA758
P 7600 1000
AR Path="/5DEF958D/5FDDA758" Ref="C?"  Part="1" 
AR Path="/5FFD078E/5FDDA758" Ref="C304"  Part="1" 
F 0 "C304" H 7715 1046 50  0000 L CNN
F 1 "0.1uF" H 7715 955 50  0000 L CNN
F 2 "Capacitor_SMD:C_0402_1005Metric" H 7638 850 50  0001 C CNN
F 3 "~" H 7600 1000 50  0001 C CNN
F 4 "16 V" H 7600 1000 50  0001 C CNN "info"
F 5 "AVT-IPE" H 7600 1000 50  0001 C CNN "stock"
	1    7600 1000
	1    0    0    -1  
$EndComp
$Comp
L power:GND #PWR?
U 1 1 5FDDA75E
P 7600 1150
AR Path="/5DEF958D/5FDDA75E" Ref="#PWR?"  Part="1" 
AR Path="/5FFD078E/5FDDA75E" Ref="#PWR?"  Part="1" 
F 0 "#PWR?" H 7600 900 50  0001 C CNN
F 1 "GND" H 7605 977 50  0000 C CNN
F 2 "" H 7600 1150 50  0001 C CNN
F 3 "" H 7600 1150 50  0001 C CNN
	1    7600 1150
	1    0    0    -1  
$EndComp
Wire Wire Line
	5700 800  5700 750 
Wire Wire Line
	5700 750  6100 750 
Connection ~ 6100 750 
Wire Wire Line
	6100 750  6100 700 
Wire Wire Line
	7600 850  7600 750 
Wire Wire Line
	7600 750  7300 750 
Connection ~ 7300 750 
Wire Wire Line
	7300 750  7300 1200
Wire Wire Line
	8900 1850 8900 1400
Wire Wire Line
	12100 1650 9850 1650
Wire Wire Line
	9850 1650 9850 950 
Wire Wire Line
	9850 950  9500 950 
Connection ~ 9500 950 
Connection ~ 8500 1400
Wire Wire Line
	8500 1400 8900 1400
Wire Wire Line
	8900 1850 12100 1850
$Comp
L Device:R R?
U 1 1 601890C0
P 8500 1600
AR Path="/5EB76D90/601890C0" Ref="R?"  Part="1" 
AR Path="/5FFD078E/601890C0" Ref="R71"  Part="1" 
F 0 "R71" H 8430 1691 50  0000 R CNN
F 1 "10k" H 8430 1600 50  0000 R CNN
F 2 "KIT_Resistor_SMD:R_0402_1005Metric_DNP" V 8430 1600 50  0001 C CNN
F 3 "~" H 8500 1600 50  0001 C CNN
F 4 "AVT-IPE" H 8500 1600 50  0001 C CNN "stock"
F 5 "DNP" H 8430 1509 50  0000 R CNN "DNP"
	1    8500 1600
	-1   0    0    -1  
$EndComp
Wire Wire Line
	8500 1350 8500 1400
$Comp
L KIT_Power:+3V3_STBY #PWR?
U 1 1 5FDDA732
P 7300 700
AR Path="/5DEF958D/5FDDA732" Ref="#PWR?"  Part="1" 
AR Path="/5FFD078E/5FDDA732" Ref="#PWR?"  Part="1" 
F 0 "#PWR?" H 7300 550 50  0001 C CNN
F 1 "+3V3_STBY" H 7315 873 50  0000 C CNN
F 2 "" H 7300 700 50  0001 C CNN
F 3 "" H 7300 700 50  0001 C CNN
	1    7300 700 
	1    0    0    -1  
$EndComp
$Comp
L KIT_Power:+3V3_STBY #PWR?
U 1 1 60272342
P 8500 1050
AR Path="/5DEF958D/60272342" Ref="#PWR?"  Part="1" 
AR Path="/5FFD078E/60272342" Ref="#PWR?"  Part="1" 
F 0 "#PWR?" H 8500 900 50  0001 C CNN
F 1 "+3V3_STBY" H 8515 1223 50  0000 C CNN
F 2 "" H 8500 1050 50  0001 C CNN
F 3 "" H 8500 1050 50  0001 C CNN
	1    8500 1050
	1    0    0    -1  
$EndComp
Text Label 9450 1850 0    50   ~ 0
EN_PL_VCCCINT_STBY_3V3
Wire Bus Line
	1750 6100 1750 6500
$EndSCHEMATC
