EESchema Schematic File Version 4
EELAYER 30 0
EELAYER END
$Descr A4 11693 8268
encoding utf-8
Sheet 23 28
Title "ZynqMP Mezzanine FMC+ (BuZZyBoard)"
Date "2020-10-02"
Rev "1.0"
Comp "Karlsruhe Institute of Technology (KIT)"
Comment1 "Institute for Data Processing and Electronics (IPE)"
Comment2 "Luis Ardila"
Comment3 ""
Comment4 ""
$EndDescr
$Comp
L KIT_Connector:FMCP_VITA57.4 J2
U 3 1 5EEDBB48
P 5200 1900
F 0 "J2" H 6000 2190 60  0000 C CNN
F 1 "FMCP_VITA57.4" H 6000 2084 60  0000 C CNN
F 2 "KIT_Connector:FMC_SEAM_ASP_184330_BGA-560_40x14_55.778x19.76mm" H 5500 1800 60  0001 L CNN
F 3 "http://suddendocs.samtec.com/prints/asp-188588-01-mkt.pdf" H 5500 1600 60  0001 L CNN
	3    5200 1900
	1    0    0    -1  
$EndComp
$Comp
L power:GND #PWR?
U 1 1 5F0B050E
P 5200 2200
AR Path="/5EF3A6F3/5F0B050E" Ref="#PWR?"  Part="1" 
AR Path="/5EF3A6EB/5F0B050E" Ref="#PWR?"  Part="1" 
F 0 "#PWR?" H 5200 1950 50  0001 C CNN
F 1 "GND" V 5205 2072 50  0000 R CNN
F 2 "" H 5200 2200 50  0001 C CNN
F 3 "" H 5200 2200 50  0001 C CNN
	1    5200 2200
	0    1    1    0   
$EndComp
$Comp
L power:GND #PWR?
U 1 1 5F0B0514
P 5200 2300
AR Path="/5EF3A6F3/5F0B0514" Ref="#PWR?"  Part="1" 
AR Path="/5EF3A6EB/5F0B0514" Ref="#PWR?"  Part="1" 
F 0 "#PWR?" H 5200 2050 50  0001 C CNN
F 1 "GND" V 5205 2172 50  0000 R CNN
F 2 "" H 5200 2300 50  0001 C CNN
F 3 "" H 5200 2300 50  0001 C CNN
	1    5200 2300
	0    1    1    0   
$EndComp
$Comp
L power:GND #PWR?
U 1 1 5F0B09A6
P 5200 1900
AR Path="/5EF3A6F3/5F0B09A6" Ref="#PWR?"  Part="1" 
AR Path="/5EF3A6EB/5F0B09A6" Ref="#PWR?"  Part="1" 
F 0 "#PWR?" H 5200 1650 50  0001 C CNN
F 1 "GND" V 5205 1772 50  0000 R CNN
F 2 "" H 5200 1900 50  0001 C CNN
F 3 "" H 5200 1900 50  0001 C CNN
	1    5200 1900
	0    1    1    0   
$EndComp
$Comp
L power:GND #PWR?
U 1 1 5F0B1036
P 5200 2600
AR Path="/5EF3A6F3/5F0B1036" Ref="#PWR?"  Part="1" 
AR Path="/5EF3A6EB/5F0B1036" Ref="#PWR?"  Part="1" 
F 0 "#PWR?" H 5200 2350 50  0001 C CNN
F 1 "GND" V 5205 2472 50  0000 R CNN
F 2 "" H 5200 2600 50  0001 C CNN
F 3 "" H 5200 2600 50  0001 C CNN
	1    5200 2600
	0    1    1    0   
$EndComp
$Comp
L power:GND #PWR?
U 1 1 5F0B1712
P 5200 2900
AR Path="/5EF3A6F3/5F0B1712" Ref="#PWR?"  Part="1" 
AR Path="/5EF3A6EB/5F0B1712" Ref="#PWR?"  Part="1" 
F 0 "#PWR?" H 5200 2650 50  0001 C CNN
F 1 "GND" V 5205 2772 50  0000 R CNN
F 2 "" H 5200 2900 50  0001 C CNN
F 3 "" H 5200 2900 50  0001 C CNN
	1    5200 2900
	0    1    1    0   
$EndComp
$Comp
L power:GND #PWR?
U 1 1 5F0B4FC9
P 5200 3200
AR Path="/5EF3A6F3/5F0B4FC9" Ref="#PWR?"  Part="1" 
AR Path="/5EF3A6EB/5F0B4FC9" Ref="#PWR?"  Part="1" 
F 0 "#PWR?" H 5200 2950 50  0001 C CNN
F 1 "GND" V 5205 3072 50  0000 R CNN
F 2 "" H 5200 3200 50  0001 C CNN
F 3 "" H 5200 3200 50  0001 C CNN
	1    5200 3200
	0    1    1    0   
$EndComp
$Comp
L power:GND #PWR?
U 1 1 5F0B4FCF
P 5200 3500
AR Path="/5EF3A6F3/5F0B4FCF" Ref="#PWR?"  Part="1" 
AR Path="/5EF3A6EB/5F0B4FCF" Ref="#PWR?"  Part="1" 
F 0 "#PWR?" H 5200 3250 50  0001 C CNN
F 1 "GND" V 5205 3372 50  0000 R CNN
F 2 "" H 5200 3500 50  0001 C CNN
F 3 "" H 5200 3500 50  0001 C CNN
	1    5200 3500
	0    1    1    0   
$EndComp
$Comp
L power:GND #PWR?
U 1 1 5F0B71A3
P 5200 3800
AR Path="/5EF3A6F3/5F0B71A3" Ref="#PWR?"  Part="1" 
AR Path="/5EF3A6EB/5F0B71A3" Ref="#PWR?"  Part="1" 
F 0 "#PWR?" H 5200 3550 50  0001 C CNN
F 1 "GND" V 5205 3672 50  0000 R CNN
F 2 "" H 5200 3800 50  0001 C CNN
F 3 "" H 5200 3800 50  0001 C CNN
	1    5200 3800
	0    1    1    0   
$EndComp
$Comp
L power:GND #PWR?
U 1 1 5F0B71A9
P 5200 4100
AR Path="/5EF3A6F3/5F0B71A9" Ref="#PWR?"  Part="1" 
AR Path="/5EF3A6EB/5F0B71A9" Ref="#PWR?"  Part="1" 
F 0 "#PWR?" H 5200 3850 50  0001 C CNN
F 1 "GND" V 5205 3972 50  0000 R CNN
F 2 "" H 5200 4100 50  0001 C CNN
F 3 "" H 5200 4100 50  0001 C CNN
	1    5200 4100
	0    1    1    0   
$EndComp
$Comp
L power:GND #PWR?
U 1 1 5F0B7A0F
P 5200 4400
AR Path="/5EF3A6F3/5F0B7A0F" Ref="#PWR?"  Part="1" 
AR Path="/5EF3A6EB/5F0B7A0F" Ref="#PWR?"  Part="1" 
F 0 "#PWR?" H 5200 4150 50  0001 C CNN
F 1 "GND" V 5205 4272 50  0000 R CNN
F 2 "" H 5200 4400 50  0001 C CNN
F 3 "" H 5200 4400 50  0001 C CNN
	1    5200 4400
	0    1    1    0   
$EndComp
$Comp
L power:GND #PWR?
U 1 1 5F0B7A15
P 5200 4700
AR Path="/5EF3A6F3/5F0B7A15" Ref="#PWR?"  Part="1" 
AR Path="/5EF3A6EB/5F0B7A15" Ref="#PWR?"  Part="1" 
F 0 "#PWR?" H 5200 4450 50  0001 C CNN
F 1 "GND" V 5205 4572 50  0000 R CNN
F 2 "" H 5200 4700 50  0001 C CNN
F 3 "" H 5200 4700 50  0001 C CNN
	1    5200 4700
	0    1    1    0   
$EndComp
$Comp
L power:GND #PWR?
U 1 1 5F0B8219
P 5200 5000
AR Path="/5EF3A6F3/5F0B8219" Ref="#PWR?"  Part="1" 
AR Path="/5EF3A6EB/5F0B8219" Ref="#PWR?"  Part="1" 
F 0 "#PWR?" H 5200 4750 50  0001 C CNN
F 1 "GND" V 5205 4872 50  0000 R CNN
F 2 "" H 5200 5000 50  0001 C CNN
F 3 "" H 5200 5000 50  0001 C CNN
	1    5200 5000
	0    1    1    0   
$EndComp
$Comp
L power:GND #PWR?
U 1 1 5F0B821F
P 5200 5300
AR Path="/5EF3A6F3/5F0B821F" Ref="#PWR?"  Part="1" 
AR Path="/5EF3A6EB/5F0B821F" Ref="#PWR?"  Part="1" 
F 0 "#PWR?" H 5200 5050 50  0001 C CNN
F 1 "GND" V 5205 5172 50  0000 R CNN
F 2 "" H 5200 5300 50  0001 C CNN
F 3 "" H 5200 5300 50  0001 C CNN
	1    5200 5300
	0    1    1    0   
$EndComp
$Comp
L power:GND #PWR?
U 1 1 5F0BA25F
P 6800 5700
AR Path="/5EF3A6F3/5F0BA25F" Ref="#PWR?"  Part="1" 
AR Path="/5EF3A6EB/5F0BA25F" Ref="#PWR?"  Part="1" 
F 0 "#PWR?" H 6800 5450 50  0001 C CNN
F 1 "GND" V 6805 5572 50  0000 R CNN
F 2 "" H 6800 5700 50  0001 C CNN
F 3 "" H 6800 5700 50  0001 C CNN
	1    6800 5700
	0    -1   -1   0   
$EndComp
$Comp
L power:GND #PWR?
U 1 1 5F0BA265
P 6800 5400
AR Path="/5EF3A6F3/5F0BA265" Ref="#PWR?"  Part="1" 
AR Path="/5EF3A6EB/5F0BA265" Ref="#PWR?"  Part="1" 
F 0 "#PWR?" H 6800 5150 50  0001 C CNN
F 1 "GND" V 6805 5272 50  0000 R CNN
F 2 "" H 6800 5400 50  0001 C CNN
F 3 "" H 6800 5400 50  0001 C CNN
	1    6800 5400
	0    -1   -1   0   
$EndComp
$Comp
L power:GND #PWR?
U 1 1 5F0BAA9B
P 6800 5100
AR Path="/5EF3A6F3/5F0BAA9B" Ref="#PWR?"  Part="1" 
AR Path="/5EF3A6EB/5F0BAA9B" Ref="#PWR?"  Part="1" 
F 0 "#PWR?" H 6800 4850 50  0001 C CNN
F 1 "GND" V 6805 4972 50  0000 R CNN
F 2 "" H 6800 5100 50  0001 C CNN
F 3 "" H 6800 5100 50  0001 C CNN
	1    6800 5100
	0    -1   -1   0   
$EndComp
$Comp
L power:GND #PWR?
U 1 1 5F0BAAA1
P 6800 4800
AR Path="/5EF3A6F3/5F0BAAA1" Ref="#PWR?"  Part="1" 
AR Path="/5EF3A6EB/5F0BAAA1" Ref="#PWR?"  Part="1" 
F 0 "#PWR?" H 6800 4550 50  0001 C CNN
F 1 "GND" V 6805 4672 50  0000 R CNN
F 2 "" H 6800 4800 50  0001 C CNN
F 3 "" H 6800 4800 50  0001 C CNN
	1    6800 4800
	0    -1   -1   0   
$EndComp
$Comp
L power:GND #PWR?
U 1 1 5F0BB163
P 6800 4500
AR Path="/5EF3A6F3/5F0BB163" Ref="#PWR?"  Part="1" 
AR Path="/5EF3A6EB/5F0BB163" Ref="#PWR?"  Part="1" 
F 0 "#PWR?" H 6800 4250 50  0001 C CNN
F 1 "GND" V 6805 4372 50  0000 R CNN
F 2 "" H 6800 4500 50  0001 C CNN
F 3 "" H 6800 4500 50  0001 C CNN
	1    6800 4500
	0    -1   -1   0   
$EndComp
$Comp
L power:GND #PWR?
U 1 1 5F0BB169
P 6800 4200
AR Path="/5EF3A6F3/5F0BB169" Ref="#PWR?"  Part="1" 
AR Path="/5EF3A6EB/5F0BB169" Ref="#PWR?"  Part="1" 
F 0 "#PWR?" H 6800 3950 50  0001 C CNN
F 1 "GND" V 6805 4072 50  0000 R CNN
F 2 "" H 6800 4200 50  0001 C CNN
F 3 "" H 6800 4200 50  0001 C CNN
	1    6800 4200
	0    -1   -1   0   
$EndComp
$Comp
L power:GND #PWR?
U 1 1 5F0BB90F
P 6800 3900
AR Path="/5EF3A6F3/5F0BB90F" Ref="#PWR?"  Part="1" 
AR Path="/5EF3A6EB/5F0BB90F" Ref="#PWR?"  Part="1" 
F 0 "#PWR?" H 6800 3650 50  0001 C CNN
F 1 "GND" V 6805 3772 50  0000 R CNN
F 2 "" H 6800 3900 50  0001 C CNN
F 3 "" H 6800 3900 50  0001 C CNN
	1    6800 3900
	0    -1   -1   0   
$EndComp
$Comp
L power:GND #PWR?
U 1 1 5F0BB915
P 6800 3600
AR Path="/5EF3A6F3/5F0BB915" Ref="#PWR?"  Part="1" 
AR Path="/5EF3A6EB/5F0BB915" Ref="#PWR?"  Part="1" 
F 0 "#PWR?" H 6800 3350 50  0001 C CNN
F 1 "GND" V 6805 3472 50  0000 R CNN
F 2 "" H 6800 3600 50  0001 C CNN
F 3 "" H 6800 3600 50  0001 C CNN
	1    6800 3600
	0    -1   -1   0   
$EndComp
$Comp
L power:GND #PWR?
U 1 1 5F0BD1F9
P 6800 3300
AR Path="/5EF3A6F3/5F0BD1F9" Ref="#PWR?"  Part="1" 
AR Path="/5EF3A6EB/5F0BD1F9" Ref="#PWR?"  Part="1" 
F 0 "#PWR?" H 6800 3050 50  0001 C CNN
F 1 "GND" V 6805 3172 50  0000 R CNN
F 2 "" H 6800 3300 50  0001 C CNN
F 3 "" H 6800 3300 50  0001 C CNN
	1    6800 3300
	0    -1   -1   0   
$EndComp
$Comp
L power:GND #PWR?
U 1 1 5F0BD1FF
P 6800 3000
AR Path="/5EF3A6F3/5F0BD1FF" Ref="#PWR?"  Part="1" 
AR Path="/5EF3A6EB/5F0BD1FF" Ref="#PWR?"  Part="1" 
F 0 "#PWR?" H 6800 2750 50  0001 C CNN
F 1 "GND" V 6805 2872 50  0000 R CNN
F 2 "" H 6800 3000 50  0001 C CNN
F 3 "" H 6800 3000 50  0001 C CNN
	1    6800 3000
	0    -1   -1   0   
$EndComp
$Comp
L power:GND #PWR?
U 1 1 5F0BF331
P 6800 2700
AR Path="/5EF3A6F3/5F0BF331" Ref="#PWR?"  Part="1" 
AR Path="/5EF3A6EB/5F0BF331" Ref="#PWR?"  Part="1" 
F 0 "#PWR?" H 6800 2450 50  0001 C CNN
F 1 "GND" V 6805 2572 50  0000 R CNN
F 2 "" H 6800 2700 50  0001 C CNN
F 3 "" H 6800 2700 50  0001 C CNN
	1    6800 2700
	0    -1   -1   0   
$EndComp
$Comp
L power:GND #PWR?
U 1 1 5F0BF337
P 6800 2400
AR Path="/5EF3A6F3/5F0BF337" Ref="#PWR?"  Part="1" 
AR Path="/5EF3A6EB/5F0BF337" Ref="#PWR?"  Part="1" 
F 0 "#PWR?" H 6800 2150 50  0001 C CNN
F 1 "GND" V 6805 2272 50  0000 R CNN
F 2 "" H 6800 2400 50  0001 C CNN
F 3 "" H 6800 2400 50  0001 C CNN
	1    6800 2400
	0    -1   -1   0   
$EndComp
$Comp
L power:GND #PWR?
U 1 1 5F0BF961
P 6800 2100
AR Path="/5EF3A6F3/5F0BF961" Ref="#PWR?"  Part="1" 
AR Path="/5EF3A6EB/5F0BF961" Ref="#PWR?"  Part="1" 
F 0 "#PWR?" H 6800 1850 50  0001 C CNN
F 1 "GND" V 6805 1972 50  0000 R CNN
F 2 "" H 6800 2100 50  0001 C CNN
F 3 "" H 6800 2100 50  0001 C CNN
	1    6800 2100
	0    -1   -1   0   
$EndComp
$Comp
L power:GND #PWR?
U 1 1 5F0BF967
P 6800 2000
AR Path="/5EF3A6F3/5F0BF967" Ref="#PWR?"  Part="1" 
AR Path="/5EF3A6EB/5F0BF967" Ref="#PWR?"  Part="1" 
F 0 "#PWR?" H 6800 1750 50  0001 C CNN
F 1 "GND" V 6805 1872 50  0000 R CNN
F 2 "" H 6800 2000 50  0001 C CNN
F 3 "" H 6800 2000 50  0001 C CNN
	1    6800 2000
	0    -1   -1   0   
$EndComp
$Comp
L KIT_Power:+1V8_VADJ #PWR?
U 1 1 60539BD1
P 3600 5650
AR Path="/5EF3A6E9/60539BD1" Ref="#PWR?"  Part="1" 
AR Path="/5EF3A6EB/60539BD1" Ref="#PWR?"  Part="1" 
F 0 "#PWR?" H 3600 5500 50  0001 C CNN
F 1 "+1V8_VADJ" H 3615 5823 50  0000 C CNN
F 2 "" H 3600 5650 50  0001 C CNN
F 3 "" H 3600 5650 50  0001 C CNN
	1    3600 5650
	1    0    0    -1  
$EndComp
$Comp
L Device:C C?
U 1 1 60539BD9
P 3850 5900
AR Path="/5EF3A6E9/60539BD9" Ref="C?"  Part="1" 
AR Path="/5EF3A6EB/60539BD9" Ref="C152"  Part="1" 
F 0 "C152" H 3965 5991 50  0000 L CNN
F 1 "1uF" H 3965 5900 50  0000 L CNN
F 2 "Capacitor_SMD:C_0402_1005Metric" H 3888 5750 50  0001 C CNN
F 3 "~" H 3850 5900 50  0001 C CNN
F 4 "16 V" H 3965 5809 50  0000 L CNN "info"
F 5 "AVT-IPE" H 3850 5900 50  0001 C CNN "stock"
	1    3850 5900
	1    0    0    -1  
$EndComp
Wire Wire Line
	3600 5700 3600 5650
Wire Wire Line
	3600 6100 3600 6150
$Comp
L power:GND #PWR?
U 1 1 60539BE1
P 3600 6150
AR Path="/5EF3A6E9/60539BE1" Ref="#PWR?"  Part="1" 
AR Path="/5EF3A6EB/60539BE1" Ref="#PWR?"  Part="1" 
F 0 "#PWR?" H 3600 5900 50  0001 C CNN
F 1 "GND" H 3605 5977 50  0000 C CNN
F 2 "" H 3600 6150 50  0001 C CNN
F 3 "" H 3600 6150 50  0001 C CNN
	1    3600 6150
	1    0    0    -1  
$EndComp
Wire Wire Line
	3600 5700 3850 5700
Wire Wire Line
	3600 6100 3850 6100
Wire Wire Line
	3850 5750 3850 5700
Wire Wire Line
	3850 6050 3850 6100
Connection ~ 3850 5700
Wire Wire Line
	3850 5700 4500 5700
$Comp
L KIT_Power:+1V8_VADJ #PWR?
U 1 1 6054FF80
P 8400 5750
AR Path="/5EF3A6E9/6054FF80" Ref="#PWR?"  Part="1" 
AR Path="/5EF3A6EB/6054FF80" Ref="#PWR?"  Part="1" 
F 0 "#PWR?" H 8400 5600 50  0001 C CNN
F 1 "+1V8_VADJ" H 8415 5923 50  0000 C CNN
F 2 "" H 8400 5750 50  0001 C CNN
F 3 "" H 8400 5750 50  0001 C CNN
	1    8400 5750
	-1   0    0    -1  
$EndComp
$Comp
L Device:C C?
U 1 1 6054FF88
P 8150 6000
AR Path="/5EF3A6E9/6054FF88" Ref="C?"  Part="1" 
AR Path="/5EF3A6EB/6054FF88" Ref="C155"  Part="1" 
F 0 "C155" H 8265 6091 50  0000 L CNN
F 1 "1uF" H 8265 6000 50  0000 L CNN
F 2 "Capacitor_SMD:C_0402_1005Metric" H 8188 5850 50  0001 C CNN
F 3 "~" H 8150 6000 50  0001 C CNN
F 4 "16 V" H 8265 5909 50  0000 L CNN "info"
F 5 "AVT-IPE" H 8150 6000 50  0001 C CNN "stock"
	1    8150 6000
	-1   0    0    -1  
$EndComp
Wire Wire Line
	8400 5800 8400 5750
Wire Wire Line
	8400 6200 8400 6250
$Comp
L power:GND #PWR?
U 1 1 6054FF90
P 8400 6250
AR Path="/5EF3A6E9/6054FF90" Ref="#PWR?"  Part="1" 
AR Path="/5EF3A6EB/6054FF90" Ref="#PWR?"  Part="1" 
F 0 "#PWR?" H 8400 6000 50  0001 C CNN
F 1 "GND" H 8405 6077 50  0000 C CNN
F 2 "" H 8400 6250 50  0001 C CNN
F 3 "" H 8400 6250 50  0001 C CNN
	1    8400 6250
	-1   0    0    -1  
$EndComp
Wire Wire Line
	8400 5800 8150 5800
Wire Wire Line
	8400 6200 8150 6200
Wire Wire Line
	8150 5850 8150 5800
Wire Wire Line
	8150 6150 8150 6200
Connection ~ 8150 5800
Wire Wire Line
	8150 5800 6800 5800
Text Label 7650 5500 2    50   ~ 0
ATCA_Z1_HA0
Text Label 7650 5200 2    50   ~ 0
ATCA_Z1_HA4
Text Label 7650 5300 2    50   ~ 0
ATCA_Z1_HA5
Text Label 4350 5100 0    50   ~ 0
ATCA_Z1_HA6
Text Label 4350 5200 0    50   ~ 0
ATCA_Z1_HA7
Wire Wire Line
	7650 5500 6800 5500
Wire Wire Line
	7650 5200 6800 5200
Wire Wire Line
	7650 5300 6800 5300
Wire Wire Line
	4350 5100 5200 5100
Wire Wire Line
	4350 5200 5200 5200
Wire Wire Line
	4350 5500 5200 5500
Wire Wire Line
	4350 5400 5200 5400
Text Label 4350 5500 0    50   ~ 0
ATCA_Z1_HA3
Text Label 4350 5400 0    50   ~ 0
ATCA_Z1_HA2
Wire Wire Line
	5200 3900 3950 3900
Wire Wire Line
	5200 4000 3950 4000
Text GLabel 8050 5100 2    50   Input ~ 0
ATCA_Z1_HA[0..7]
Text GLabel 7300 5000 2    50   BiDi ~ 0
ATCA_Z1_IPMB_A_SDA
Text GLabel 7300 4900 2    50   BiDi ~ 0
ATCA_Z1_IPMB_A_SCL
Text GLabel 4650 4900 0    50   BiDi ~ 0
ATCA_Z1_IPMB_B_SDA
Text GLabel 4650 4800 0    50   BiDi ~ 0
ATCA_Z1_IPMB_B_SCL
Wire Wire Line
	7650 5600 6800 5600
Text Label 7650 5600 2    50   ~ 0
ATCA_Z1_HA1
Entry Wire Line
	7650 5200 7750 5100
Entry Wire Line
	7650 5300 7750 5200
Entry Wire Line
	7650 5500 7750 5400
Entry Wire Line
	7650 5600 7750 5500
Wire Bus Line
	7750 5100 8050 5100
Text GLabel 3950 5000 0    50   Input ~ 0
ATCA_Z1_HA[0..7]
Entry Wire Line
	4350 5100 4250 5000
Entry Wire Line
	4350 5200 4250 5100
Entry Wire Line
	4350 5400 4250 5300
Entry Wire Line
	4350 5500 4250 5400
Wire Bus Line
	4250 5000 3950 5000
Wire Wire Line
	4650 4800 5200 4800
Wire Wire Line
	5200 4900 4650 4900
Wire Wire Line
	7300 4900 6800 4900
Wire Wire Line
	6800 5000 7300 5000
Wire Wire Line
	5200 4500 3950 4500
Wire Wire Line
	5200 4600 3950 4600
Wire Wire Line
	5200 4200 3950 4200
Wire Wire Line
	5200 4300 3950 4300
$Comp
L power:GND #PWR?
U 1 1 610990C0
P 5200 5600
AR Path="/5EF3A6F3/610990C0" Ref="#PWR?"  Part="1" 
AR Path="/5EF3A6EB/610990C0" Ref="#PWR?"  Part="1" 
F 0 "#PWR?" H 5200 5350 50  0001 C CNN
F 1 "GND" V 5205 5472 50  0000 R CNN
F 2 "" H 5200 5600 50  0001 C CNN
F 3 "" H 5200 5600 50  0001 C CNN
	1    5200 5600
	0    1    1    0   
$EndComp
$Comp
L power:GND #PWR?
U 1 1 6109969D
P 5200 5800
AR Path="/5EF3A6F3/6109969D" Ref="#PWR?"  Part="1" 
AR Path="/5EF3A6EB/6109969D" Ref="#PWR?"  Part="1" 
F 0 "#PWR?" H 5200 5550 50  0001 C CNN
F 1 "GND" V 5205 5672 50  0000 R CNN
F 2 "" H 5200 5800 50  0001 C CNN
F 3 "" H 5200 5800 50  0001 C CNN
	1    5200 5800
	0    1    1    0   
$EndComp
Text Label 4250 3900 0    50   ~ 0
X1_EEPROM_SCL
Text Label 4250 4000 0    50   ~ 0
X1_EEPROM_SDA
Text Label 4250 4200 0    50   ~ 0
X1_EEPROM_WP
Text Label 4250 4300 0    50   ~ 0
X0_EEPROM_WP
Text Label 4250 4500 0    50   ~ 0
X0_EEPROM_SCL
Text Label 4250 4600 0    50   ~ 0
X0_EEPROM_SDA
Text Label 7700 4000 2    50   ~ 0
SPI_CS0_B
Text Label 7700 4100 2    50   ~ 0
SPI_CS1_B
Text Label 7700 4300 2    50   ~ 0
SPI_CS2_B
Text Label 7700 4400 2    50   ~ 0
SPI_CLK
Text Label 7700 4600 2    50   ~ 0
SPI_MISO
Text Label 7700 4700 2    50   ~ 0
SPI_MOSI
Text GLabel 3650 3800 0    50   BiDi ~ 0
B45_IO_[0..23]
Entry Wire Line
	3850 3800 3950 3900
Entry Wire Line
	3850 3900 3950 4000
Entry Wire Line
	3850 4100 3950 4200
Entry Wire Line
	3850 4200 3950 4300
Entry Wire Line
	3850 4400 3950 4500
Entry Wire Line
	3850 4500 3950 4600
Wire Bus Line
	3850 3800 3650 3800
Text GLabel 8400 3900 2    50   BiDi ~ 0
B45_IO_[0..23]
Entry Wire Line
	8200 3900 8100 4000
Entry Wire Line
	8200 4000 8100 4100
Entry Wire Line
	8200 4200 8100 4300
Entry Wire Line
	8200 4300 8100 4400
Entry Wire Line
	8200 4500 8100 4600
Entry Wire Line
	8200 4600 8100 4700
Wire Bus Line
	8200 3900 8400 3900
Wire Wire Line
	6800 4000 8100 4000
Wire Wire Line
	6800 4100 8100 4100
Wire Wire Line
	6800 4300 8100 4300
Wire Wire Line
	6800 4400 8100 4400
Wire Wire Line
	6800 4600 8100 4600
Wire Wire Line
	6800 4700 8100 4700
Text GLabel 1850 1150 0    50   BiDi ~ 0
B66_IO_[0..51]
Wire Bus Line
	2050 1150 1850 1150
Text Notes 9000 1900 2    50   ~ 0
PG_M2C - Not connected in Motherboard!
Wire Notes Line
	9100 1950 9100 1750
Wire Notes Line
	6200 1750 6200 1950
Text Label 4000 3900 0    20   ~ 0
B45_IO_21
Wire Wire Line
	7200 1900 6800 1900
NoConn ~ 7200 1900
Wire Notes Line
	6200 1950 9100 1950
Wire Notes Line
	6200 1750 9100 1750
Text Label 4000 4000 0    20   ~ 0
B45_IO_19
Text Label 4000 4200 0    20   ~ 0
B45_IO_17
Text Label 4000 4300 0    20   ~ 0
B45_IO_16
Text Label 4000 4500 0    20   ~ 0
B45_IO_0
Text Label 4000 4600 0    20   ~ 0
B45_IO_4
Text Label 8000 4000 2    20   ~ 0
B45_IO_13
Text Label 8000 4100 2    20   ~ 0
B45_IO_12
Text Label 8000 4300 2    20   ~ 0
B45_IO_7
Text Label 8000 4400 2    20   ~ 0
B45_IO_6
Text Label 8000 4600 2    20   ~ 0
B45_IO_9
Text Label 8000 4700 2    20   ~ 0
B45_IO_8
Text GLabel 1850 1300 0    50   BiDi ~ 0
B65_IO_[0..51]
Wire Bus Line
	2050 1300 1850 1300
Text Label 4250 2000 0    50   ~ 0
B65_IO_13
Wire Wire Line
	5200 2000 4250 2000
Wire Wire Line
	5200 2100 4250 2100
Wire Wire Line
	5200 2400 4250 2400
Wire Wire Line
	5200 2500 4250 2500
Wire Wire Line
	5200 2700 4250 2700
Wire Wire Line
	5200 2800 4250 2800
Wire Wire Line
	5200 3000 4250 3000
Wire Wire Line
	5200 3100 4250 3100
Wire Wire Line
	5200 3300 4250 3300
Wire Wire Line
	5200 3400 4250 3400
Wire Wire Line
	5200 3600 4250 3600
Wire Wire Line
	5200 3700 4250 3700
Wire Wire Line
	7750 2200 6800 2200
Wire Wire Line
	7750 2300 6800 2300
Wire Wire Line
	7750 2500 6800 2500
Wire Wire Line
	7750 2600 6800 2600
Wire Wire Line
	7750 2800 6800 2800
Wire Wire Line
	7750 2900 6800 2900
Wire Wire Line
	7750 3100 6800 3100
Wire Wire Line
	7750 3200 6800 3200
Wire Wire Line
	7750 3400 6800 3400
Wire Wire Line
	7750 3500 6800 3500
Wire Wire Line
	7750 3700 6800 3700
Wire Wire Line
	7750 3800 6800 3800
Text Label 4250 2100 0    50   ~ 0
B65_IO_1
Text Label 7750 2200 2    50   ~ 0
B65_IO_12
Text Label 7750 2300 2    50   ~ 0
B65_IO_23
Text Label 4250 2400 0    50   ~ 0
B65_IO_22
Text Label 7750 2500 2    50   ~ 0
B65_IO_27
Text Label 4250 2500 0    50   ~ 0
B65_IO_37
Text Label 7750 2600 2    50   ~ 0
B65_IO_28
Text Label 4250 2700 0    50   ~ 0
B65_IO_33
Text Label 4250 2800 0    50   ~ 0
B65_IO_36
Text Label 7750 2800 2    50   ~ 0
B65_IO_39
Text Label 7750 2900 2    50   ~ 0
B65_IO_40
Text Label 4250 3000 0    50   ~ 0
B65_IO_35
Text Label 7750 3200 2    50   ~ 0
B65_IO_45
Text Label 4250 3100 0    50   ~ 0
B65_IO_46
Text Label 7750 3100 2    50   ~ 0
B65_IO_43
Text Label 4250 3300 0    50   ~ 0
B65_IO_48
Text Label 7750 3800 2    50   ~ 0
B65_IO_8
Text Label 7750 3700 2    50   ~ 0
B65_IO_9
Text Label 7750 3400 2    50   ~ 0
B65_IO_14
Text Label 7750 3500 2    50   ~ 0
B65_IO_15
Text Label 4250 3400 0    50   ~ 0
B65_IO_7
Text Label 4250 3600 0    50   ~ 0
B65_IO_6
Text Label 4250 3700 0    50   ~ 0
B65_IO_4
$Comp
L power:PWR_FLAG #FLG?
U 1 1 5FB0B431
P 4500 5700
F 0 "#FLG?" H 4500 5775 50  0001 C CNN
F 1 "PWR_FLAG" H 4500 5873 50  0000 C CNN
F 2 "" H 4500 5700 50  0001 C CNN
F 3 "~" H 4500 5700 50  0001 C CNN
	1    4500 5700
	-1   0    0    1   
$EndComp
Connection ~ 4500 5700
Wire Wire Line
	4500 5700 5200 5700
Wire Bus Line
	7750 5100 7750 5500
Wire Bus Line
	4250 5000 4250 5400
Wire Bus Line
	8200 3900 8200 4600
Wire Bus Line
	3850 3800 3850 4500
$EndSCHEMATC
