EESchema Schematic File Version 4
EELAYER 30 0
EELAYER END
$Descr A3 16535 11693
encoding utf-8
Sheet 3 28
Title "ZynqMP Mezzanine FMC+ (BuZZyBoard)"
Date "2020-10-02"
Rev "1.0"
Comp "Karlsruhe Institute of Technology (KIT)"
Comment1 "Institute for Data Processing and Electronics (IPE)"
Comment2 "Luis Ardila"
Comment3 ""
Comment4 ""
$EndDescr
$Comp
L KIT_FPGA:ZU4EG-B900 U1
U 14 1 5F589CFA
P 4800 1600
F 0 "U1" H 5950 1890 60  0000 C CNN
F 1 "ZU4EG-B900" H 5950 1784 60  0000 C CNN
F 2 "KIT_Package_BGA:BGA-900_30x30_31.0x31.0mm" H 3100 1400 50  0001 C CNN
F 3 "" H 3100 1400 50  0001 C CNN
	14   4800 1600
	1    0    0    -1  
$EndComp
Entry Wire Line
	8350 1700 8250 1800
Entry Wire Line
	8350 1800 8250 1900
Entry Wire Line
	8350 1900 8250 2000
Entry Wire Line
	8350 2000 8250 2100
Wire Bus Line
	8350 1700 8500 1700
Text GLabel 8500 1700 2    50   BiDi ~ 0
BOOT[0..3]
Text Label 8250 1800 2    50   ~ 0
BOOT0
Text Label 8250 1900 2    50   ~ 0
BOOT1
Text Label 8250 2000 2    50   ~ 0
BOOT2
Text Label 8250 2100 2    50   ~ 0
BOOT3
Wire Wire Line
	8250 1900 7100 1900
Wire Wire Line
	8250 1800 7100 1800
Wire Wire Line
	8250 2100 7100 2100
Wire Wire Line
	8250 2000 7100 2000
Wire Wire Line
	4700 1600 4800 1600
Wire Wire Line
	3900 950  3900 1000
Wire Wire Line
	3900 1000 4350 1000
$Comp
L Device:C C1
U 1 1 5E428D2E
P 3900 1200
F 0 "C1" H 4015 1246 50  0000 L CNN
F 1 "0.1uF" H 4015 1155 50  0000 L CNN
F 2 "Capacitor_SMD:C_0402_1005Metric" H 3938 1050 50  0001 C CNN
F 3 "~" H 3900 1200 50  0001 C CNN
F 4 "16 V" H 3900 1200 50  0001 C CNN "info"
F 5 "AVT-IPE" H 3900 1200 50  0001 C CNN "stock"
	1    3900 1200
	1    0    0    -1  
$EndComp
Wire Wire Line
	3900 1400 3900 1350
Wire Wire Line
	3900 1050 3900 1000
Connection ~ 3900 1000
$Comp
L Device:C C2
U 1 1 5F589D09
P 4350 1200
F 0 "C2" H 4465 1246 50  0000 L CNN
F 1 "0.1uF" H 4465 1155 50  0000 L CNN
F 2 "Capacitor_SMD:C_0402_1005Metric" H 4388 1050 50  0001 C CNN
F 3 "~" H 4350 1200 50  0001 C CNN
F 4 "16 V" H 4350 1200 50  0001 C CNN "info"
F 5 "AVT-IPE" H 4350 1200 50  0001 C CNN "stock"
	1    4350 1200
	1    0    0    -1  
$EndComp
$Comp
L power:GND #PWR?
U 1 1 5F589D0A
P 4350 1400
F 0 "#PWR?" H 4350 1150 50  0001 C CNN
F 1 "GND" H 4355 1227 50  0000 C CNN
F 2 "" H 4350 1400 50  0001 C CNN
F 3 "" H 4350 1400 50  0001 C CNN
	1    4350 1400
	1    0    0    -1  
$EndComp
Wire Wire Line
	4350 1400 4350 1350
Wire Wire Line
	4350 1050 4350 1000
Wire Wire Line
	4350 1000 4700 1000
Wire Wire Line
	4700 1000 4700 1600
Connection ~ 4350 1000
Text Label 3850 1800 0    50   ~ 0
PS_DONE
Wire Wire Line
	3850 1800 4800 1800
Text Label 14350 4300 0    50   ~ 0
PS_DONE
$Comp
L Device:R R3
U 1 1 5F589D0B
P 15150 3900
F 0 "R3" H 15080 3854 50  0000 R CNN
F 1 "100k" H 15080 3945 50  0000 R CNN
F 2 "Resistor_SMD:R_0402_1005Metric" V 15080 3900 50  0001 C CNN
F 3 "~" H 15150 3900 50  0001 C CNN
F 4 "1%" H 15150 3900 50  0001 C CNN "info"
F 5 "AVT-IPE" H 15150 3900 50  0001 C CNN "stock"
	1    15150 3900
	-1   0    0    1   
$EndComp
$Comp
L Device:LED D1
U 1 1 5F589D0C
P 15550 3800
F 0 "D1" V 15589 3682 50  0000 R CNN
F 1 "RED" V 15498 3682 50  0000 R CNN
F 2 "LED_SMD:LED_0603_1608Metric" H 15550 3800 50  0001 C CNN
F 3 "~" H 15550 3800 50  0001 C CNN
F 4 "450-711" H 15550 3800 50  0001 C CNN "rs#"
	1    15550 3800
	0    -1   -1   0   
$EndComp
$Comp
L Device:R R4
U 1 1 5F589D0D
P 15550 4100
F 0 "R4" H 15480 4054 50  0000 R CNN
F 1 "100" H 15480 4145 50  0000 R CNN
F 2 "Resistor_SMD:R_0402_1005Metric" V 15480 4100 50  0001 C CNN
F 3 "~" H 15550 4100 50  0001 C CNN
F 4 "" V 15550 4100 50  0001 C CNN "manf"
F 5 "" V 15550 4100 50  0001 C CNN "manf#"
F 6 "AVT-IPE" V 15550 4100 50  0001 C CNN "stock"
	1    15550 4100
	-1   0    0    1   
$EndComp
Wire Wire Line
	15550 3650 15550 3600
Wire Wire Line
	15150 3600 15150 3750
Wire Wire Line
	15150 3600 15350 3600
Wire Wire Line
	15350 3550 15350 3600
Connection ~ 15350 3600
Wire Wire Line
	15350 3600 15550 3600
Wire Wire Line
	15550 4250 15550 4300
Wire Wire Line
	14350 4300 15150 4300
Wire Wire Line
	15150 4050 15150 4300
Connection ~ 15150 4300
Wire Wire Line
	15150 4300 15550 4300
$Comp
L KIT_Power:+3V3_STBY #PWR?
U 1 1 5F589D29
P 3900 950
F 0 "#PWR?" H 3900 800 50  0001 C CNN
F 1 "+3V3_STBY" H 3915 1123 50  0000 C CNN
F 2 "" H 3900 950 50  0001 C CNN
F 3 "" H 3900 950 50  0001 C CNN
	1    3900 950 
	1    0    0    -1  
$EndComp
$Comp
L KIT_Power:+3V3_STBY #PWR?
U 1 1 5F589D2B
P 15350 3550
F 0 "#PWR?" H 15350 3400 50  0001 C CNN
F 1 "+3V3_STBY" H 15365 3723 50  0000 C CNN
F 2 "" H 15350 3550 50  0001 C CNN
F 3 "" H 15350 3550 50  0001 C CNN
	1    15350 3550
	1    0    0    -1  
$EndComp
Wire Wire Line
	10300 4250 10900 4250
$Comp
L power:GND #PWR?
U 1 1 61892B85
P 11450 4700
F 0 "#PWR?" H 11450 4450 50  0001 C CNN
F 1 "GND" H 11455 4527 50  0000 C CNN
F 2 "" H 11450 4700 50  0001 C CNN
F 3 "" H 11450 4700 50  0001 C CNN
	1    11450 4700
	1    0    0    -1  
$EndComp
$Comp
L Device:R R5
U 1 1 61892B8B
P 10900 4450
F 0 "R5" H 10970 4496 50  0000 L CNN
F 1 "10k" H 10970 4405 50  0000 L CNN
F 2 "Resistor_SMD:R_0402_1005Metric" V 10830 4450 50  0001 C CNN
F 3 "~" H 10900 4450 50  0001 C CNN
F 4 "AVT-IPE" H 10900 4450 50  0001 C CNN "stock"
	1    10900 4450
	1    0    0    -1  
$EndComp
Wire Wire Line
	10900 4250 10900 4300
Connection ~ 10900 4250
Wire Wire Line
	10900 4250 11150 4250
Wire Wire Line
	10900 4600 10900 4650
Wire Wire Line
	10900 4650 11450 4650
Wire Wire Line
	11450 4650 11450 4700
Wire Wire Line
	11450 4650 11450 4450
Connection ~ 11450 4650
$Comp
L Device:LED D2
U 1 1 61892B9A
P 11450 3850
F 0 "D2" V 11489 3733 50  0000 R CNN
F 1 "GRN" V 11398 3733 50  0000 R CNN
F 2 "LED_SMD:LED_0603_1608Metric" H 11450 3850 50  0001 C CNN
F 3 "~" H 11450 3850 50  0001 C CNN
F 4 "691-0408" V 11450 3850 50  0001 C CNN "rs#"
F 5 "Broadcom" H 11450 3850 50  0001 C CNN "manf"
F 6 "HSME-C191" H 11450 3850 50  0001 C CNN "manf#"
	1    11450 3850
	0    -1   -1   0   
$EndComp
Wire Wire Line
	11450 4000 11450 4050
$Comp
L Device:R R6
U 1 1 61892BA1
P 11450 3500
F 0 "R6" H 11520 3546 50  0000 L CNN
F 1 "470" H 11520 3455 50  0000 L CNN
F 2 "Resistor_SMD:R_0402_1005Metric" V 11380 3500 50  0001 C CNN
F 3 "~" H 11450 3500 50  0001 C CNN
	1    11450 3500
	1    0    0    -1  
$EndComp
Wire Wire Line
	11450 3650 11450 3700
$Comp
L KIT_Power:+3V3_STBY #PWR?
U 1 1 61892BA8
P 11450 3350
F 0 "#PWR?" H 11450 3200 50  0001 C CNN
F 1 "+3V3_STBY" H 11465 3523 50  0000 C CNN
F 2 "" H 11450 3350 50  0001 C CNN
F 3 "" H 11450 3350 50  0001 C CNN
	1    11450 3350
	1    0    0    -1  
$EndComp
Text Label 7900 1600 2    50   ~ 0
PS_ERROR_OUT
Wire Wire Line
	7900 1600 7100 1600
Text Label 7900 1700 2    50   ~ 0
PS_ERROR_STATUS
Wire Wire Line
	7900 1700 7100 1700
Text Label 10300 4250 0    50   ~ 0
PS_ERROR_OUT
Text Label 12350 4250 0    50   ~ 0
PS_ERROR_STATUS
Wire Wire Line
	12350 4250 12950 4250
$Comp
L KIT_Transistor_FET:FDV301N Q3
U 1 1 618F8505
P 13400 4250
F 0 "Q3" H 13606 4296 50  0000 L CNN
F 1 "FDV301N" H 13606 4205 50  0000 L CNN
F 2 "Package_TO_SOT_SMD:SOT-23" H 13600 4175 50  0001 L CIN
F 3 "https://media.digikey.com/pdf/Data%20Sheets/Fairchild%20PDFs/FDV301N.pdf" H 13400 4250 50  0001 L CNN
	1    13400 4250
	1    0    0    -1  
$EndComp
$Comp
L power:GND #PWR?
U 1 1 5F589D3A
P 13500 4700
F 0 "#PWR?" H 13500 4450 50  0001 C CNN
F 1 "GND" H 13505 4527 50  0000 C CNN
F 2 "" H 13500 4700 50  0001 C CNN
F 3 "" H 13500 4700 50  0001 C CNN
	1    13500 4700
	1    0    0    -1  
$EndComp
$Comp
L Device:R R9
U 1 1 5F589D3B
P 12950 4450
F 0 "R9" H 13020 4496 50  0000 L CNN
F 1 "10k" H 13020 4405 50  0000 L CNN
F 2 "Resistor_SMD:R_0402_1005Metric" V 12880 4450 50  0001 C CNN
F 3 "~" H 12950 4450 50  0001 C CNN
F 4 "AVT-IPE" H 12950 4450 50  0001 C CNN "stock"
	1    12950 4450
	1    0    0    -1  
$EndComp
Wire Wire Line
	12950 4250 12950 4300
Connection ~ 12950 4250
Wire Wire Line
	12950 4250 13200 4250
Wire Wire Line
	12950 4600 12950 4650
Wire Wire Line
	12950 4650 13500 4650
Wire Wire Line
	13500 4650 13500 4700
Wire Wire Line
	13500 4650 13500 4450
Connection ~ 13500 4650
$Comp
L Device:LED D4
U 1 1 5F589D3C
P 13500 3850
F 0 "D4" V 13539 3733 50  0000 R CNN
F 1 "GRN" V 13448 3733 50  0000 R CNN
F 2 "LED_SMD:LED_0603_1608Metric" H 13500 3850 50  0001 C CNN
F 3 "~" H 13500 3850 50  0001 C CNN
F 4 "691-0408" V 13500 3850 50  0001 C CNN "rs#"
F 5 "Broadcom" H 13500 3850 50  0001 C CNN "manf"
F 6 "HSME-C191" H 13500 3850 50  0001 C CNN "manf#"
	1    13500 3850
	0    -1   -1   0   
$EndComp
Wire Wire Line
	13500 4000 13500 4050
$Comp
L Device:R R10
U 1 1 5F589D3D
P 13500 3500
F 0 "R10" H 13570 3546 50  0000 L CNN
F 1 "470" H 13570 3455 50  0000 L CNN
F 2 "Resistor_SMD:R_0402_1005Metric" V 13430 3500 50  0001 C CNN
F 3 "~" H 13500 3500 50  0001 C CNN
	1    13500 3500
	1    0    0    -1  
$EndComp
Wire Wire Line
	13500 3650 13500 3700
$Comp
L KIT_Power:+3V3_STBY #PWR?
U 1 1 5F589D3E
P 13500 3350
F 0 "#PWR?" H 13500 3200 50  0001 C CNN
F 1 "+3V3_STBY" H 13515 3523 50  0000 C CNN
F 2 "" H 13500 3350 50  0001 C CNN
F 3 "" H 13500 3350 50  0001 C CNN
	1    13500 3350
	1    0    0    -1  
$EndComp
Wire Wire Line
	7600 4800 7600 5000
Wire Wire Line
	7600 5000 7250 5000
Wire Wire Line
	6950 5000 6650 5000
Wire Wire Line
	5150 5200 5350 5200
Wire Wire Line
	5350 5200 5350 5300
Wire Wire Line
	5350 6100 5200 6100
Wire Wire Line
	5350 6100 6200 6100
Connection ~ 5350 6100
Wire Wire Line
	5150 5300 5350 5300
Connection ~ 5350 5300
Wire Wire Line
	5350 5300 5350 6100
$Comp
L Device:C C3
U 1 1 5F589D42
P 5750 5850
F 0 "C3" H 5635 5804 50  0000 R CNN
F 1 "10nF" H 5635 5895 50  0000 R CNN
F 2 "Capacitor_SMD:C_0402_1005Metric" H 5788 5700 50  0001 C CNN
F 3 "~" H 5750 5850 50  0001 C CNN
F 4 "AVT-IPE" H 5750 5850 50  0001 C CNN "stock"
	1    5750 5850
	-1   0    0    1   
$EndComp
Wire Wire Line
	5250 5700 5750 5700
Wire Wire Line
	5750 6000 5250 6000
Wire Wire Line
	5250 5900 5150 5900
$Comp
L KIT_Transistor_FET:FDV301N Q1
U 1 1 5E4AD002
P 11350 4250
F 0 "Q1" H 11556 4296 50  0000 L CNN
F 1 "FDV301N" H 11556 4205 50  0000 L CNN
F 2 "Package_TO_SOT_SMD:SOT-23" H 11550 4175 50  0001 L CIN
F 3 "https://media.digikey.com/pdf/Data%20Sheets/Fairchild%20PDFs/FDV301N.pdf" H 11350 4250 50  0001 L CNN
	1    11350 4250
	1    0    0    -1  
$EndComp
$Comp
L KIT_Power:+1V8_STBY #PWR?
U 1 1 5F589D12
P 9200 2600
F 0 "#PWR?" H 9200 2450 50  0001 C CNN
F 1 "+1V8_STBY" H 9215 2773 50  0000 C CNN
F 2 "" H 9200 2600 50  0001 C CNN
F 3 "" H 9200 2600 50  0001 C CNN
	1    9200 2600
	1    0    0    -1  
$EndComp
$Comp
L Device:C C4
U 1 1 5F589D13
P 7700 2900
F 0 "C4" H 7815 2946 50  0000 L CNN
F 1 "1uF" H 7815 2855 50  0000 L CNN
F 2 "Capacitor_SMD:C_0402_1005Metric" H 7738 2750 50  0001 C CNN
F 3 "~" H 7700 2900 50  0001 C CNN
F 4 "16 V" H 7600 3000 50  0001 C CNN "info"
F 5 "AVT-IPE" H 7700 2900 50  0001 C CNN "stock"
	1    7700 2900
	1    0    0    -1  
$EndComp
Wire Wire Line
	7700 2750 7700 2700
$Comp
L KIT_Power:+1V8_STBY #PWR?
U 1 1 5E7BF962
P 7600 4800
F 0 "#PWR?" H 7600 4650 50  0001 C CNN
F 1 "+1V8_STBY" H 7615 4973 50  0000 C CNN
F 2 "" H 7600 4800 50  0001 C CNN
F 3 "" H 7600 4800 50  0001 C CNN
	1    7600 4800
	1    0    0    -1  
$EndComp
$Comp
L power:GND #PWR?
U 1 1 5F589D04
P 9200 3150
F 0 "#PWR?" H 9200 2900 50  0001 C CNN
F 1 "GND" H 9205 2977 50  0000 C CNN
F 2 "" H 9200 3150 50  0001 C CNN
F 3 "" H 9200 3150 50  0001 C CNN
	1    9200 3150
	1    0    0    -1  
$EndComp
Wire Wire Line
	9200 2600 9200 2700
Wire Wire Line
	8600 2700 9200 2700
Wire Wire Line
	9200 3100 8600 3100
Wire Wire Line
	9200 3100 9200 3150
Wire Wire Line
	8300 3100 7700 3100
Wire Wire Line
	7100 2700 7250 2700
Connection ~ 7700 2700
Wire Wire Line
	7700 2700 8300 2700
Wire Wire Line
	7700 3050 7700 3100
Connection ~ 7700 3100
Wire Wire Line
	7700 3100 7250 3100
$Comp
L Device:C C131
U 1 1 5F589D26
P 6650 5550
F 0 "C131" H 6765 5596 50  0000 L CNN
F 1 "1uF" H 6765 5505 50  0000 L CNN
F 2 "Capacitor_SMD:C_0402_1005Metric" H 6688 5400 50  0001 C CNN
F 3 "~" H 6650 5550 50  0001 C CNN
F 4 "16 V" H 6550 5650 50  0001 C CNN "info"
F 5 "AVT-IPE" H 6650 5550 50  0001 C CNN "stock"
	1    6650 5550
	1    0    0    -1  
$EndComp
Wire Wire Line
	6650 5400 6650 5000
Connection ~ 6650 5000
Wire Wire Line
	6650 5000 6200 5000
$Comp
L KIT_Oscillator:OSC U22
U 1 1 5F589D14
P 1350 2500
F 0 "U22" H 1900 2650 60  0000 C CNN
F 1 "OSC 33.333333 MHz" H 1900 2250 60  0000 C CNN
F 2 "KIT_Crystal:Crystal_SMD_2016-4Pin_2.0x1.6mm" H 1350 2500 50  0001 C CNN
F 3 "https://media.digikey.com/pdf/Data%20Sheets/SiTime%20PDFs/SiT8008A.pdf" H 1350 2500 50  0001 C CNN
F 4 "SIT8008AI-71-33E-33.333333E " H 1350 2500 50  0001 C CNN "manf#"
F 5 "SiTIME" H 1350 2500 50  0001 C CNN "manf"
F 6 "1473-SIT8008AI-71-33E-33.333333E-ND" H 1350 2500 50  0001 C CNN "digikey#"
F 7 "" H 1350 2500 50  0001 C CNN "stock"
F 8 "33.333333MHz XO (Standard) HCMOS, LVCMOS Oscillator 3.3V Enable/Disable 4-SMD, No Lead" H 1350 2500 50  0001 C CNN "info"
	1    1350 2500
	1    0    0    -1  
$EndComp
$Comp
L Device:R R19
U 1 1 5F589D15
P 1100 2500
F 0 "R19" V 893 2500 50  0000 C CNN
F 1 "1k" V 984 2500 50  0000 C CNN
F 2 "Resistor_SMD:R_0402_1005Metric" V 1030 2500 50  0001 C CNN
F 3 "~" H 1100 2500 50  0001 C CNN
F 4 "1%" H 1100 2500 50  0001 C CNN "info"
F 5 "AVT-IPE" H 1100 2500 50  0001 C CNN "stock"
	1    1100 2500
	0    -1   1    0   
$EndComp
Wire Wire Line
	950  2300 950  2500
$Comp
L power:GND #PWR?
U 1 1 5F0ADCBB
P 950 2650
F 0 "#PWR?" H 950 2400 50  0001 C CNN
F 1 "GND" H 955 2477 50  0000 C CNN
F 2 "" H 950 2650 50  0001 C CNN
F 3 "" H 950 2650 50  0001 C CNN
	1    950  2650
	-1   0    0    -1  
$EndComp
Wire Wire Line
	950  2600 950  2650
Wire Wire Line
	1350 2600 950  2600
Wire Wire Line
	1250 2500 1350 2500
Text Label 1350 2500 2    20   ~ 0
sFS_OE
$Comp
L KIT_Power:+3V3_STBY #PWR?
U 1 1 5F0ADCC6
P 2450 1800
F 0 "#PWR?" H 2450 1650 50  0001 C CNN
F 1 "+3V3_STBY" H 2465 1973 50  0000 C CNN
F 2 "" H 2450 1800 50  0001 C CNN
F 3 "" H 2450 1800 50  0001 C CNN
	1    2450 1800
	-1   0    0    -1  
$EndComp
$Comp
L KIT_Power:+3V3_STBY #PWR?
U 1 1 5F0ADCCC
P 950 2300
F 0 "#PWR?" H 950 2150 50  0001 C CNN
F 1 "+3V3_STBY" H 965 2473 50  0000 C CNN
F 2 "" H 950 2300 50  0001 C CNN
F 3 "" H 950 2300 50  0001 C CNN
	1    950  2300
	-1   0    0    -1  
$EndComp
$Comp
L Device:C C153
U 1 1 5F0DC50F
P 2750 2100
F 0 "C153" H 2865 2146 50  0000 L CNN
F 1 "0.1uF" H 2865 2055 50  0000 L CNN
F 2 "Capacitor_SMD:C_0402_1005Metric" H 2788 1950 50  0001 C CNN
F 3 "~" H 2750 2100 50  0001 C CNN
F 4 "16 V" H 2750 2100 50  0001 C CNN "info"
F 5 "AVT-IPE" H 2750 2100 50  0001 C CNN "stock"
	1    2750 2100
	1    0    0    -1  
$EndComp
$Comp
L power:GND #PWR?
U 1 1 5F589D1A
P 2750 2300
F 0 "#PWR?" H 2750 2050 50  0001 C CNN
F 1 "GND" H 2755 2127 50  0000 C CNN
F 2 "" H 2750 2300 50  0001 C CNN
F 3 "" H 2750 2300 50  0001 C CNN
	1    2750 2300
	1    0    0    -1  
$EndComp
Wire Wire Line
	2750 2300 2750 2250
Wire Wire Line
	2750 1850 2750 1950
Wire Wire Line
	2750 1850 2450 1850
Wire Wire Line
	2450 1850 2450 2500
Wire Wire Line
	2450 1800 2450 1850
Connection ~ 2450 1850
$Comp
L Device:Ferrite_Bead FB1
U 1 1 5F589D1E
P 7100 5000
F 0 "FB1" V 6826 5000 50  0000 C CNN
F 1 "120 Ohms @ 100MHz" V 6917 5000 50  0000 C CNN
F 2 "Inductor_SMD:L_0402_1005Metric" V 7030 5000 50  0001 C CNN
F 3 "https://www.murata.com/en-us/products/productdata/8796740059166/ENFA0018.pdf" H 7100 5000 50  0001 C CNN
F 4 "120 Ohms @ 100MHz 1 Power Line Ferrite Bead 0402 (1005 Metric) 2A 55mOhm" V 7100 5000 50  0001 C CNN "info"
F 5 "Murata" V 7100 5000 50  0001 C CNN "manf"
F 6 "BLM15PX121SN1D" V 7100 5000 50  0001 C CNN "manf#"
	1    7100 5000
	0    1    1    0   
$EndComp
$Comp
L power:PWR_FLAG #FLG?
U 1 1 5F589D20
P 7700 2700
F 0 "#FLG?" H 7700 2775 50  0001 C CNN
F 1 "PWR_FLAG" H 7700 2873 50  0000 C CNN
F 2 "" H 7700 2700 50  0001 C CNN
F 3 "~" H 7700 2700 50  0001 C CNN
	1    7700 2700
	1    0    0    -1  
$EndComp
$Comp
L power:PWR_FLAG #FLG?
U 1 1 5F589D21
P 7700 3100
F 0 "#FLG?" H 7700 3175 50  0001 C CNN
F 1 "PWR_FLAG" H 7700 3273 50  0000 C CNN
F 2 "" H 7700 3100 50  0001 C CNN
F 3 "~" H 7700 3100 50  0001 C CNN
	1    7700 3100
	-1   0    0    1   
$EndComp
$Comp
L power:PWR_FLAG #FLG?
U 1 1 5F846FA5
P 5350 5000
F 0 "#FLG?" H 5350 5075 50  0001 C CNN
F 1 "PWR_FLAG" H 5350 5173 50  0000 C CNN
F 2 "" H 5350 5000 50  0001 C CNN
F 3 "~" H 5350 5000 50  0001 C CNN
	1    5350 5000
	1    0    0    -1  
$EndComp
Connection ~ 5350 5000
Wire Wire Line
	5350 5000 5150 5000
Text GLabel 4550 2300 0    50   Input ~ 0
TMS
Text GLabel 4550 2200 0    50   Output ~ 0
TDO
Text GLabel 4550 2100 0    50   Input ~ 0
TDI
Text GLabel 4550 2000 0    50   Input ~ 0
TCK
Wire Wire Line
	4550 2000 4800 2000
Wire Wire Line
	4800 2100 4550 2100
Wire Wire Line
	4550 2200 4800 2200
Wire Wire Line
	4800 2300 4550 2300
$Comp
L Device:Ferrite_Bead FB3
U 1 1 5F20EBD5
P 8450 2700
F 0 "FB3" V 8176 2700 50  0000 C CNN
F 1 "120 Ohms @ 100MHz" V 8267 2700 50  0000 C CNN
F 2 "Inductor_SMD:L_0402_1005Metric" V 8380 2700 50  0001 C CNN
F 3 "https://www.murata.com/en-us/products/productdata/8796740059166/ENFA0018.pdf" H 8450 2700 50  0001 C CNN
F 4 "120 Ohms @ 100MHz 1 Power Line Ferrite Bead 0402 (1005 Metric) 2A 55mOhm" V 8450 2700 50  0001 C CNN "info"
F 5 "Murata" V 8450 2700 50  0001 C CNN "manf"
F 6 "BLM15PX121SN1D" V 8450 2700 50  0001 C CNN "manf#"
	1    8450 2700
	0    1    1    0   
$EndComp
$Comp
L Device:Ferrite_Bead FB4
U 1 1 5F212150
P 8450 3100
F 0 "FB4" V 8632 3100 50  0000 C CNN
F 1 "120 Ohms @ 100MHz" V 8723 3100 50  0000 C CNN
F 2 "Inductor_SMD:L_0402_1005Metric" V 8380 3100 50  0001 C CNN
F 3 "https://www.murata.com/en-us/products/productdata/8796740059166/ENFA0018.pdf" H 8450 3100 50  0001 C CNN
F 4 "120 Ohms @ 100MHz 1 Power Line Ferrite Bead 0402 (1005 Metric) 2A 55mOhm" V 8450 3100 50  0001 C CNN "info"
F 5 "Murata" V 8450 3100 50  0001 C CNN "manf"
F 6 "BLM15PX121SN1D" V 8450 3100 50  0001 C CNN "manf#"
	1    8450 3100
	0    1    1    0   
$EndComp
Text Label 6300 5000 0    50   ~ 0
VCCADC
Text Label 5450 5700 0    50   ~ 0
DXN
Text Label 5450 6000 0    50   ~ 0
DXP
Text Label 7800 2700 0    50   ~ 0
VCC_PSADC
Text Label 7800 3100 0    50   ~ 0
GND_PSADC
Wire Wire Line
	6650 5700 6650 6100
Text Label 3850 2600 0    50   ~ 0
PS_REF_CLK
$Comp
L Device:Crystal Y3
U 1 1 5F150B53
P 11100 1600
F 0 "Y3" H 11100 1868 50  0000 C CNN
F 1 "32.768kHz" H 11100 1777 50  0000 C CNN
F 2 "Crystal:Crystal_SMD_2012-2Pin_2.0x1.2mm" H 11100 1600 50  0001 C CNN
F 3 "https://www.ecsxtal.com/store/pdf/ECX-12R.pdf" H 11100 1600 50  0001 C CNN
F 4 "32.768kHz ±10ppm Crystal 9pF 70 kOhms 2-SMD, No Lead" H 11100 1600 50  0001 C CNN "info"
F 5 "ECS Inc." H 11100 1600 50  0001 C CNN "manf"
F 6 "ECS-.327-9-12R-C-TR" H 11100 1600 50  0001 C CNN "manf#"
F 7 "XC2744CT-ND" H 11100 1600 50  0001 C CNN "digikey#"
F 8 " 520-.327-9-12R-C-T " H 11100 1600 50  0001 C CNN "mouser#"
	1    11100 1600
	1    0    0    -1  
$EndComp
$Comp
L Device:C C283
U 1 1 5F1A430E
P 11400 1850
F 0 "C283" H 11515 1896 50  0000 L CNN
F 1 "9pF" H 11515 1805 50  0000 L CNN
F 2 "Capacitor_SMD:C_0402_1005Metric" H 11438 1700 50  0001 C CNN
F 3 "~" H 11400 1850 50  0001 C CNN
	1    11400 1850
	1    0    0    -1  
$EndComp
$Comp
L Device:C C282
U 1 1 5F1AB005
P 10800 1850
F 0 "C282" H 10915 1896 50  0000 L CNN
F 1 "9pF" H 10915 1805 50  0000 L CNN
F 2 "Capacitor_SMD:C_0402_1005Metric" H 10838 1700 50  0001 C CNN
F 3 "~" H 10800 1850 50  0001 C CNN
	1    10800 1850
	1    0    0    -1  
$EndComp
$Comp
L Device:R R83
U 1 1 5F1AC563
P 11100 1150
F 0 "R83" V 10893 1150 50  0000 C CNN
F 1 "2.7M" V 10984 1150 50  0000 C CNN
F 2 "Resistor_SMD:R_0402_1005Metric" V 11030 1150 50  0001 C CNN
F 3 "~" H 11100 1150 50  0001 C CNN
F 4 "ATV-IPE" V 11100 1150 50  0001 C CNN "stock"
	1    11100 1150
	0    1    1    0   
$EndComp
Wire Wire Line
	10950 1150 10800 1150
Wire Wire Line
	10800 1150 10800 1600
Wire Wire Line
	11250 1150 11400 1150
Wire Wire Line
	11400 1150 11400 1600
$Comp
L power:GND #PWR?
U 1 1 5F1B5B50
P 11400 2000
F 0 "#PWR?" H 11400 1750 50  0001 C CNN
F 1 "GND" H 11405 1827 50  0000 C CNN
F 2 "" H 11400 2000 50  0001 C CNN
F 3 "" H 11400 2000 50  0001 C CNN
	1    11400 2000
	1    0    0    -1  
$EndComp
$Comp
L power:GND #PWR?
U 1 1 5F1B66A5
P 10800 2000
F 0 "#PWR?" H 10800 1750 50  0001 C CNN
F 1 "GND" H 10805 1827 50  0000 C CNN
F 2 "" H 10800 2000 50  0001 C CNN
F 3 "" H 10800 2000 50  0001 C CNN
	1    10800 2000
	1    0    0    -1  
$EndComp
Wire Wire Line
	10800 1600 10950 1600
Wire Wire Line
	11250 1600 11400 1600
Connection ~ 10800 1600
Wire Wire Line
	10800 1600 10800 1700
Connection ~ 11400 1600
Wire Wire Line
	11400 1600 11400 1700
Wire Wire Line
	11400 1600 11750 1600
Text Label 11750 1600 2    50   ~ 0
PS_PADI
Text Label 10450 1600 0    50   ~ 0
PS_PADO
Wire Wire Line
	10450 1600 10800 1600
Text Label 7900 2300 2    50   ~ 0
PS_PADO
Wire Wire Line
	7100 2300 7900 2300
Wire Wire Line
	7100 2200 7900 2200
Text Label 7900 2200 2    50   ~ 0
PS_PADI
Text Label 3850 1900 0    50   ~ 0
PS_INIT_B
$Comp
L Device:R R84
U 1 1 5F2A913D
P 12700 1350
F 0 "R84" H 12770 1396 50  0000 L CNN
F 1 "4.7k" H 12770 1305 50  0000 L CNN
F 2 "Resistor_SMD:R_0402_1005Metric" V 12630 1350 50  0001 C CNN
F 3 "~" H 12700 1350 50  0001 C CNN
F 4 "AVT-IPE" H 12700 1350 50  0001 C CNN "stock"
	1    12700 1350
	1    0    0    -1  
$EndComp
Wire Wire Line
	12700 1200 12700 1150
Wire Wire Line
	3850 1900 4800 1900
Text Label 12150 1600 0    50   ~ 0
PS_INIT_B
$Comp
L KIT_Power:+3V3_STBY #PWR?
U 1 1 5F2D6CFA
P 12700 1150
F 0 "#PWR?" H 12700 1000 50  0001 C CNN
F 1 "+3V3_STBY" H 12715 1323 50  0000 C CNN
F 2 "" H 12700 1150 50  0001 C CNN
F 3 "" H 12700 1150 50  0001 C CNN
	1    12700 1150
	-1   0    0    -1  
$EndComp
Wire Wire Line
	12700 1500 12700 1600
Wire Wire Line
	12700 1600 12150 1600
$Comp
L Device:R R85
U 1 1 5F2EA0D8
P 13650 1350
F 0 "R85" H 13720 1396 50  0000 L CNN
F 1 "4.7k" H 13720 1305 50  0000 L CNN
F 2 "Resistor_SMD:R_0402_1005Metric" V 13580 1350 50  0001 C CNN
F 3 "~" H 13650 1350 50  0001 C CNN
F 4 "AVT-IPE" H 13650 1350 50  0001 C CNN "stock"
	1    13650 1350
	1    0    0    -1  
$EndComp
Wire Wire Line
	13650 1200 13650 1150
Text Label 13100 1600 0    50   ~ 0
PS_PROG_B
$Comp
L KIT_Power:+3V3_STBY #PWR?
U 1 1 5F2EA0E0
P 13650 1150
F 0 "#PWR?" H 13650 1000 50  0001 C CNN
F 1 "+3V3_STBY" H 13665 1323 50  0000 C CNN
F 2 "" H 13650 1150 50  0001 C CNN
F 3 "" H 13650 1150 50  0001 C CNN
	1    13650 1150
	-1   0    0    -1  
$EndComp
Wire Wire Line
	13650 1500 13650 1600
Wire Wire Line
	13650 1600 13100 1600
$Comp
L Device:C C284
U 1 1 5F2EE07F
P 13650 1850
F 0 "C284" H 13765 1896 50  0000 L CNN
F 1 "0.1uF" H 13765 1805 50  0000 L CNN
F 2 "Capacitor_SMD:C_0402_1005Metric" H 13688 1700 50  0001 C CNN
F 3 "~" H 13650 1850 50  0001 C CNN
F 4 "16 V" H 13650 1850 50  0001 C CNN "info"
F 5 "AVT-IPE" H 13650 1850 50  0001 C CNN "stock"
	1    13650 1850
	1    0    0    -1  
$EndComp
$Comp
L power:GND #PWR?
U 1 1 5F2EF3DD
P 13650 2000
F 0 "#PWR?" H 13650 1750 50  0001 C CNN
F 1 "GND" H 13655 1827 50  0000 C CNN
F 2 "" H 13650 2000 50  0001 C CNN
F 3 "" H 13650 2000 50  0001 C CNN
	1    13650 2000
	1    0    0    -1  
$EndComp
Wire Wire Line
	13650 1700 13650 1600
Connection ~ 13650 1600
Text Label 3850 2500 0    50   ~ 0
PS_PROG_B
Wire Wire Line
	3850 2500 4800 2500
Wire Wire Line
	3850 2400 4800 2400
Text Label 3850 2400 0    50   ~ 0
PS_POR_B
$Comp
L KIT_Sensor_Temperature:MCP9902 U24
U 1 1 607A9C40
P 13700 8950
F 0 "U24" H 13725 9716 50  0000 C CNN
F 1 "MCP9902" H 13725 9625 50  0000 C CNN
F 2 "Package_SON:WSON-8-1EP_2x2mm_P0.5mm_EP0.9x1.6mm" H 13500 8950 50  0001 L BNN
F 3 "http://ww1.microchip.com/downloads/en/DeviceDoc/20005382C.pdf" H 13700 8950 50  0001 L BNN
F 4 "Microchip Technology" H 13700 8950 50  0001 C CNN "manf"
F 5 "MCP9902T-1E/RW" H 13700 8950 50  0001 C CNN "manf#"
F 6 "MCP9902T-1E/RWCT-ND" H 13700 8950 50  0001 C CNN "digikey#"
	1    13700 8950
	1    0    0    -1  
$EndComp
Wire Wire Line
	12950 8650 13050 8650
Wire Wire Line
	13050 8750 12950 8750
Wire Wire Line
	12750 8950 13050 8950
Wire Wire Line
	13050 9050 12750 9050
$Comp
L power:GND #PWR?
U 1 1 60863601
P 14500 9450
F 0 "#PWR?" H 14500 9200 50  0001 C CNN
F 1 "GND" H 14505 9277 50  0000 C CNN
F 2 "" H 14500 9450 50  0001 C CNN
F 3 "" H 14500 9450 50  0001 C CNN
	1    14500 9450
	1    0    0    -1  
$EndComp
Wire Wire Line
	14500 9450 14500 9350
Wire Wire Line
	14500 9250 14400 9250
Wire Wire Line
	14400 9350 14500 9350
Connection ~ 14500 9350
Wire Wire Line
	14500 9350 14500 9250
Text GLabel 12950 8750 0    50   BiDi ~ 0
PMBUS_CONN_SDA
Text GLabel 14650 8650 2    50   Input ~ 0
PMBUS_CONN_INT_B
Text GLabel 12950 8650 0    50   Output ~ 0
PMBUS_CONN_SCL
Wire Wire Line
	14650 8650 14400 8650
$Comp
L KIT_Power:+3V3_STBY #PWR?
U 1 1 6094CB1E
P 14450 8050
F 0 "#PWR?" H 14450 7900 50  0001 C CNN
F 1 "+3V3_STBY" H 14465 8223 50  0000 C CNN
F 2 "" H 14450 8050 50  0001 C CNN
F 3 "" H 14450 8050 50  0001 C CNN
	1    14450 8050
	1    0    0    -1  
$EndComp
$Comp
L Device:C C292
U 1 1 60C7E763
P 15050 9250
F 0 "C292" H 15165 9296 50  0000 L CNN
F 1 "0.1uF" H 15165 9205 50  0000 L CNN
F 2 "Capacitor_SMD:C_0402_1005Metric" H 15088 9100 50  0001 C CNN
F 3 "~" H 15050 9250 50  0001 C CNN
F 4 "16 V" H 15050 9250 50  0001 C CNN "info"
F 5 "AVT-IPE" H 15050 9250 50  0001 C CNN "stock"
	1    15050 9250
	1    0    0    -1  
$EndComp
$Comp
L power:GND #PWR?
U 1 1 60C7E769
P 15050 9400
F 0 "#PWR?" H 15050 9150 50  0001 C CNN
F 1 "GND" H 15055 9227 50  0000 C CNN
F 2 "" H 15050 9400 50  0001 C CNN
F 3 "" H 15050 9400 50  0001 C CNN
	1    15050 9400
	1    0    0    -1  
$EndComp
$Comp
L KIT_Power:+3V3_STBY #PWR?
U 1 1 60C7E772
P 15050 9100
F 0 "#PWR?" H 15050 8950 50  0001 C CNN
F 1 "+3V3_STBY" H 15065 9273 50  0000 C CNN
F 2 "" H 15050 9100 50  0001 C CNN
F 3 "" H 15050 9100 50  0001 C CNN
	1    15050 9100
	1    0    0    -1  
$EndComp
$Comp
L Device:R R104
U 1 1 5F096DB2
P 14600 8350
F 0 "R104" H 14670 8396 50  0000 L CNN
F 1 "10k" H 14670 8305 50  0000 L CNN
F 2 "Resistor_SMD:R_0402_1005Metric" V 14530 8350 50  0001 C CNN
F 3 "~" H 14600 8350 50  0001 C CNN
F 4 "AVT-IPE" H 14600 8350 50  0001 C CNN "stock"
	1    14600 8350
	1    0    0    -1  
$EndComp
Wire Wire Line
	14600 8500 14600 8750
Wire Wire Line
	14400 8750 14600 8750
Wire Wire Line
	14600 8150 14450 8150
Wire Wire Line
	14450 8150 14450 8050
Wire Wire Line
	14450 8150 14450 8450
Wire Wire Line
	14450 8450 14400 8450
Connection ~ 14450 8150
Wire Wire Line
	14600 8150 14600 8200
Text Notes 12350 7950 0    50   ~ 0
Address:\n10k -> 1001_100 (r/w)b
$Comp
L Device:R R105
U 1 1 5F2B7335
P 2400 4900
F 0 "R105" H 2330 4946 50  0000 R CNN
F 1 "1k" H 2330 4855 50  0000 R CNN
F 2 "Resistor_SMD:R_0402_1005Metric" V 2330 4900 50  0001 C CNN
F 3 "~" H 2400 4900 50  0001 C CNN
F 4 "1%" H 2400 4900 50  0001 C CNN "info"
F 5 "AVT-IPE" H 2400 4900 50  0001 C CNN "stock"
	1    2400 4900
	-1   0    0    -1  
$EndComp
$Comp
L KIT_Power:+1V8_STBY #PWR?
U 1 1 5F2C66EE
P 2400 4750
F 0 "#PWR?" H 2400 4600 50  0001 C CNN
F 1 "+1V8_STBY" H 2415 4923 50  0000 C CNN
F 2 "" H 2400 4750 50  0001 C CNN
F 3 "" H 2400 4750 50  0001 C CNN
	1    2400 4750
	1    0    0    -1  
$EndComp
Wire Wire Line
	2400 5050 2400 5100
Wire Wire Line
	2400 5100 3150 5100
$Comp
L KIT_FPGA:ZU4EG-B900 U1
U 1 1 5DEF97C4
P 3650 5000
F 0 "U1" H 4150 5290 60  0000 C CNN
F 1 "ZU4EG-B900" H 4150 5184 60  0000 C CNN
F 2 "KIT_Package_BGA:BGA-900_30x30_31.0x31.0mm" H 1950 4800 50  0001 C CNN
F 3 "" H 1950 4800 50  0001 C CNN
	1    3650 5000
	1    0    0    -1  
$EndComp
Wire Wire Line
	3000 5650 3150 5650
Text Notes 2450 6500 0    50   ~ 0
UG570 -> \nPUDC_B: When PUDC_B is High, internal pull-up resistors are disabled on each SelectIO pin, therefore floating. \nPOR_OVERRIDE: Connect to GND for standard longer POR delay
$Comp
L Device:C C293
U 1 1 5F513533
P 6200 5550
F 0 "C293" H 6085 5504 50  0000 R CNN
F 1 "0.1uF" H 6085 5595 50  0000 R CNN
F 2 "Capacitor_SMD:C_0402_1005Metric" H 6238 5400 50  0001 C CNN
F 3 "~" H 6200 5550 50  0001 C CNN
F 4 "16 V" H 6200 5550 50  0001 C CNN "info"
F 5 "AVT-IPE" H 6200 5550 50  0001 C CNN "stock"
	1    6200 5550
	-1   0    0    1   
$EndComp
Wire Wire Line
	5250 6000 5250 5900
Wire Wire Line
	5250 5700 5250 5800
Wire Wire Line
	5250 5800 5150 5800
Wire Wire Line
	6200 5400 6200 5000
Connection ~ 6200 5000
Wire Wire Line
	6200 5000 5350 5000
Wire Wire Line
	6200 5700 6200 6100
Connection ~ 6200 6100
Wire Wire Line
	6200 6100 6650 6100
$Comp
L Device:C C294
U 1 1 5F5FC2DE
P 7250 2900
F 0 "C294" H 7365 2946 50  0000 L CNN
F 1 "0.1uF" H 7365 2855 50  0000 L CNN
F 2 "Capacitor_SMD:C_0402_1005Metric" H 7288 2750 50  0001 C CNN
F 3 "~" H 7250 2900 50  0001 C CNN
F 4 "16 V" H 7250 2900 50  0001 C CNN "info"
F 5 "AVT-IPE" H 7250 2900 50  0001 C CNN "stock"
	1    7250 2900
	1    0    0    -1  
$EndComp
Wire Wire Line
	7250 2750 7250 2700
Connection ~ 7250 2700
Wire Wire Line
	7250 2700 7700 2700
Wire Wire Line
	7250 3050 7250 3100
Connection ~ 7250 3100
Wire Wire Line
	7250 3100 7100 3100
Text Label 7200 6100 2    50   ~ 0
GND_PSADC
Wire Wire Line
	7200 6100 6650 6100
Connection ~ 6650 6100
Wire Wire Line
	5150 5500 5200 5500
Wire Wire Line
	5200 5500 5200 5600
Connection ~ 5200 6100
Wire Wire Line
	5200 6100 5150 6100
Wire Wire Line
	5150 5600 5200 5600
Connection ~ 5200 5600
Wire Wire Line
	5200 5600 5200 6100
Text Label 12750 9050 0    50   ~ 0
DXN
Text Label 12750 8950 0    50   ~ 0
DXP
$Comp
L Device:R R106
U 1 1 5F77D207
P 3050 2600
F 0 "R106" V 2843 2600 50  0000 C CNN
F 1 "33" V 2934 2600 50  0000 C CNN
F 2 "Resistor_SMD:R_0402_1005Metric" V 2980 2600 50  0001 C CNN
F 3 "~" H 3050 2600 50  0001 C CNN
F 4 "1%" H 3050 2600 50  0001 C CNN "info"
F 5 "AVT-IPE" H 3050 2600 50  0001 C CNN "stock"
	1    3050 2600
	0    -1   1    0   
$EndComp
Wire Wire Line
	2900 2600 2800 2600
$Comp
L Connector:TestPoint TP1
U 1 1 5F79AEB2
P 2800 2600
F 0 "TP1" H 2858 2672 50  0000 L CNN
F 1 "TestPoint" H 2858 2627 50  0001 L CNN
F 2 "TestPoint:TestPoint_Pad_D1.0mm" H 3000 2600 50  0001 C CNN
F 3 "~" H 3000 2600 50  0001 C CNN
	1    2800 2600
	-1   0    0    1   
$EndComp
Wire Wire Line
	4800 1700 3550 1700
Wire Wire Line
	3550 1700 3550 1750
$Comp
L power:GND #PWR?
U 1 1 5F589D08
P 3900 1400
F 0 "#PWR?" H 3900 1150 50  0001 C CNN
F 1 "GND" H 3905 1227 50  0000 C CNN
F 2 "" H 3900 1400 50  0001 C CNN
F 3 "" H 3900 1400 50  0001 C CNN
	1    3900 1400
	1    0    0    -1  
$EndComp
$Comp
L power:GND #PWR?
U 1 1 5F7F1E70
P 3550 1750
F 0 "#PWR?" H 3550 1500 50  0001 C CNN
F 1 "GND" H 3555 1577 50  0000 C CNN
F 2 "" H 3550 1750 50  0001 C CNN
F 3 "" H 3550 1750 50  0001 C CNN
	1    3550 1750
	1    0    0    -1  
$EndComp
$Comp
L KIT_Power_Supervisor:MAX16025TE+ U25
U 1 1 5F088F70
P 5900 8750
F 0 "U25" H 6150 8950 50  0000 C CNN
F 1 "MAX16025TE+" H 6300 7500 50  0000 C CNN
F 2 "Package_DFN_QFN:QFN-16-1EP_4x4mm_P0.65mm_EP2.1x2.1mm" H 5850 8750 50  0001 C CNN
F 3 "https://datasheets.maximintegrated.com/en/ds/MAX16025-MAX16030.pdf" H 5850 8750 50  0001 C CNN
F 4 "Maxim Integrated" H 5900 8750 50  0001 C CNN "manf"
F 5 "MAX16025TE+" H 5900 8750 50  0001 C CNN "manf#"
F 6 "190-5788" H 5900 8750 50  0001 C CNN "rs#"
	1    5900 8750
	1    0    0    -1  
$EndComp
$Comp
L Device:C C297
U 1 1 5FA33BE0
P 4850 9750
F 0 "C297" H 4735 9704 50  0000 R CNN
F 1 "0.1uF" H 4735 9795 50  0000 R CNN
F 2 "Capacitor_SMD:C_0402_1005Metric" H 4888 9600 50  0001 C CNN
F 3 "~" H 4850 9750 50  0001 C CNN
F 4 "16 V" H 4850 9750 50  0001 C CNN "info"
F 5 "AVT-IPE" H 4850 9750 50  0001 C CNN "stock"
	1    4850 9750
	-1   0    0    1   
$EndComp
$Comp
L Device:C C296
U 1 1 5FA39E3E
P 4400 9750
F 0 "C296" H 4285 9704 50  0000 R CNN
F 1 "0.1uF" H 4285 9795 50  0000 R CNN
F 2 "Capacitor_SMD:C_0402_1005Metric" H 4438 9600 50  0001 C CNN
F 3 "~" H 4400 9750 50  0001 C CNN
F 4 "16 V" H 4400 9750 50  0001 C CNN "info"
F 5 "AVT-IPE" H 4400 9750 50  0001 C CNN "stock"
	1    4400 9750
	-1   0    0    1   
$EndComp
$Comp
L Device:C C295
U 1 1 5FA3A115
P 3950 9750
F 0 "C295" H 3835 9704 50  0000 R CNN
F 1 "0.1uF" H 3835 9795 50  0000 R CNN
F 2 "Capacitor_SMD:C_0402_1005Metric" H 3988 9600 50  0001 C CNN
F 3 "~" H 3950 9750 50  0001 C CNN
F 4 "16 V" H 3950 9750 50  0001 C CNN "info"
F 5 "AVT-IPE" H 3950 9750 50  0001 C CNN "stock"
	1    3950 9750
	-1   0    0    1   
$EndComp
Wire Wire Line
	4850 9600 4850 9550
Wire Wire Line
	4850 9550 5350 9550
Wire Wire Line
	5350 9450 4400 9450
Wire Wire Line
	4400 9450 4400 9600
Wire Wire Line
	5350 9350 3950 9350
Wire Wire Line
	3950 9350 3950 9600
$Comp
L power:GND #PWR?
U 1 1 5FA4E50B
P 5900 10200
F 0 "#PWR?" H 5900 9950 50  0001 C CNN
F 1 "GND" H 5905 10027 50  0000 C CNN
F 2 "" H 5900 10200 50  0001 C CNN
F 3 "" H 5900 10200 50  0001 C CNN
	1    5900 10200
	1    0    0    -1  
$EndComp
Wire Wire Line
	5900 10200 5900 10100
Wire Wire Line
	5900 10100 6000 10100
Wire Wire Line
	6000 10100 6000 10050
Connection ~ 5900 10100
Wire Wire Line
	5900 10100 5900 10050
$Comp
L power:GND #PWR?
U 1 1 5FA5D273
P 4850 9900
F 0 "#PWR?" H 4850 9650 50  0001 C CNN
F 1 "GND" H 4855 9727 50  0000 C CNN
F 2 "" H 4850 9900 50  0001 C CNN
F 3 "" H 4850 9900 50  0001 C CNN
	1    4850 9900
	1    0    0    -1  
$EndComp
$Comp
L power:GND #PWR?
U 1 1 5FA5D927
P 3950 9900
F 0 "#PWR?" H 3950 9650 50  0001 C CNN
F 1 "GND" H 3955 9727 50  0000 C CNN
F 2 "" H 3950 9900 50  0001 C CNN
F 3 "" H 3950 9900 50  0001 C CNN
	1    3950 9900
	1    0    0    -1  
$EndComp
$Comp
L power:GND #PWR?
U 1 1 5FA5DBA5
P 5250 9950
F 0 "#PWR?" H 5250 9700 50  0001 C CNN
F 1 "GND" H 5255 9777 50  0000 C CNN
F 2 "" H 5250 9950 50  0001 C CNN
F 3 "" H 5250 9950 50  0001 C CNN
	1    5250 9950
	1    0    0    -1  
$EndComp
Wire Wire Line
	5250 9950 5250 9850
Wire Wire Line
	5250 9850 5350 9850
NoConn ~ 5350 9750
NoConn ~ 5350 9650
Text Notes 7500 700  0    50   ~ 0
UG1085: Boot Modes\n
$Comp
L Switch:SW_Push SW1
U 1 1 5F10154F
P 2850 9700
F 0 "SW1" V 2896 9652 50  0000 R CNN
F 1 "SW_Push" V 2805 9652 50  0000 R CNN
F 2 "Button_Switch_SMD:SW_Push_1P1T_NO_CK_KMR2" H 2850 9900 50  0001 C CNN
F 3 "~" H 2850 9900 50  0001 C CNN
F 4 "CKN10687CT-ND" V 2850 9700 50  0001 C CNN "digikey#"
F 5 "135-9542" H 2850 9700 50  0001 C CNN "rs#"
	1    2850 9700
	0    -1   -1   0   
$EndComp
$Comp
L Switch:SW_Push SW2
U 1 1 5F0EECF4
P 3400 9700
F 0 "SW2" V 3446 9652 50  0000 R CNN
F 1 "SW_Push" V 3355 9652 50  0000 R CNN
F 2 "Button_Switch_SMD:SW_Push_1P1T_NO_CK_KMR2" H 3400 9900 50  0001 C CNN
F 3 "~" H 3400 9900 50  0001 C CNN
F 4 "CKN10687CT-ND" V 3400 9700 50  0001 C CNN "digikey#"
F 5 "135-9542" H 3400 9700 50  0001 C CNN "rs#"
	1    3400 9700
	0    -1   -1   0   
$EndComp
$Comp
L power:GND #PWR?
U 1 1 5FA5D6CA
P 4400 9900
F 0 "#PWR?" H 4400 9650 50  0001 C CNN
F 1 "GND" H 4405 9727 50  0000 C CNN
F 2 "" H 4400 9900 50  0001 C CNN
F 3 "" H 4400 9900 50  0001 C CNN
	1    4400 9900
	1    0    0    -1  
$EndComp
$Comp
L power:GND #PWR?
U 1 1 5F17221B
P 3400 9900
F 0 "#PWR?" H 3400 9650 50  0001 C CNN
F 1 "GND" H 3405 9727 50  0000 C CNN
F 2 "" H 3400 9900 50  0001 C CNN
F 3 "" H 3400 9900 50  0001 C CNN
	1    3400 9900
	1    0    0    -1  
$EndComp
$Comp
L power:GND #PWR?
U 1 1 5F1725EA
P 2850 9900
F 0 "#PWR?" H 2850 9650 50  0001 C CNN
F 1 "GND" H 2855 9727 50  0000 C CNN
F 2 "" H 2850 9900 50  0001 C CNN
F 3 "" H 2850 9900 50  0001 C CNN
	1    2850 9900
	1    0    0    -1  
$EndComp
$Comp
L Device:R R?
U 1 1 5F1D6358
P 3400 8500
AR Path="/5EF3A6E9/5F1D6358" Ref="R?"  Part="1" 
AR Path="/5DEF958D/5F1D6358" Ref="R132"  Part="1" 
F 0 "R132" H 3330 8454 50  0000 R CNN
F 1 "10k" H 3330 8545 50  0000 R CNN
F 2 "Resistor_SMD:R_0402_1005Metric" V 3330 8500 50  0001 C CNN
F 3 "~" H 3400 8500 50  0001 C CNN
F 4 "1%" H 3400 8500 50  0001 C CNN "info"
F 5 "AVT-IPE" H 3400 8500 50  0001 C CNN "stock"
	1    3400 8500
	-1   0    0    1   
$EndComp
Wire Wire Line
	5350 8950 3400 8950
Wire Wire Line
	3400 8950 3400 9500
Wire Wire Line
	5350 8850 2850 8850
Wire Wire Line
	2850 8850 2850 9500
$Comp
L Device:R R?
U 1 1 5F20559E
P 2850 8500
AR Path="/5EF3A6E9/5F20559E" Ref="R?"  Part="1" 
AR Path="/5DEF958D/5F20559E" Ref="R131"  Part="1" 
F 0 "R131" H 2780 8454 50  0000 R CNN
F 1 "10k" H 2780 8545 50  0000 R CNN
F 2 "Resistor_SMD:R_0402_1005Metric" V 2780 8500 50  0001 C CNN
F 3 "~" H 2850 8500 50  0001 C CNN
F 4 "1%" H 2850 8500 50  0001 C CNN "info"
F 5 "AVT-IPE" H 2850 8500 50  0001 C CNN "stock"
	1    2850 8500
	-1   0    0    1   
$EndComp
Wire Wire Line
	3400 8650 3400 8950
Connection ~ 3400 8950
Wire Wire Line
	2850 8650 2850 8850
Connection ~ 2850 8850
$Comp
L KIT_Power:+3V3_STBY #PWR?
U 1 1 5F22DC7D
P 2850 8350
F 0 "#PWR?" H 2850 8200 50  0001 C CNN
F 1 "+3V3_STBY" H 2865 8523 50  0000 C CNN
F 2 "" H 2850 8350 50  0001 C CNN
F 3 "" H 2850 8350 50  0001 C CNN
	1    2850 8350
	1    0    0    -1  
$EndComp
$Comp
L KIT_Power:+3V3_STBY #PWR?
U 1 1 5F235E20
P 3400 8350
F 0 "#PWR?" H 3400 8200 50  0001 C CNN
F 1 "+3V3_STBY" H 3415 8523 50  0000 C CNN
F 2 "" H 3400 8350 50  0001 C CNN
F 3 "" H 3400 8350 50  0001 C CNN
	1    3400 8350
	1    0    0    -1  
$EndComp
$Comp
L Device:R R?
U 1 1 5F24B5A4
P 4850 8500
AR Path="/5EF3A6E9/5F24B5A4" Ref="R?"  Part="1" 
AR Path="/5DEF958D/5F24B5A4" Ref="R133"  Part="1" 
F 0 "R133" H 4780 8454 50  0000 R CNN
F 1 "10k" H 4780 8545 50  0000 R CNN
F 2 "Resistor_SMD:R_0402_1005Metric" V 4780 8500 50  0001 C CNN
F 3 "~" H 4850 8500 50  0001 C CNN
F 4 "1%" H 4850 8500 50  0001 C CNN "info"
F 5 "AVT-IPE" H 4850 8500 50  0001 C CNN "stock"
	1    4850 8500
	-1   0    0    1   
$EndComp
$Comp
L KIT_Power:+3V3_STBY #PWR?
U 1 1 5F24B5AB
P 4850 8350
F 0 "#PWR?" H 4850 8200 50  0001 C CNN
F 1 "+3V3_STBY" H 4865 8523 50  0000 C CNN
F 2 "" H 4850 8350 50  0001 C CNN
F 3 "" H 4850 8350 50  0001 C CNN
	1    4850 8350
	1    0    0    -1  
$EndComp
Wire Wire Line
	4850 9150 5350 9150
Wire Wire Line
	4850 8650 4850 9150
Wire Wire Line
	8500 8850 6800 8850
Text Label 8500 8850 2    50   ~ 0
PS_POR_B
$Comp
L Device:R R?
U 1 1 5F290EE2
P 6800 8500
AR Path="/5EF3A6E9/5F290EE2" Ref="R?"  Part="1" 
AR Path="/5DEF958D/5F290EE2" Ref="R136"  Part="1" 
F 0 "R136" H 6730 8454 50  0000 R CNN
F 1 "10k" H 6730 8545 50  0000 R CNN
F 2 "Resistor_SMD:R_0402_1005Metric" V 6730 8500 50  0001 C CNN
F 3 "~" H 6800 8500 50  0001 C CNN
F 4 "1%" H 6800 8500 50  0001 C CNN "info"
F 5 "AVT-IPE" H 6800 8500 50  0001 C CNN "stock"
	1    6800 8500
	-1   0    0    1   
$EndComp
$Comp
L KIT_Power:+3V3_STBY #PWR?
U 1 1 5F290EE8
P 6800 8350
F 0 "#PWR?" H 6800 8200 50  0001 C CNN
F 1 "+3V3_STBY" H 6815 8523 50  0000 C CNN
F 2 "" H 6800 8350 50  0001 C CNN
F 3 "" H 6800 8350 50  0001 C CNN
	1    6800 8350
	1    0    0    -1  
$EndComp
Wire Wire Line
	6800 8650 6800 8850
Connection ~ 6800 8850
Wire Wire Line
	6800 8850 6550 8850
Text Label 3850 2700 0    50   ~ 0
PS_SRST_B
Text Label 8500 8950 2    50   ~ 0
PS_SRST_B
Wire Wire Line
	8500 8950 7300 8950
$Comp
L Device:R R?
U 1 1 5F305A29
P 7300 8500
AR Path="/5EF3A6E9/5F305A29" Ref="R?"  Part="1" 
AR Path="/5DEF958D/5F305A29" Ref="R163"  Part="1" 
F 0 "R163" H 7230 8454 50  0000 R CNN
F 1 "10k" H 7230 8545 50  0000 R CNN
F 2 "Resistor_SMD:R_0402_1005Metric" V 7230 8500 50  0001 C CNN
F 3 "~" H 7300 8500 50  0001 C CNN
F 4 "1%" H 7300 8500 50  0001 C CNN "info"
F 5 "AVT-IPE" H 7300 8500 50  0001 C CNN "stock"
	1    7300 8500
	-1   0    0    1   
$EndComp
$Comp
L KIT_Power:+3V3_STBY #PWR?
U 1 1 5F305A2F
P 7300 8350
F 0 "#PWR?" H 7300 8200 50  0001 C CNN
F 1 "+3V3_STBY" H 7315 8523 50  0000 C CNN
F 2 "" H 7300 8350 50  0001 C CNN
F 3 "" H 7300 8350 50  0001 C CNN
	1    7300 8350
	1    0    0    -1  
$EndComp
Wire Wire Line
	7300 8650 7300 8950
Connection ~ 7300 8950
Wire Wire Line
	7300 8950 6550 8950
$Comp
L Device:LED D8
U 1 1 5F343C55
P 7050 9150
F 0 "D8" H 7043 8987 50  0000 C CNN
F 1 "RED" H 7043 8896 50  0000 C CNN
F 2 "LED_SMD:LED_0603_1608Metric" H 7050 9150 50  0001 C CNN
F 3 "~" H 7050 9150 50  0001 C CNN
F 4 "450-711" H 7050 9150 50  0001 C CNN "rs#"
	1    7050 9150
	1    0    0    -1  
$EndComp
$Comp
L Device:R R164
U 1 1 5F343C5E
P 7800 8500
F 0 "R164" H 7730 8454 50  0000 R CNN
F 1 "240" H 7730 8545 50  0000 R CNN
F 2 "Resistor_SMD:R_0402_1005Metric" V 7730 8500 50  0001 C CNN
F 3 "~" H 7800 8500 50  0001 C CNN
F 4 "" V 7800 8500 50  0001 C CNN "manf"
F 5 "" V 7800 8500 50  0001 C CNN "manf#"
F 6 "AVT-IPE" V 7800 8500 50  0001 C CNN "stock"
	1    7800 8500
	-1   0    0    1   
$EndComp
$Comp
L KIT_Power:+3V3_STBY #PWR?
U 1 1 5F364DDE
P 7800 8350
F 0 "#PWR?" H 7800 8200 50  0001 C CNN
F 1 "+3V3_STBY" H 7815 8523 50  0000 C CNN
F 2 "" H 7800 8350 50  0001 C CNN
F 3 "" H 7800 8350 50  0001 C CNN
	1    7800 8350
	1    0    0    -1  
$EndComp
Wire Wire Line
	7800 8650 7800 9150
Wire Wire Line
	7800 9150 7200 9150
Wire Wire Line
	6900 9150 6550 9150
$Comp
L Device:C C298
U 1 1 5F39363C
P 6250 7950
F 0 "C298" H 6365 7996 50  0000 L CNN
F 1 "0.1uF" H 6365 7905 50  0000 L CNN
F 2 "Capacitor_SMD:C_0402_1005Metric" H 6288 7800 50  0001 C CNN
F 3 "~" H 6250 7950 50  0001 C CNN
F 4 "16 V" H 6250 7950 50  0001 C CNN "info"
F 5 "AVT-IPE" H 6250 7950 50  0001 C CNN "stock"
	1    6250 7950
	1    0    0    -1  
$EndComp
$Comp
L power:GND #PWR?
U 1 1 5F393642
P 6250 8100
F 0 "#PWR?" H 6250 7850 50  0001 C CNN
F 1 "GND" H 6255 7927 50  0000 C CNN
F 2 "" H 6250 8100 50  0001 C CNN
F 3 "" H 6250 8100 50  0001 C CNN
	1    6250 8100
	1    0    0    -1  
$EndComp
$Comp
L KIT_Power:+3V3_STBY #PWR?
U 1 1 5F393648
P 6250 7700
F 0 "#PWR?" H 6250 7550 50  0001 C CNN
F 1 "+3V3_STBY" H 6265 7873 50  0000 C CNN
F 2 "" H 6250 7700 50  0001 C CNN
F 3 "" H 6250 7700 50  0001 C CNN
	1    6250 7700
	1    0    0    -1  
$EndComp
Wire Wire Line
	6250 7700 6250 7750
Wire Wire Line
	6250 7750 6000 7750
Wire Wire Line
	6000 7750 6000 8500
Connection ~ 6250 7750
Wire Wire Line
	6250 7750 6250 7800
$Comp
L Device:R R?
U 1 1 5F3C461A
P 5450 8000
AR Path="/5EF3A6E9/5F3C461A" Ref="R?"  Part="1" 
AR Path="/5DEF958D/5F3C461A" Ref="R135"  Part="1" 
F 0 "R135" H 5380 7954 50  0000 R CNN
F 1 "10k" H 5380 8045 50  0000 R CNN
F 2 "Resistor_SMD:R_0402_1005Metric" V 5380 8000 50  0001 C CNN
F 3 "~" H 5450 8000 50  0001 C CNN
F 4 "1%" H 5450 8000 50  0001 C CNN "info"
F 5 "AVT-IPE" H 5450 8000 50  0001 C CNN "stock"
	1    5450 8000
	-1   0    0    1   
$EndComp
$Comp
L Device:R R?
U 1 1 5F3C5012
P 5450 7600
AR Path="/5EF3A6E9/5F3C5012" Ref="R?"  Part="1" 
AR Path="/5DEF958D/5F3C5012" Ref="R134"  Part="1" 
F 0 "R134" H 5380 7554 50  0000 R CNN
F 1 "4.7k" H 5380 7645 50  0000 R CNN
F 2 "Resistor_SMD:R_0402_1005Metric" V 5380 7600 50  0001 C CNN
F 3 "~" H 5450 7600 50  0001 C CNN
F 4 "1%" H 5450 7600 50  0001 C CNN "info"
F 5 "AVT-IPE" H 5450 7600 50  0001 C CNN "stock"
	1    5450 7600
	-1   0    0    1   
$EndComp
Text Notes 7150 10100 0    50   ~ 0
MAX16025TE+ -->\nRST, OUT1, & OUT2 are open drain\nTOL = 0 --> Vth = 0.5V\nTH1, TH2 = Open --> Vth = Adj\nVinth = Vth * (1 + R1/R2) --> 0.5 V * (1 + 4.7/10) --> 0.735 V\n
Wire Wire Line
	5450 7750 5450 7800
$Comp
L power:GND #PWR?
U 1 1 5F3D3B81
P 5450 8150
F 0 "#PWR?" H 5450 7900 50  0001 C CNN
F 1 "GND" H 5455 7977 50  0000 C CNN
F 2 "" H 5450 8150 50  0001 C CNN
F 3 "" H 5450 8150 50  0001 C CNN
	1    5450 8150
	1    0    0    -1  
$EndComp
Wire Wire Line
	5450 7800 5800 7800
Wire Wire Line
	5800 7800 5800 8300
Connection ~ 5450 7800
Wire Wire Line
	5450 7800 5450 7850
Wire Wire Line
	5900 8500 5900 8300
Wire Wire Line
	5900 8300 5800 8300
Connection ~ 5800 8300
Wire Wire Line
	5800 8300 5800 8500
Connection ~ 2800 2600
Wire Wire Line
	2800 2600 2450 2600
Wire Wire Line
	3200 2600 4800 2600
Text GLabel 1100 8950 0    50   Input ~ 0
SOFT_RST_OUT
$Comp
L KIT_Logic_LevelTranslator:SN74AVC1T45DRLR U26
U 1 1 5FF05994
P 1300 8750
F 0 "U26" H 1800 9040 60  0000 C CNN
F 1 "SN74AVC1T45DRLR" H 1800 8934 60  0000 C CNN
F 2 "Package_TO_SOT_SMD:SOT-666" H 1850 8350 50  0001 C CNN
F 3 "https://www.ti.com/lit/ds/symlink/sn74avc1t45.pdf" H 1300 8750 50  0001 C CNN
F 4 "296-21022-1-ND" H 1300 8750 50  0001 C CNN "digikey#"
	1    1300 8750
	1    0    0    -1  
$EndComp
Wire Wire Line
	2300 8950 3400 8950
Wire Wire Line
	1300 8950 1100 8950
Wire Wire Line
	1300 8850 1200 8850
Wire Wire Line
	1200 8850 1200 9150
$Comp
L power:GND #PWR?
U 1 1 5FF3A52B
P 1200 9150
F 0 "#PWR?" H 1200 8900 50  0001 C CNN
F 1 "GND" H 1205 8977 50  0000 C CNN
F 2 "" H 1200 9150 50  0001 C CNN
F 3 "" H 1200 9150 50  0001 C CNN
	1    1200 9150
	1    0    0    -1  
$EndComp
$Comp
L KIT_Power:+3V3_STBY #PWR?
U 1 1 5FF422DE
P 2400 8350
F 0 "#PWR?" H 2400 8200 50  0001 C CNN
F 1 "+3V3_STBY" H 2415 8523 50  0000 C CNN
F 2 "" H 2400 8350 50  0001 C CNN
F 3 "" H 2400 8350 50  0001 C CNN
	1    2400 8350
	1    0    0    -1  
$EndComp
Wire Wire Line
	2400 8350 2400 8750
Wire Wire Line
	2400 8750 2300 8750
Wire Wire Line
	1300 8750 1200 8750
Wire Wire Line
	1200 8750 1200 8350
$Comp
L KIT_Power:+1V8_STBY #PWR?
U 1 1 5FF59BA3
P 1200 8350
F 0 "#PWR?" H 1200 8200 50  0001 C CNN
F 1 "+1V8_STBY" H 1215 8523 50  0000 C CNN
F 2 "" H 1200 8350 50  0001 C CNN
F 3 "" H 1200 8350 50  0001 C CNN
	1    1200 8350
	1    0    0    -1  
$EndComp
Wire Wire Line
	2300 8850 2400 8850
Wire Wire Line
	2400 8850 2400 8750
Connection ~ 2400 8750
Text Notes 1600 9200 0    50   ~ 0
A --> B\n
$Comp
L Device:C C250
U 1 1 5FFF274F
P 750 7700
F 0 "C250" H 865 7746 50  0000 L CNN
F 1 "0.1uF" H 865 7655 50  0000 L CNN
F 2 "Capacitor_SMD:C_0402_1005Metric" H 788 7550 50  0001 C CNN
F 3 "~" H 750 7700 50  0001 C CNN
F 4 "16 V" H 750 7700 50  0001 C CNN "info"
F 5 "AVT-IPE" H 750 7700 50  0001 C CNN "stock"
	1    750  7700
	1    0    0    -1  
$EndComp
$Comp
L power:GND #PWR?
U 1 1 5FFF2755
P 750 7850
F 0 "#PWR?" H 750 7600 50  0001 C CNN
F 1 "GND" H 755 7677 50  0000 C CNN
F 2 "" H 750 7850 50  0001 C CNN
F 3 "" H 750 7850 50  0001 C CNN
	1    750  7850
	1    0    0    -1  
$EndComp
$Comp
L KIT_Power:+1V8_STBY #PWR?
U 1 1 5FFFEA2D
P 750 7550
F 0 "#PWR?" H 750 7400 50  0001 C CNN
F 1 "+1V8_STBY" H 765 7723 50  0000 C CNN
F 2 "" H 750 7550 50  0001 C CNN
F 3 "" H 750 7550 50  0001 C CNN
	1    750  7550
	1    0    0    -1  
$EndComp
$Comp
L Device:C C300
U 1 1 6003237A
P 2050 7700
F 0 "C300" H 2165 7746 50  0000 L CNN
F 1 "0.1uF" H 2165 7655 50  0000 L CNN
F 2 "Capacitor_SMD:C_0402_1005Metric" H 2088 7550 50  0001 C CNN
F 3 "~" H 2050 7700 50  0001 C CNN
F 4 "16 V" H 2050 7700 50  0001 C CNN "info"
F 5 "AVT-IPE" H 2050 7700 50  0001 C CNN "stock"
	1    2050 7700
	1    0    0    -1  
$EndComp
$Comp
L power:GND #PWR?
U 1 1 60032380
P 2050 7850
F 0 "#PWR?" H 2050 7600 50  0001 C CNN
F 1 "GND" H 2055 7677 50  0000 C CNN
F 2 "" H 2050 7850 50  0001 C CNN
F 3 "" H 2050 7850 50  0001 C CNN
	1    2050 7850
	1    0    0    -1  
$EndComp
$Comp
L KIT_Power:+3V3_STBY #PWR?
U 1 1 6003F6BC
P 2050 7550
F 0 "#PWR?" H 2050 7400 50  0001 C CNN
F 1 "+3V3_STBY" H 2065 7723 50  0000 C CNN
F 2 "" H 2050 7550 50  0001 C CNN
F 3 "" H 2050 7550 50  0001 C CNN
	1    2050 7550
	1    0    0    -1  
$EndComp
Text GLabel 2250 3500 0    50   Input ~ 0
TRST_L
$Comp
L 74xGxx:74LVC1G07 U27
U 1 1 5FB59088
P 2750 3500
F 0 "U27" H 2000 3800 50  0000 C CNN
F 1 "SN74LVC1G07DRLR" H 2300 3700 50  0000 C CNN
F 2 "Package_TO_SOT_SMD:SOT-553" H 2750 3500 50  0001 C CNN
F 3 "http://www.ti.com/lit/ds/symlink/sn74lvc1g07.pdf" H 2750 3500 50  0001 C CNN
F 4 "Texas Instruments" H 2750 3500 50  0001 C CNN "manf"
F 5 "SN74LVC1G07DRLR" H 2750 3500 50  0001 C CNN "manf#"
F 6 "770-5339" H 2750 3500 50  0001 C CNN "rs#"
F 7 "296-18010-1-ND" H 2750 3500 50  0001 C CNN "digikey#"
	1    2750 3500
	1    0    0    -1  
$EndComp
Wire Wire Line
	3000 3500 3550 3500
Wire Wire Line
	3550 3500 3550 2700
Wire Wire Line
	3550 2700 4800 2700
Wire Wire Line
	2450 3500 2250 3500
Text Notes 3100 3600 0    50   ~ 0
pulled up in supervisor IC
$Comp
L power:GND #PWR?
U 1 1 5FBB6389
P 2750 3800
F 0 "#PWR?" H 2750 3550 50  0001 C CNN
F 1 "GND" H 2755 3627 50  0000 C CNN
F 2 "" H 2750 3800 50  0001 C CNN
F 3 "" H 2750 3800 50  0001 C CNN
	1    2750 3800
	1    0    0    -1  
$EndComp
Wire Wire Line
	2750 3800 2750 3600
$Comp
L KIT_Power:+3V3_STBY #PWR?
U 1 1 5FBCC75F
P 2750 3200
F 0 "#PWR?" H 2750 3050 50  0001 C CNN
F 1 "+3V3_STBY" H 2765 3373 50  0000 C CNN
F 2 "" H 2750 3200 50  0001 C CNN
F 3 "" H 2750 3200 50  0001 C CNN
	1    2750 3200
	-1   0    0    -1  
$EndComp
Wire Wire Line
	2750 3200 2750 3400
$Comp
L KIT_Power:+3V3_STBY #PWR?
U 1 1 5FC55FCE
P 1200 3350
F 0 "#PWR?" H 1200 3200 50  0001 C CNN
F 1 "+3V3_STBY" H 1215 3523 50  0000 C CNN
F 2 "" H 1200 3350 50  0001 C CNN
F 3 "" H 1200 3350 50  0001 C CNN
	1    1200 3350
	-1   0    0    -1  
$EndComp
$Comp
L power:GND #PWR?
U 1 1 5FC19953
P 1200 3650
F 0 "#PWR?" H 1200 3400 50  0001 C CNN
F 1 "GND" H 1205 3477 50  0000 C CNN
F 2 "" H 1200 3650 50  0001 C CNN
F 3 "" H 1200 3650 50  0001 C CNN
	1    1200 3650
	1    0    0    -1  
$EndComp
$Comp
L Device:C C302
U 1 1 5FC1994D
P 1200 3500
F 0 "C302" H 1315 3546 50  0000 L CNN
F 1 "0.1uF" H 1315 3455 50  0000 L CNN
F 2 "Capacitor_SMD:C_0402_1005Metric" H 1238 3350 50  0001 C CNN
F 3 "~" H 1200 3500 50  0001 C CNN
F 4 "16 V" H 1200 3500 50  0001 C CNN "info"
F 5 "AVT-IPE" H 1200 3500 50  0001 C CNN "stock"
	1    1200 3500
	1    0    0    -1  
$EndComp
$Comp
L Jumper:SolderJumper_3_Open JP1
U 1 1 5F9E87B1
P 11250 6250
F 0 "JP1" V 11250 6318 50  0000 L CNN
F 1 "0" H 11250 6364 50  0001 C CNN
F 2 "KIT_Jumper:Jumper_0402" H 11250 6250 50  0001 C CNN
F 3 "~" H 11250 6250 50  0001 C CNN
	1    11250 6250
	0    1    1    0   
$EndComp
$Comp
L KIT_Power:+3V3_STBY #PWR?
U 1 1 5FA141BE
P 11250 6050
F 0 "#PWR?" H 11250 5900 50  0001 C CNN
F 1 "+3V3_STBY" H 11265 6223 50  0000 C CNN
F 2 "" H 11250 6050 50  0001 C CNN
F 3 "" H 11250 6050 50  0001 C CNN
	1    11250 6050
	1    0    0    -1  
$EndComp
$Comp
L power:GND #PWR?
U 1 1 5FA1468C
P 11250 6450
F 0 "#PWR?" H 11250 6200 50  0001 C CNN
F 1 "GND" H 11255 6277 50  0000 C CNN
F 2 "" H 11250 6450 50  0001 C CNN
F 3 "" H 11250 6450 50  0001 C CNN
	1    11250 6450
	1    0    0    -1  
$EndComp
Text Label 10750 6250 0    50   ~ 0
BOOT0
Wire Wire Line
	10750 6250 11100 6250
$Comp
L Jumper:SolderJumper_3_Open JP2
U 1 1 5FA23091
P 12150 6250
F 0 "JP2" V 12150 6318 50  0000 L CNN
F 1 "1" H 12150 6364 50  0001 C CNN
F 2 "KIT_Jumper:Jumper_0402" H 12150 6250 50  0001 C CNN
F 3 "~" H 12150 6250 50  0001 C CNN
	1    12150 6250
	0    1    1    0   
$EndComp
$Comp
L KIT_Power:+3V3_STBY #PWR?
U 1 1 5FA23097
P 12150 6050
F 0 "#PWR?" H 12150 5900 50  0001 C CNN
F 1 "+3V3_STBY" H 12165 6223 50  0000 C CNN
F 2 "" H 12150 6050 50  0001 C CNN
F 3 "" H 12150 6050 50  0001 C CNN
	1    12150 6050
	1    0    0    -1  
$EndComp
$Comp
L power:GND #PWR?
U 1 1 5FA2309D
P 12150 6450
F 0 "#PWR?" H 12150 6200 50  0001 C CNN
F 1 "GND" H 12155 6277 50  0000 C CNN
F 2 "" H 12150 6450 50  0001 C CNN
F 3 "" H 12150 6450 50  0001 C CNN
	1    12150 6450
	1    0    0    -1  
$EndComp
Text Label 11650 6250 0    50   ~ 0
BOOT1
Wire Wire Line
	11650 6250 12000 6250
$Comp
L Jumper:SolderJumper_3_Open JP3
U 1 1 5FA2FE72
P 13050 6250
F 0 "JP3" V 13050 6318 50  0000 L CNN
F 1 "2" H 13050 6364 50  0001 C CNN
F 2 "KIT_Jumper:Jumper_0402" H 13050 6250 50  0001 C CNN
F 3 "~" H 13050 6250 50  0001 C CNN
	1    13050 6250
	0    1    1    0   
$EndComp
$Comp
L KIT_Power:+3V3_STBY #PWR?
U 1 1 5FA2FE78
P 13050 6050
F 0 "#PWR?" H 13050 5900 50  0001 C CNN
F 1 "+3V3_STBY" H 13065 6223 50  0000 C CNN
F 2 "" H 13050 6050 50  0001 C CNN
F 3 "" H 13050 6050 50  0001 C CNN
	1    13050 6050
	1    0    0    -1  
$EndComp
$Comp
L power:GND #PWR?
U 1 1 5FA2FE7E
P 13050 6450
F 0 "#PWR?" H 13050 6200 50  0001 C CNN
F 1 "GND" H 13055 6277 50  0000 C CNN
F 2 "" H 13050 6450 50  0001 C CNN
F 3 "" H 13050 6450 50  0001 C CNN
	1    13050 6450
	1    0    0    -1  
$EndComp
Text Label 12550 6250 0    50   ~ 0
BOOT2
Wire Wire Line
	12550 6250 12900 6250
$Comp
L Jumper:SolderJumper_3_Open JP4
U 1 1 5FA3CFD2
P 13950 6250
F 0 "JP4" V 13950 6318 50  0000 L CNN
F 1 "3" H 13950 6364 50  0001 C CNN
F 2 "KIT_Jumper:Jumper_0402" H 13950 6250 50  0001 C CNN
F 3 "~" H 13950 6250 50  0001 C CNN
	1    13950 6250
	0    1    1    0   
$EndComp
$Comp
L KIT_Power:+3V3_STBY #PWR?
U 1 1 5FA3CFD8
P 13950 6050
F 0 "#PWR?" H 13950 5900 50  0001 C CNN
F 1 "+3V3_STBY" H 13965 6223 50  0000 C CNN
F 2 "" H 13950 6050 50  0001 C CNN
F 3 "" H 13950 6050 50  0001 C CNN
	1    13950 6050
	1    0    0    -1  
$EndComp
$Comp
L power:GND #PWR?
U 1 1 5FA3CFDE
P 13950 6450
F 0 "#PWR?" H 13950 6200 50  0001 C CNN
F 1 "GND" H 13955 6277 50  0000 C CNN
F 2 "" H 13950 6450 50  0001 C CNN
F 3 "" H 13950 6450 50  0001 C CNN
	1    13950 6450
	1    0    0    -1  
$EndComp
Text Label 13450 6250 0    50   ~ 0
BOOT3
Wire Wire Line
	13450 6250 13800 6250
$Comp
L Device:R R?
U 1 1 5FB2C6E2
P 2400 5300
AR Path="/5EB76D90/5FB2C6E2" Ref="R?"  Part="1" 
AR Path="/5DEF958D/5FB2C6E2" Ref="R170"  Part="1" 
F 0 "R170" H 2470 5391 50  0000 L CNN
F 1 "1k" H 2470 5300 50  0000 L CNN
F 2 "KIT_Resistor_SMD:R_0402_1005Metric_DNP" V 2330 5300 50  0001 C CNN
F 3 "~" H 2400 5300 50  0001 C CNN
F 4 "AVT-IPE" H 2400 5300 50  0001 C CNN "stock"
F 5 "DNP" H 2470 5209 50  0000 L CNN "DNP"
	1    2400 5300
	1    0    0    -1  
$EndComp
$Comp
L power:GND #PWR?
U 1 1 5FB47070
P 2400 5450
F 0 "#PWR?" H 2400 5200 50  0001 C CNN
F 1 "GND" H 2405 5277 50  0000 C CNN
F 2 "" H 2400 5450 50  0001 C CNN
F 3 "" H 2400 5450 50  0001 C CNN
	1    2400 5450
	1    0    0    -1  
$EndComp
Wire Wire Line
	2400 5150 2400 5100
Connection ~ 2400 5100
$Comp
L Device:R R169
U 1 1 5FB72D66
P 1800 6050
F 0 "R169" H 1730 6096 50  0000 R CNN
F 1 "0" H 1730 6005 50  0000 R CNN
F 2 "Resistor_SMD:R_0402_1005Metric" V 1730 6050 50  0001 C CNN
F 3 "~" H 1800 6050 50  0001 C CNN
F 4 "1%" H 1800 6050 50  0001 C CNN "info"
F 5 "AVT-IPE" H 1800 6050 50  0001 C CNN "stock"
	1    1800 6050
	-1   0    0    -1  
$EndComp
Wire Wire Line
	1800 5800 1800 5850
$Comp
L Device:R R?
U 1 1 5FB72D76
P 1800 5650
AR Path="/5EB76D90/5FB72D76" Ref="R?"  Part="1" 
AR Path="/5DEF958D/5FB72D76" Ref="R168"  Part="1" 
F 0 "R168" H 1870 5741 50  0000 L CNN
F 1 "0" H 1870 5650 50  0000 L CNN
F 2 "KIT_Resistor_SMD:R_0402_1005Metric_DNP" V 1730 5650 50  0001 C CNN
F 3 "~" H 1800 5650 50  0001 C CNN
F 4 "AVT-IPE" H 1800 5650 50  0001 C CNN "stock"
F 5 "DNP" H 1870 5559 50  0000 L CNN "DNP"
	1    1800 5650
	1    0    0    -1  
$EndComp
$Comp
L power:GND #PWR?
U 1 1 5FB72D7C
P 1800 6200
F 0 "#PWR?" H 1800 5950 50  0001 C CNN
F 1 "GND" H 1805 6027 50  0000 C CNN
F 2 "" H 1800 6200 50  0001 C CNN
F 3 "" H 1800 6200 50  0001 C CNN
	1    1800 6200
	1    0    0    -1  
$EndComp
Wire Wire Line
	1800 5900 1800 5850
Connection ~ 1800 5850
Wire Wire Line
	3000 5650 3000 5850
Wire Wire Line
	1800 5850 3000 5850
$Comp
L KIT_Power:+0.85_STBY #PWR?
U 1 1 5F421044
P 5450 7450
AR Path="/5E09AE40/5F421044" Ref="#PWR?"  Part="1" 
AR Path="/5DEF958D/5F421044" Ref="#PWR?"  Part="1" 
F 0 "#PWR?" H 5450 7300 50  0001 C CNN
F 1 "+0.85_STBY" H 5465 7623 50  0000 C CNN
F 2 "" H 5450 7450 50  0001 C CNN
F 3 "" H 5450 7450 50  0001 C CNN
	1    5450 7450
	1    0    0    -1  
$EndComp
$Comp
L KIT_Power:+0.85_STBY #PWR?
U 1 1 5FBA763B
P 1800 5500
AR Path="/5E09AE40/5FBA763B" Ref="#PWR?"  Part="1" 
AR Path="/5DEF958D/5FBA763B" Ref="#PWR?"  Part="1" 
F 0 "#PWR?" H 1800 5350 50  0001 C CNN
F 1 "+0.85_STBY" H 1815 5673 50  0000 C CNN
F 2 "" H 1800 5500 50  0001 C CNN
F 3 "" H 1800 5500 50  0001 C CNN
	1    1800 5500
	1    0    0    -1  
$EndComp
Text Notes 10650 2400 0    50   ~ 0
Check load capacitance
Text Notes 10800 6950 0    50   ~ 0
When testing without a base board, one needs to select a boot mode via solder-jumpers.\nRemove solder-jumpers if your motherboard has a dip switch. 
Wire Notes Line
	10650 5800 14450 5800
Wire Notes Line
	14450 5800 14450 7000
Wire Notes Line
	14450 7000 10650 7000
Wire Notes Line
	10650 7000 10650 5800
Wire Bus Line
	8350 1700 8350 2000
$EndSCHEMATC
