EESchema Schematic File Version 4
EELAYER 30 0
EELAYER END
$Descr A4 11693 8268
encoding utf-8
Sheet 17 28
Title "ZynqMP Mezzanine FMC+ (BuZZyBoard)"
Date "2020-10-02"
Rev "1.0"
Comp "Karlsruhe Institute of Technology (KIT)"
Comment1 "Institute for Data Processing and Electronics (IPE)"
Comment2 "Luis Ardila"
Comment3 ""
Comment4 ""
$EndDescr
$Comp
L KIT_FPGA:ZU4EG-B900 U1
U 6 1 5F2E06AF
P 4300 2600
F 0 "U1" H 5700 2890 60  0000 C CNN
F 1 "ZU4EG-B900" H 5700 2784 60  0000 C CNN
F 2 "KIT_Package_BGA:BGA-900_30x30_31.0x31.0mm" H 2600 2400 50  0001 C CNN
F 3 "" H 2600 2400 50  0001 C CNN
	6    4300 2600
	1    0    0    -1  
$EndComp
Wire Notes Line
	8750 3050 8750 2650
Text Notes 8700 2900 2    50   ~ 0
GC \npins
NoConn ~ 7500 2600
Wire Wire Line
	2100 1950 2100 2000
Wire Wire Line
	3000 2000 3450 2000
$Comp
L Device:C C52
U 1 1 5F319EE8
P 3000 2200
F 0 "C52" H 3115 2246 50  0000 L CNN
F 1 "0.1uF" H 3115 2155 50  0000 L CNN
F 2 "Capacitor_SMD:C_0402_1005Metric" H 3038 2050 50  0001 C CNN
F 3 "~" H 3000 2200 50  0001 C CNN
F 4 "16 V" H 3000 2200 50  0001 C CNN "info"
F 5 "AVT-IPE" H 3000 2200 50  0001 C CNN "stock"
	1    3000 2200
	1    0    0    -1  
$EndComp
Wire Wire Line
	3000 2050 3000 2000
Connection ~ 3000 2000
$Comp
L Device:C C50
U 1 1 600115F2
P 2550 2200
F 0 "C50" H 2665 2246 50  0000 L CNN
F 1 "0.1uF" H 2665 2155 50  0000 L CNN
F 2 "Capacitor_SMD:C_0402_1005Metric" H 2588 2050 50  0001 C CNN
F 3 "~" H 2550 2200 50  0001 C CNN
F 4 "16 V" H 2550 2200 50  0001 C CNN "info"
F 5 "AVT-IPE" H 2550 2200 50  0001 C CNN "stock"
	1    2550 2200
	1    0    0    -1  
$EndComp
$Comp
L power:GND #PWR?
U 1 1 5F2E06BA
P 2100 2450
F 0 "#PWR?" H 2100 2200 50  0001 C CNN
F 1 "GND" H 2105 2277 50  0000 C CNN
F 2 "" H 2100 2450 50  0001 C CNN
F 3 "" H 2100 2450 50  0001 C CNN
	1    2100 2450
	1    0    0    -1  
$EndComp
Wire Wire Line
	2550 2050 2550 2000
Wire Wire Line
	2550 2000 3000 2000
Connection ~ 2550 2000
$Comp
L Device:C C54
U 1 1 5F2E06BB
P 3450 2200
F 0 "C54" H 3565 2246 50  0000 L CNN
F 1 "0.1uF" H 3565 2155 50  0000 L CNN
F 2 "Capacitor_SMD:C_0402_1005Metric" H 3488 2050 50  0001 C CNN
F 3 "~" H 3450 2200 50  0001 C CNN
F 4 "16 V" H 3450 2200 50  0001 C CNN "info"
F 5 "AVT-IPE" H 3450 2200 50  0001 C CNN "stock"
	1    3450 2200
	1    0    0    -1  
$EndComp
Wire Wire Line
	3450 2050 3450 2000
Connection ~ 3450 2000
Wire Wire Line
	3450 2000 3850 2000
Wire Wire Line
	3900 2600 3850 2600
Wire Wire Line
	3850 2600 3850 2000
$Comp
L KIT_Power:+1V8_STBY #PWR?
U 1 1 5F2E06BD
P 2100 1950
F 0 "#PWR?" H 2100 1800 50  0001 C CNN
F 1 "+1V8_STBY" H 2115 2123 50  0000 C CNN
F 2 "" H 2100 1950 50  0001 C CNN
F 3 "" H 2100 1950 50  0001 C CNN
	1    2100 1950
	1    0    0    -1  
$EndComp
Wire Notes Line
	6000 2650 6000 3050
Wire Notes Line
	6000 2650 8750 2650
Wire Notes Line
	6000 3050 8750 3050
Wire Notes Line
	2400 5050 2400 4650
Text Notes 2450 4900 0    50   ~ 0
GC \npins
Wire Notes Line
	5150 4650 2400 4650
Wire Notes Line
	5150 5050 2400 5050
Wire Notes Line
	5150 4650 5150 5050
Text Label 8050 2900 2    50   ~ 0
B66_IO_28
Text Label 8050 3000 2    50   ~ 0
B66_IO_29
Text Label 8050 3100 2    50   ~ 0
B66_IO_30
Text Label 8050 3200 2    50   ~ 0
B66_IO_31
Text Label 8050 3300 2    50   ~ 0
B66_IO_32
Text Label 8050 3400 2    50   ~ 0
B66_IO_33
Text Label 8050 3500 2    50   ~ 0
B66_IO_34
Text Label 8050 3600 2    50   ~ 0
B66_IO_35
Text Label 8050 3700 2    50   ~ 0
B66_IO_36
Text Label 8050 3800 2    50   ~ 0
B66_IO_37
Text Label 8050 3900 2    50   ~ 0
B66_IO_38
Text Label 8050 4000 2    50   ~ 0
B66_IO_39
Text Label 8050 4100 2    50   ~ 0
B66_IO_40
Text Label 8050 4200 2    50   ~ 0
B66_IO_41
Text Label 8050 4300 2    50   ~ 0
B66_IO_42
Text Label 8050 4400 2    50   ~ 0
B66_IO_43
Text Label 8050 4500 2    50   ~ 0
B66_IO_44
Text Label 8050 4600 2    50   ~ 0
B66_IO_45
Text Label 8050 4700 2    50   ~ 0
B66_IO_46
Text Label 8050 4800 2    50   ~ 0
B66_IO_47
Text Label 8050 4900 2    50   ~ 0
B66_IO_48
Text Label 8050 5000 2    50   ~ 0
B66_IO_49
Text Label 8050 5100 2    50   ~ 0
B66_IO_50
Text Label 8050 5200 2    50   ~ 0
B66_IO_51
Text Label 8050 2800 2    50   ~ 0
B66_IO_27
Text Label 8050 2700 2    50   ~ 0
B66_IO_26
Text Label 3350 5200 0    50   ~ 0
B66_IO_25
Text Label 3350 5100 0    50   ~ 0
B66_IO_24
Text Label 3350 5000 0    50   ~ 0
B66_IO_23
Text Label 3350 4900 0    50   ~ 0
B66_IO_22
Text Label 3350 4800 0    50   ~ 0
B66_IO_21
Text Label 3350 4700 0    50   ~ 0
B66_IO_20
Text Label 3350 4600 0    50   ~ 0
B66_IO_19
Text Label 3350 4500 0    50   ~ 0
B66_IO_18
Text Label 3350 4400 0    50   ~ 0
B66_IO_17
Text Label 3350 4300 0    50   ~ 0
B66_IO_16
Text Label 3350 4200 0    50   ~ 0
B66_IO_15
Text Label 3350 4100 0    50   ~ 0
B66_IO_14
Text Label 3350 4000 0    50   ~ 0
B66_IO_13
Text Label 3350 3900 0    50   ~ 0
B66_IO_12
Text Label 3350 3800 0    50   ~ 0
B66_IO_11
Text Label 3350 3700 0    50   ~ 0
B66_IO_10
Text Label 3350 3600 0    50   ~ 0
B66_IO_9
Text Label 3350 3500 0    50   ~ 0
B66_IO_8
Text Label 3350 3400 0    50   ~ 0
B66_IO_7
Text Label 3350 3300 0    50   ~ 0
B66_IO_6
Text Label 3350 3200 0    50   ~ 0
B66_IO_5
Text Label 3350 3100 0    50   ~ 0
B66_IO_4
Text Label 3350 3000 0    50   ~ 0
B66_IO_3
Text Label 3350 2900 0    50   ~ 0
B66_IO_2
Text Label 3350 2800 0    50   ~ 0
B66_IO_1
Text Label 3350 2700 0    50   ~ 0
B66_IO_0
Wire Wire Line
	3300 2700 3900 2700
Wire Wire Line
	3300 2800 3900 2800
Wire Wire Line
	3300 2900 3900 2900
Wire Wire Line
	3300 3000 3900 3000
Wire Wire Line
	3300 3100 3900 3100
Wire Wire Line
	3300 3200 3900 3200
Wire Wire Line
	3300 3300 3900 3300
Wire Wire Line
	3300 3400 3900 3400
Wire Wire Line
	3300 3500 3900 3500
Wire Wire Line
	3300 3600 3900 3600
Wire Wire Line
	3300 3700 3900 3700
Wire Wire Line
	3300 3800 3900 3800
Wire Wire Line
	3300 3900 3900 3900
Wire Wire Line
	3300 4000 3900 4000
Wire Wire Line
	3300 4100 3900 4100
Wire Wire Line
	3300 4200 3900 4200
Wire Wire Line
	3300 4300 3900 4300
Wire Wire Line
	3300 4500 3900 4500
Wire Wire Line
	3300 4600 3900 4600
Wire Wire Line
	3300 4700 3900 4700
Wire Wire Line
	3300 4800 3900 4800
Wire Wire Line
	3300 4900 3900 4900
Wire Wire Line
	3300 5000 3900 5000
Wire Wire Line
	3300 5100 3900 5100
Wire Wire Line
	3300 5200 3900 5200
Wire Wire Line
	7500 2700 8100 2700
Wire Wire Line
	7500 2800 8100 2800
Wire Wire Line
	7500 2900 8100 2900
Wire Wire Line
	7500 3000 8100 3000
Wire Wire Line
	7500 3100 8100 3100
Wire Wire Line
	7500 3200 8100 3200
Wire Wire Line
	7500 3300 8100 3300
Wire Wire Line
	7500 3400 8100 3400
Wire Wire Line
	7500 3500 8100 3500
Wire Wire Line
	7500 3600 8100 3600
Wire Wire Line
	7500 3700 8100 3700
Wire Wire Line
	7500 3800 8100 3800
Wire Wire Line
	7500 3900 8100 3900
Wire Wire Line
	7500 4000 8100 4000
Wire Wire Line
	7500 4100 8100 4100
Wire Wire Line
	7500 4200 8100 4200
Wire Wire Line
	7500 4300 8100 4300
Wire Wire Line
	7500 4400 8100 4400
Wire Wire Line
	7500 4500 8100 4500
Wire Wire Line
	7500 4600 8100 4600
Wire Wire Line
	7500 4700 8100 4700
Wire Wire Line
	7500 4800 8100 4800
Wire Wire Line
	7500 4900 8100 4900
Wire Wire Line
	7500 5000 8100 5000
Wire Wire Line
	7500 5100 8100 5100
Wire Wire Line
	7500 5200 8100 5200
Entry Wire Line
	8100 2700 8200 2800
Entry Wire Line
	8100 2800 8200 2900
Entry Wire Line
	8100 2900 8200 3000
Entry Wire Line
	8100 3000 8200 3100
Entry Wire Line
	8100 3100 8200 3200
Entry Wire Line
	8100 3200 8200 3300
Entry Wire Line
	8100 3300 8200 3400
Entry Wire Line
	8100 3400 8200 3500
Entry Wire Line
	8100 3500 8200 3600
Entry Wire Line
	8100 3600 8200 3700
Entry Wire Line
	8100 3700 8200 3800
Entry Wire Line
	8100 3800 8200 3900
Entry Wire Line
	8100 3900 8200 4000
Entry Wire Line
	8100 4000 8200 4100
Entry Wire Line
	8100 4100 8200 4200
Entry Wire Line
	8100 4200 8200 4300
Entry Wire Line
	8100 4300 8200 4400
Entry Wire Line
	8100 4400 8200 4500
Entry Wire Line
	8100 4500 8200 4600
Entry Wire Line
	8100 4600 8200 4700
Entry Wire Line
	8100 4700 8200 4800
Entry Wire Line
	8100 4800 8200 4900
Entry Wire Line
	8100 4900 8200 5000
Entry Wire Line
	8100 5000 8200 5100
Entry Wire Line
	8100 5100 8200 5200
Entry Wire Line
	8100 5200 8200 5300
Entry Wire Line
	3300 2700 3200 2800
Entry Wire Line
	3300 2800 3200 2900
Entry Wire Line
	3300 2900 3200 3000
Entry Wire Line
	3300 3000 3200 3100
Entry Wire Line
	3300 3100 3200 3200
Entry Wire Line
	3300 3200 3200 3300
Entry Wire Line
	3300 3300 3200 3400
Entry Wire Line
	3300 3400 3200 3500
Entry Wire Line
	3300 3500 3200 3600
Entry Wire Line
	3300 3600 3200 3700
Entry Wire Line
	3300 3700 3200 3800
Entry Wire Line
	3300 3800 3200 3900
Entry Wire Line
	3300 3900 3200 4000
Entry Wire Line
	3300 4000 3200 4100
Entry Wire Line
	3300 4100 3200 4200
Entry Wire Line
	3300 4200 3200 4300
Entry Wire Line
	3300 4300 3200 4400
Entry Wire Line
	3300 4500 3200 4600
Entry Wire Line
	3300 4600 3200 4700
Entry Wire Line
	3300 4700 3200 4800
Entry Wire Line
	3300 4800 3200 4900
Entry Wire Line
	3300 4900 3200 5000
Entry Wire Line
	3300 5000 3200 5100
Entry Wire Line
	3300 5100 3200 5200
Wire Bus Line
	8200 5700 3200 5700
Connection ~ 3200 5700
Wire Bus Line
	3200 5700 2700 5700
Text GLabel 2700 5700 0    50   BiDi ~ 0
B66_IO_[0..51]
$Comp
L Device:C C?
U 1 1 5F076081
P 2100 2200
AR Path="/5E09AE40/5F076081" Ref="C?"  Part="1" 
AR Path="/5F2E03FC/5F076081" Ref="C277"  Part="1" 
F 0 "C277" H 2215 2246 50  0000 L CNN
F 1 "10uF" H 2215 2155 50  0000 L CNN
F 2 "Capacitor_SMD:C_0402_1005Metric" H 2138 2050 50  0001 C CNN
F 3 "~" H 2100 2200 50  0001 C CNN
F 4 "10µF ±20% 6.3V Ceramic Capacitor X6S 0402 (1005 Metric) " H 2100 2200 50  0001 C CNN "info"
F 5 "Murata" H 2100 2200 50  0001 C CNN "manf"
F 6 "GRM155C80J106ME11D" H 2100 2200 50  0001 C CNN "manf#"
	1    2100 2200
	1    0    0    -1  
$EndComp
Wire Wire Line
	2550 2000 2100 2000
Wire Wire Line
	2100 2000 2100 2050
Wire Wire Line
	2100 2350 2100 2400
Wire Wire Line
	3450 2350 3450 2400
Wire Wire Line
	2100 2400 2550 2400
Wire Wire Line
	2100 2450 2100 2400
Connection ~ 2100 2400
Wire Wire Line
	3000 2350 3000 2400
Connection ~ 3000 2400
Wire Wire Line
	3000 2400 3450 2400
Wire Wire Line
	2550 2350 2550 2400
Connection ~ 2550 2400
Wire Wire Line
	2550 2400 3000 2400
Connection ~ 2100 2000
Wire Wire Line
	3300 4400 3900 4400
NoConn ~ 3300 4400
NoConn ~ 3300 5200
Wire Bus Line
	8200 2800 8200 5700
Wire Bus Line
	3200 2800 3200 5700
$EndSCHEMATC
