EESchema Schematic File Version 4
EELAYER 30 0
EELAYER END
$Descr A4 11693 8268
encoding utf-8
Sheet 25 28
Title "ZynqMP Mezzanine FMC+ (BuZZyBoard)"
Date "2020-10-02"
Rev "1.0"
Comp "Karlsruhe Institute of Technology (KIT)"
Comment1 "Institute for Data Processing and Electronics (IPE)"
Comment2 "Luis Ardila"
Comment3 ""
Comment4 ""
$EndDescr
$Comp
L power:GND #PWR?
U 1 1 5F0EFE61
P 5200 2000
AR Path="/5EF3A6F3/5F0EFE61" Ref="#PWR?"  Part="1" 
AR Path="/5EF3A6EB/5F0EFE61" Ref="#PWR?"  Part="1" 
AR Path="/5EF3A6EF/5F0EFE61" Ref="#PWR?"  Part="1" 
F 0 "#PWR?" H 5200 1750 50  0001 C CNN
F 1 "GND" V 5205 1872 50  0000 R CNN
F 2 "" H 5200 2000 50  0001 C CNN
F 3 "" H 5200 2000 50  0001 C CNN
	1    5200 2000
	0    1    1    0   
$EndComp
$Comp
L power:GND #PWR?
U 1 1 5F0EFE67
P 5200 2300
AR Path="/5EF3A6F3/5F0EFE67" Ref="#PWR?"  Part="1" 
AR Path="/5EF3A6EB/5F0EFE67" Ref="#PWR?"  Part="1" 
AR Path="/5EF3A6EF/5F0EFE67" Ref="#PWR?"  Part="1" 
F 0 "#PWR?" H 5200 2050 50  0001 C CNN
F 1 "GND" V 5205 2172 50  0000 R CNN
F 2 "" H 5200 2300 50  0001 C CNN
F 3 "" H 5200 2300 50  0001 C CNN
	1    5200 2300
	0    1    1    0   
$EndComp
$Comp
L power:GND #PWR?
U 1 1 5F0F068F
P 5200 2400
AR Path="/5EF3A6F3/5F0F068F" Ref="#PWR?"  Part="1" 
AR Path="/5EF3A6EB/5F0F068F" Ref="#PWR?"  Part="1" 
AR Path="/5EF3A6EF/5F0F068F" Ref="#PWR?"  Part="1" 
F 0 "#PWR?" H 5200 2150 50  0001 C CNN
F 1 "GND" V 5205 2272 50  0000 R CNN
F 2 "" H 5200 2400 50  0001 C CNN
F 3 "" H 5200 2400 50  0001 C CNN
	1    5200 2400
	0    1    1    0   
$EndComp
$Comp
L power:GND #PWR?
U 1 1 5F0F0695
P 5200 2700
AR Path="/5EF3A6F3/5F0F0695" Ref="#PWR?"  Part="1" 
AR Path="/5EF3A6EB/5F0F0695" Ref="#PWR?"  Part="1" 
AR Path="/5EF3A6EF/5F0F0695" Ref="#PWR?"  Part="1" 
F 0 "#PWR?" H 5200 2450 50  0001 C CNN
F 1 "GND" V 5205 2572 50  0000 R CNN
F 2 "" H 5200 2700 50  0001 C CNN
F 3 "" H 5200 2700 50  0001 C CNN
	1    5200 2700
	0    1    1    0   
$EndComp
$Comp
L power:GND #PWR?
U 1 1 5F0F2555
P 5200 3000
AR Path="/5EF3A6F3/5F0F2555" Ref="#PWR?"  Part="1" 
AR Path="/5EF3A6EB/5F0F2555" Ref="#PWR?"  Part="1" 
AR Path="/5EF3A6EF/5F0F2555" Ref="#PWR?"  Part="1" 
F 0 "#PWR?" H 5200 2750 50  0001 C CNN
F 1 "GND" V 5205 2872 50  0000 R CNN
F 2 "" H 5200 3000 50  0001 C CNN
F 3 "" H 5200 3000 50  0001 C CNN
	1    5200 3000
	0    1    1    0   
$EndComp
$Comp
L power:GND #PWR?
U 1 1 5F0F255B
P 5200 3300
AR Path="/5EF3A6F3/5F0F255B" Ref="#PWR?"  Part="1" 
AR Path="/5EF3A6EB/5F0F255B" Ref="#PWR?"  Part="1" 
AR Path="/5EF3A6EF/5F0F255B" Ref="#PWR?"  Part="1" 
F 0 "#PWR?" H 5200 3050 50  0001 C CNN
F 1 "GND" V 5205 3172 50  0000 R CNN
F 2 "" H 5200 3300 50  0001 C CNN
F 3 "" H 5200 3300 50  0001 C CNN
	1    5200 3300
	0    1    1    0   
$EndComp
$Comp
L power:GND #PWR?
U 1 1 5F0F2C8F
P 5200 3600
AR Path="/5EF3A6F3/5F0F2C8F" Ref="#PWR?"  Part="1" 
AR Path="/5EF3A6EB/5F0F2C8F" Ref="#PWR?"  Part="1" 
AR Path="/5EF3A6EF/5F0F2C8F" Ref="#PWR?"  Part="1" 
F 0 "#PWR?" H 5200 3350 50  0001 C CNN
F 1 "GND" V 5205 3472 50  0000 R CNN
F 2 "" H 5200 3600 50  0001 C CNN
F 3 "" H 5200 3600 50  0001 C CNN
	1    5200 3600
	0    1    1    0   
$EndComp
$Comp
L power:GND #PWR?
U 1 1 5F0F2C95
P 5200 3900
AR Path="/5EF3A6F3/5F0F2C95" Ref="#PWR?"  Part="1" 
AR Path="/5EF3A6EB/5F0F2C95" Ref="#PWR?"  Part="1" 
AR Path="/5EF3A6EF/5F0F2C95" Ref="#PWR?"  Part="1" 
F 0 "#PWR?" H 5200 3650 50  0001 C CNN
F 1 "GND" V 5205 3772 50  0000 R CNN
F 2 "" H 5200 3900 50  0001 C CNN
F 3 "" H 5200 3900 50  0001 C CNN
	1    5200 3900
	0    1    1    0   
$EndComp
$Comp
L power:GND #PWR?
U 1 1 5F0F351B
P 5200 4200
AR Path="/5EF3A6F3/5F0F351B" Ref="#PWR?"  Part="1" 
AR Path="/5EF3A6EB/5F0F351B" Ref="#PWR?"  Part="1" 
AR Path="/5EF3A6EF/5F0F351B" Ref="#PWR?"  Part="1" 
F 0 "#PWR?" H 5200 3950 50  0001 C CNN
F 1 "GND" V 5205 4072 50  0000 R CNN
F 2 "" H 5200 4200 50  0001 C CNN
F 3 "" H 5200 4200 50  0001 C CNN
	1    5200 4200
	0    1    1    0   
$EndComp
$Comp
L power:GND #PWR?
U 1 1 5F0F3521
P 5200 4500
AR Path="/5EF3A6F3/5F0F3521" Ref="#PWR?"  Part="1" 
AR Path="/5EF3A6EB/5F0F3521" Ref="#PWR?"  Part="1" 
AR Path="/5EF3A6EF/5F0F3521" Ref="#PWR?"  Part="1" 
F 0 "#PWR?" H 5200 4250 50  0001 C CNN
F 1 "GND" V 5205 4372 50  0000 R CNN
F 2 "" H 5200 4500 50  0001 C CNN
F 3 "" H 5200 4500 50  0001 C CNN
	1    5200 4500
	0    1    1    0   
$EndComp
$Comp
L power:GND #PWR?
U 1 1 5F0F6455
P 5200 4800
AR Path="/5EF3A6F3/5F0F6455" Ref="#PWR?"  Part="1" 
AR Path="/5EF3A6EB/5F0F6455" Ref="#PWR?"  Part="1" 
AR Path="/5EF3A6EF/5F0F6455" Ref="#PWR?"  Part="1" 
F 0 "#PWR?" H 5200 4550 50  0001 C CNN
F 1 "GND" V 5205 4672 50  0000 R CNN
F 2 "" H 5200 4800 50  0001 C CNN
F 3 "" H 5200 4800 50  0001 C CNN
	1    5200 4800
	0    1    1    0   
$EndComp
$Comp
L power:GND #PWR?
U 1 1 5F0F645B
P 5200 5100
AR Path="/5EF3A6F3/5F0F645B" Ref="#PWR?"  Part="1" 
AR Path="/5EF3A6EB/5F0F645B" Ref="#PWR?"  Part="1" 
AR Path="/5EF3A6EF/5F0F645B" Ref="#PWR?"  Part="1" 
F 0 "#PWR?" H 5200 4850 50  0001 C CNN
F 1 "GND" V 5205 4972 50  0000 R CNN
F 2 "" H 5200 5100 50  0001 C CNN
F 3 "" H 5200 5100 50  0001 C CNN
	1    5200 5100
	0    1    1    0   
$EndComp
$Comp
L power:GND #PWR?
U 1 1 5F0F6BEB
P 5200 5400
AR Path="/5EF3A6F3/5F0F6BEB" Ref="#PWR?"  Part="1" 
AR Path="/5EF3A6EB/5F0F6BEB" Ref="#PWR?"  Part="1" 
AR Path="/5EF3A6EF/5F0F6BEB" Ref="#PWR?"  Part="1" 
F 0 "#PWR?" H 5200 5150 50  0001 C CNN
F 1 "GND" V 5205 5272 50  0000 R CNN
F 2 "" H 5200 5400 50  0001 C CNN
F 3 "" H 5200 5400 50  0001 C CNN
	1    5200 5400
	0    1    1    0   
$EndComp
$Comp
L power:GND #PWR?
U 1 1 5F0F6BF1
P 5200 5700
AR Path="/5EF3A6F3/5F0F6BF1" Ref="#PWR?"  Part="1" 
AR Path="/5EF3A6EB/5F0F6BF1" Ref="#PWR?"  Part="1" 
AR Path="/5EF3A6EF/5F0F6BF1" Ref="#PWR?"  Part="1" 
F 0 "#PWR?" H 5200 5450 50  0001 C CNN
F 1 "GND" V 5205 5572 50  0000 R CNN
F 2 "" H 5200 5700 50  0001 C CNN
F 3 "" H 5200 5700 50  0001 C CNN
	1    5200 5700
	0    1    1    0   
$EndComp
$Comp
L power:GND #PWR?
U 1 1 5F0F760F
P 7000 5500
AR Path="/5EF3A6F3/5F0F760F" Ref="#PWR?"  Part="1" 
AR Path="/5EF3A6EB/5F0F760F" Ref="#PWR?"  Part="1" 
AR Path="/5EF3A6EF/5F0F760F" Ref="#PWR?"  Part="1" 
F 0 "#PWR?" H 7000 5250 50  0001 C CNN
F 1 "GND" V 7005 5372 50  0000 R CNN
F 2 "" H 7000 5500 50  0001 C CNN
F 3 "" H 7000 5500 50  0001 C CNN
	1    7000 5500
	0    -1   1    0   
$EndComp
$Comp
L power:GND #PWR?
U 1 1 5F0F7615
P 7000 5800
AR Path="/5EF3A6F3/5F0F7615" Ref="#PWR?"  Part="1" 
AR Path="/5EF3A6EB/5F0F7615" Ref="#PWR?"  Part="1" 
AR Path="/5EF3A6EF/5F0F7615" Ref="#PWR?"  Part="1" 
F 0 "#PWR?" H 7000 5550 50  0001 C CNN
F 1 "GND" V 7005 5672 50  0000 R CNN
F 2 "" H 7000 5800 50  0001 C CNN
F 3 "" H 7000 5800 50  0001 C CNN
	1    7000 5800
	0    -1   1    0   
$EndComp
$Comp
L power:GND #PWR?
U 1 1 5F0F7E8D
P 7000 4900
AR Path="/5EF3A6F3/5F0F7E8D" Ref="#PWR?"  Part="1" 
AR Path="/5EF3A6EB/5F0F7E8D" Ref="#PWR?"  Part="1" 
AR Path="/5EF3A6EF/5F0F7E8D" Ref="#PWR?"  Part="1" 
F 0 "#PWR?" H 7000 4650 50  0001 C CNN
F 1 "GND" V 7005 4772 50  0000 R CNN
F 2 "" H 7000 4900 50  0001 C CNN
F 3 "" H 7000 4900 50  0001 C CNN
	1    7000 4900
	0    -1   1    0   
$EndComp
$Comp
L power:GND #PWR?
U 1 1 5F0F7E93
P 7000 5200
AR Path="/5EF3A6F3/5F0F7E93" Ref="#PWR?"  Part="1" 
AR Path="/5EF3A6EB/5F0F7E93" Ref="#PWR?"  Part="1" 
AR Path="/5EF3A6EF/5F0F7E93" Ref="#PWR?"  Part="1" 
F 0 "#PWR?" H 7000 4950 50  0001 C CNN
F 1 "GND" V 7005 5072 50  0000 R CNN
F 2 "" H 7000 5200 50  0001 C CNN
F 3 "" H 7000 5200 50  0001 C CNN
	1    7000 5200
	0    -1   1    0   
$EndComp
$Comp
L power:GND #PWR?
U 1 1 5F0F85CB
P 7000 4300
AR Path="/5EF3A6F3/5F0F85CB" Ref="#PWR?"  Part="1" 
AR Path="/5EF3A6EB/5F0F85CB" Ref="#PWR?"  Part="1" 
AR Path="/5EF3A6EF/5F0F85CB" Ref="#PWR?"  Part="1" 
F 0 "#PWR?" H 7000 4050 50  0001 C CNN
F 1 "GND" V 7005 4172 50  0000 R CNN
F 2 "" H 7000 4300 50  0001 C CNN
F 3 "" H 7000 4300 50  0001 C CNN
	1    7000 4300
	0    -1   1    0   
$EndComp
$Comp
L power:GND #PWR?
U 1 1 5F0F85D1
P 7000 4600
AR Path="/5EF3A6F3/5F0F85D1" Ref="#PWR?"  Part="1" 
AR Path="/5EF3A6EB/5F0F85D1" Ref="#PWR?"  Part="1" 
AR Path="/5EF3A6EF/5F0F85D1" Ref="#PWR?"  Part="1" 
F 0 "#PWR?" H 7000 4350 50  0001 C CNN
F 1 "GND" V 7005 4472 50  0000 R CNN
F 2 "" H 7000 4600 50  0001 C CNN
F 3 "" H 7000 4600 50  0001 C CNN
	1    7000 4600
	0    -1   1    0   
$EndComp
$Comp
L power:GND #PWR?
U 1 1 5F0F8B93
P 7000 3700
AR Path="/5EF3A6F3/5F0F8B93" Ref="#PWR?"  Part="1" 
AR Path="/5EF3A6EB/5F0F8B93" Ref="#PWR?"  Part="1" 
AR Path="/5EF3A6EF/5F0F8B93" Ref="#PWR?"  Part="1" 
F 0 "#PWR?" H 7000 3450 50  0001 C CNN
F 1 "GND" V 7005 3572 50  0000 R CNN
F 2 "" H 7000 3700 50  0001 C CNN
F 3 "" H 7000 3700 50  0001 C CNN
	1    7000 3700
	0    -1   1    0   
$EndComp
$Comp
L power:GND #PWR?
U 1 1 5F0F8B99
P 7000 4000
AR Path="/5EF3A6F3/5F0F8B99" Ref="#PWR?"  Part="1" 
AR Path="/5EF3A6EB/5F0F8B99" Ref="#PWR?"  Part="1" 
AR Path="/5EF3A6EF/5F0F8B99" Ref="#PWR?"  Part="1" 
F 0 "#PWR?" H 7000 3750 50  0001 C CNN
F 1 "GND" V 7005 3872 50  0000 R CNN
F 2 "" H 7000 4000 50  0001 C CNN
F 3 "" H 7000 4000 50  0001 C CNN
	1    7000 4000
	0    -1   1    0   
$EndComp
$Comp
L power:GND #PWR?
U 1 1 5F0FB8EF
P 7000 3100
AR Path="/5EF3A6F3/5F0FB8EF" Ref="#PWR?"  Part="1" 
AR Path="/5EF3A6EB/5F0FB8EF" Ref="#PWR?"  Part="1" 
AR Path="/5EF3A6EF/5F0FB8EF" Ref="#PWR?"  Part="1" 
F 0 "#PWR?" H 7000 2850 50  0001 C CNN
F 1 "GND" V 7005 2972 50  0000 R CNN
F 2 "" H 7000 3100 50  0001 C CNN
F 3 "" H 7000 3100 50  0001 C CNN
	1    7000 3100
	0    -1   1    0   
$EndComp
$Comp
L power:GND #PWR?
U 1 1 5F0FB8F5
P 7000 3400
AR Path="/5EF3A6F3/5F0FB8F5" Ref="#PWR?"  Part="1" 
AR Path="/5EF3A6EB/5F0FB8F5" Ref="#PWR?"  Part="1" 
AR Path="/5EF3A6EF/5F0FB8F5" Ref="#PWR?"  Part="1" 
F 0 "#PWR?" H 7000 3150 50  0001 C CNN
F 1 "GND" V 7005 3272 50  0000 R CNN
F 2 "" H 7000 3400 50  0001 C CNN
F 3 "" H 7000 3400 50  0001 C CNN
	1    7000 3400
	0    -1   1    0   
$EndComp
$Comp
L power:GND #PWR?
U 1 1 5F0FBF25
P 7000 2500
AR Path="/5EF3A6F3/5F0FBF25" Ref="#PWR?"  Part="1" 
AR Path="/5EF3A6EB/5F0FBF25" Ref="#PWR?"  Part="1" 
AR Path="/5EF3A6EF/5F0FBF25" Ref="#PWR?"  Part="1" 
F 0 "#PWR?" H 7000 2250 50  0001 C CNN
F 1 "GND" V 7005 2372 50  0000 R CNN
F 2 "" H 7000 2500 50  0001 C CNN
F 3 "" H 7000 2500 50  0001 C CNN
	1    7000 2500
	0    -1   1    0   
$EndComp
$Comp
L power:GND #PWR?
U 1 1 5F0FBF2B
P 7000 2800
AR Path="/5EF3A6F3/5F0FBF2B" Ref="#PWR?"  Part="1" 
AR Path="/5EF3A6EB/5F0FBF2B" Ref="#PWR?"  Part="1" 
AR Path="/5EF3A6EF/5F0FBF2B" Ref="#PWR?"  Part="1" 
F 0 "#PWR?" H 7000 2550 50  0001 C CNN
F 1 "GND" V 7005 2672 50  0000 R CNN
F 2 "" H 7000 2800 50  0001 C CNN
F 3 "" H 7000 2800 50  0001 C CNN
	1    7000 2800
	0    -1   1    0   
$EndComp
$Comp
L power:GND #PWR?
U 1 1 5F0FC7D7
P 7000 2100
AR Path="/5EF3A6F3/5F0FC7D7" Ref="#PWR?"  Part="1" 
AR Path="/5EF3A6EB/5F0FC7D7" Ref="#PWR?"  Part="1" 
AR Path="/5EF3A6EF/5F0FC7D7" Ref="#PWR?"  Part="1" 
F 0 "#PWR?" H 7000 1850 50  0001 C CNN
F 1 "GND" V 7005 1972 50  0000 R CNN
F 2 "" H 7000 2100 50  0001 C CNN
F 3 "" H 7000 2100 50  0001 C CNN
	1    7000 2100
	0    -1   1    0   
$EndComp
$Comp
L power:GND #PWR?
U 1 1 5F0FC7DD
P 7000 2200
AR Path="/5EF3A6F3/5F0FC7DD" Ref="#PWR?"  Part="1" 
AR Path="/5EF3A6EB/5F0FC7DD" Ref="#PWR?"  Part="1" 
AR Path="/5EF3A6EF/5F0FC7DD" Ref="#PWR?"  Part="1" 
F 0 "#PWR?" H 7000 1950 50  0001 C CNN
F 1 "GND" V 7005 2072 50  0000 R CNN
F 2 "" H 7000 2200 50  0001 C CNN
F 3 "" H 7000 2200 50  0001 C CNN
	1    7000 2200
	0    -1   1    0   
$EndComp
$Comp
L power:GND #PWR?
U 1 1 5F104FE0
P 5200 5900
AR Path="/5EF3A6F3/5F104FE0" Ref="#PWR?"  Part="1" 
AR Path="/5EF3A6EB/5F104FE0" Ref="#PWR?"  Part="1" 
AR Path="/5EF3A6EF/5F104FE0" Ref="#PWR?"  Part="1" 
F 0 "#PWR?" H 5200 5650 50  0001 C CNN
F 1 "GND" V 5205 5772 50  0000 R CNN
F 2 "" H 5200 5900 50  0001 C CNN
F 3 "" H 5200 5900 50  0001 C CNN
	1    5200 5900
	0    1    1    0   
$EndComp
Text Notes 7950 2350 0    50   ~ 0
LHC_CLK
Text Notes 4250 2150 2    50   ~ 0
LHC_HP_CLK
Wire Notes Line
	9150 5750 11150 5750
Wire Notes Line
	11150 5750 11150 6200
Wire Notes Line
	11150 6200 9150 6200
Wire Notes Line
	9150 6200 9150 5750
$Comp
L KIT_Power:+3V3_VIO_B #PWR?
U 1 1 605C76B7
P 7700 6000
AR Path="/5EF3A6E9/605C76B7" Ref="#PWR?"  Part="1" 
AR Path="/5EF3A6EF/605C76B7" Ref="#PWR?"  Part="1" 
F 0 "#PWR?" H 7700 5850 50  0001 C CNN
F 1 "+3V3_VIO_B" H 7715 6173 50  0000 C CNN
F 2 "" H 7700 6000 50  0001 C CNN
F 3 "" H 7700 6000 50  0001 C CNN
	1    7700 6000
	1    0    0    -1  
$EndComp
$Comp
L KIT_Power:+3V3_VIO_B #PWR?
U 1 1 605F838A
P 4400 5950
AR Path="/5EF3A6E9/605F838A" Ref="#PWR?"  Part="1" 
AR Path="/5EF3A6EF/605F838A" Ref="#PWR?"  Part="1" 
F 0 "#PWR?" H 4400 5800 50  0001 C CNN
F 1 "+3V3_VIO_B" H 4415 6123 50  0000 C CNN
F 2 "" H 4400 5950 50  0001 C CNN
F 3 "" H 4400 5950 50  0001 C CNN
	1    4400 5950
	-1   0    0    -1  
$EndComp
$Comp
L Device:R R?
U 1 1 60606B1A
P 8250 6150
AR Path="/5F7224E6/60606B1A" Ref="R?"  Part="1" 
AR Path="/5FA2C9D2/60606B1A" Ref="R?"  Part="1" 
AR Path="/5EF3A6EF/60606B1A" Ref="R14"  Part="1" 
F 0 "R14" V 8547 6150 50  0000 C CNN
F 1 "0" V 8456 6150 50  0000 C CNN
F 2 "KIT_Resistor_SMD:R_0402_1005Metric_DNP" V 8180 6150 50  0001 C CNN
F 3 "~" H 8250 6150 50  0001 C CNN
F 4 "AVT-IPE" H 8250 6150 50  0001 C CNN "stock"
F 5 "DNP" V 8365 6150 50  0000 C CNN "DNP"
	1    8250 6150
	0    -1   -1   0   
$EndComp
Text Notes 9250 6150 0    50   ~ 0
+3V3_VIO_B Provided from the Carrier violating: \n- FMC+ definition of VIO_B_M2C \n- Observation 5.31\n- Rule 6.8
Wire Wire Line
	4400 5950 4400 6050
Wire Wire Line
	4400 6050 4750 6050
Wire Wire Line
	4750 6050 4750 5800
Wire Wire Line
	4750 5800 5200 5800
$Comp
L KIT_Power:+3V3_STBY #PWR?
U 1 1 606C7D73
P 8850 6000
AR Path="/5EF3A6E9/606C7D73" Ref="#PWR?"  Part="1" 
AR Path="/5EF3A6EF/606C7D73" Ref="#PWR?"  Part="1" 
F 0 "#PWR?" H 8850 5850 50  0001 C CNN
F 1 "+3V3_STBY" H 8865 6173 50  0000 C CNN
F 2 "" H 8850 6000 50  0001 C CNN
F 3 "" H 8850 6000 50  0001 C CNN
	1    8850 6000
	1    0    0    -1  
$EndComp
Wire Wire Line
	7000 5900 7250 5900
Wire Wire Line
	7250 5900 7250 6150
Wire Wire Line
	7250 6150 7450 6150
Wire Wire Line
	8400 6150 8850 6150
Wire Wire Line
	8850 6150 8850 6000
Wire Wire Line
	7700 6000 7700 6150
Connection ~ 7700 6150
Wire Wire Line
	7700 6150 8100 6150
Wire Wire Line
	4850 5500 5200 5500
Wire Wire Line
	4850 5600 5200 5600
Wire Wire Line
	7400 5300 7000 5300
Wire Wire Line
	7400 5400 7000 5400
Wire Wire Line
	7400 5000 7000 5000
Wire Wire Line
	7400 5100 7000 5100
Wire Wire Line
	4850 4900 5200 4900
Wire Wire Line
	4850 5000 5200 5000
Text GLabel 7400 5000 2    50   Input ~ 0
UART0_RX
Text GLabel 7400 5100 2    50   Input ~ 0
UART0_TX
Text GLabel 4850 5000 0    50   Input ~ 0
UART1_TX
Text GLabel 4850 4900 0    50   Output ~ 0
UART1_RX
Text Label 7900 4700 2    50   ~ 0
BOOT0
Text Label 7900 4800 2    50   ~ 0
BOOT1
Text Label 4300 4600 0    50   ~ 0
BOOT2
Text Label 4300 4700 0    50   ~ 0
BOOT3
Text GLabel 3900 4500 0    50   BiDi ~ 0
BOOT[0..3]
Wire Wire Line
	8000 4800 7000 4800
Wire Wire Line
	8000 4700 7000 4700
Wire Wire Line
	4200 4700 5200 4700
Wire Wire Line
	4200 4600 5200 4600
Text GLabel 7400 5400 2    50   Input ~ 0
12V_POWER_ENABLE
Text GLabel 7400 5300 2    50   Input ~ 0
LPD_HEARTBEAT_LED
Text GLabel 4850 5300 0    50   Input ~ 0
ATCA_RED_LED
Text GLabel 4850 5200 0    50   Input ~ 0
ATCA_BLUE_LED
Text GLabel 4850 5600 0    50   Input ~ 0
ATCA_ORANGE_LED
Text GLabel 4850 5500 0    50   Input ~ 0
ATCA_GREEN_LED
Text Label 4300 4400 0    50   ~ 0
PMBUS_SDA
Text Label 8200 4400 2    50   ~ 0
PMBUS_RST_B
Wire Wire Line
	4850 5200 5200 5200
Wire Wire Line
	5200 5300 4850 5300
Text GLabel 7400 5600 2    50   Input ~ 0
ATCA_EXTRACTION_HANDLE
Text GLabel 7400 5700 2    50   Input ~ 0
ATCA_FP_RESET_B
Wire Wire Line
	7400 5700 7000 5700
Wire Wire Line
	7400 5600 7000 5600
Entry Wire Line
	4100 4500 4200 4600
Entry Wire Line
	4100 4600 4200 4700
Wire Bus Line
	4100 4600 4100 4500
Wire Bus Line
	3900 4500 4100 4500
Text GLabel 8300 4600 2    50   BiDi ~ 0
BOOT[0..3]
Entry Wire Line
	8100 4600 8000 4700
Entry Wire Line
	8100 4700 8000 4800
Wire Bus Line
	8100 4700 8100 4600
Wire Bus Line
	8300 4600 8100 4600
Text GLabel 7400 2300 2    50   Input ~ 0
IN_CLK_P1
Text GLabel 4800 2100 0    50   Input ~ 0
IN_CLK_P2
Text GLabel 7400 2400 2    50   Input ~ 0
IN_CLK_N1
Text GLabel 4800 2200 0    50   Input ~ 0
IN_CLK_N2
Wire Wire Line
	7400 2300 7000 2300
Wire Wire Line
	7400 2400 7000 2400
Wire Wire Line
	5200 2100 4800 2100
Wire Wire Line
	5200 2200 4800 2200
Wire Wire Line
	3950 4300 5200 4300
Wire Wire Line
	3950 4400 5200 4400
Text Notes 7500 2000 0    50   ~ 0
Not connected in Motherboard!
Wire Wire Line
	7400 2000 7000 2000
NoConn ~ 7400 2000
Wire Wire Line
	7000 4400 8500 4400
Wire Wire Line
	7000 4500 8500 4500
Text GLabel 3950 4300 0    50   Input ~ 0
PMBUS_CONN_SCL
Text GLabel 3950 4400 0    50   BiDi ~ 0
PMBUS_CONN_SDA
Text GLabel 8500 4500 2    50   Output ~ 0
PMBUS_CONN_INT_B
Text Label 8200 4500 2    50   ~ 0
PMBUS_INT_B
Text GLabel 8500 4400 2    50   Input ~ 0
PMBUS_CONN_RST_B
Text Label 4300 2500 0    50   ~ 0
B65_IO_31
Text Label 4300 2600 0    50   ~ 0
B65_IO_26
Text Label 7900 2600 2    50   ~ 0
B65_IO_30
Text Label 7900 2700 2    50   ~ 0
B65_IO_32
Text Label 4300 2800 0    50   ~ 0
B65_IO_34
Text Label 4300 2900 0    50   ~ 0
B65_IO_50
Text Label 7900 2900 2    50   ~ 0
B65_IO_38
Wire Wire Line
	4300 2500 5200 2500
Wire Wire Line
	4300 2600 5200 2600
Wire Wire Line
	4300 2800 5200 2800
Wire Wire Line
	4300 2900 5200 2900
Wire Wire Line
	4300 3100 5200 3100
Wire Wire Line
	4300 3200 5200 3200
Wire Wire Line
	4300 3500 5200 3500
Wire Wire Line
	4300 3700 5200 3700
Wire Wire Line
	4300 4000 5200 4000
Wire Wire Line
	4300 4100 5200 4100
Wire Wire Line
	7900 2600 7000 2600
Wire Wire Line
	7900 2700 7000 2700
Wire Wire Line
	7900 2900 7000 2900
Wire Wire Line
	7900 3000 7000 3000
Wire Wire Line
	7900 3200 7000 3200
Wire Wire Line
	7900 3300 7000 3300
Wire Wire Line
	7900 3500 7000 3500
Wire Wire Line
	7900 3600 7000 3600
Wire Wire Line
	7900 3800 7000 3800
Wire Wire Line
	7900 3900 7000 3900
Wire Wire Line
	7900 4100 7000 4100
Wire Wire Line
	7900 4200 7000 4200
Text GLabel 1600 1150 0    50   BiDi ~ 0
B66_IO_[0..51]
Wire Bus Line
	1800 1150 1600 1150
Text GLabel 1600 1300 0    50   BiDi ~ 0
B65_IO_[0..51]
Wire Bus Line
	1800 1300 1600 1300
Wire Wire Line
	4300 3400 5200 3400
Text Label 7900 3000 2    50   ~ 0
B65_IO_41
Text Label 4300 3100 0    50   ~ 0
B65_IO_42
Text Label 4300 3200 0    50   ~ 0
B65_IO_47
Text Label 7900 3200 2    50   ~ 0
B65_IO_44
Text Label 7900 3300 2    50   ~ 0
B65_IO_51
Text Label 4300 3500 0    50   ~ 0
B65_IO_29
Text Label 7900 3500 2    50   ~ 0
B65_IO_16
Text Label 7900 3600 2    50   ~ 0
B65_IO_17
Text Label 4300 3700 0    50   ~ 0
B65_IO_18
Text Label 4300 3800 0    50   ~ 0
B65_IO_10
Text Label 7900 3800 2    50   ~ 0
B65_IO_25
Text Label 7900 3900 2    50   ~ 0
B65_IO_19
Text Label 4300 4000 0    50   ~ 0
B65_IO_24
Text Label 4300 4100 0    50   ~ 0
B65_IO_11
Text Label 7900 4100 2    50   ~ 0
B65_IO_2
Text Label 4300 3400 0    50   ~ 0
B65_IO_49
Text Label 7900 4200 2    50   ~ 0
B65_IO_5
$Comp
L power:PWR_FLAG #FLG?
U 1 1 5FB10A94
P 7450 6150
F 0 "#FLG?" H 7450 6225 50  0001 C CNN
F 1 "PWR_FLAG" H 7450 6323 50  0000 C CNN
F 2 "" H 7450 6150 50  0001 C CNN
F 3 "~" H 7450 6150 50  0001 C CNN
	1    7450 6150
	-1   0    0    1   
$EndComp
Connection ~ 7450 6150
Wire Wire Line
	7450 6150 7700 6150
Wire Wire Line
	4300 3800 5200 3800
$Comp
L KIT_Connector:FMCP_VITA57.4 J2
U 5 1 5EF0BC66
P 5200 2000
F 0 "J2" H 6100 2290 60  0000 C CNN
F 1 "FMCP_VITA57.4" H 6100 2184 60  0000 C CNN
F 2 "KIT_Connector:FMC_SEAM_ASP_184330_BGA-560_40x14_55.778x19.76mm" H 5250 1950 60  0001 L CNN
F 3 "http://suddendocs.samtec.com/prints/asp-188588-01-mkt.pdf" H 5250 1750 60  0001 L CNN
	5    5200 2000
	1    0    0    -1  
$EndComp
Text Label 4300 4300 0    50   ~ 0
PMBUS_SCL
$EndSCHEMATC
