PLATFORM: x86_64-centos7-clang12-dbg
VERSION: 101
COMPILER: clang;12.0.0
RELAX; d7c76; root6; ./RELAX/root6/x86_64-centos7-clang12-dbg; ROOT-a63a9,cmaketools-5b765,HepMC-d5a39,HepPDT-dba76,GSL-30ba4,clhep-b903d
HepMC; d5a39; 2.06.11; ./HepMC/2.06.11/x86_64-centos7-clang12-dbg; 
Geant4; 74902; 10.07.p02; ./Geant4/10.07.p02/x86_64-centos7-clang12-dbg; Boost-fd33b,Python-b0f98,XercesC-714f6,Qt5-3a57b,VecGeom-2c171,clhep-b903d,expat-ad2fa
Garfield++; 4819f; HEAD; ./Garfield++/HEAD/x86_64-centos7-clang12-dbg; ROOT-a63a9,Geant4-74902
Gaudi; 82da7; v35r1; ./Gaudi/v35r1/x86_64-centos7-clang12-dbg; ROOT-a63a9,fmt-18428,CppUnit-b79b3,Boost-fd33b,AIDA-3fe9f,Python-b0f98,rangev3-79ab4,HepMC-d5a39,doxygen-edb63,XercesC-714f6,cppgsl-7a1b6,six-05a82,xenv-2854f,jsonmcpp-72770,HepPDT-dba76,GSL-30ba4,gperftools-f56d9,clhep-b903d,libunwind-2fa0a
DD4hep; 71f66; 01.18; ./DD4hep/01.18/x86_64-centos7-clang12-dbg; ROOT-a63a9,hepmc3-5b12d,Geant4-74902,EDM4hep-42a5a,Boost-fd33b,Python-b0f98,LCIO-6b70a,tbb-daa7e,XercesC-714f6,assimp-2e01c
EDM4hep; 42a5a; 00.03; ./EDM4hep/00.03/x86_64-centos7-clang12-dbg; ROOT-a63a9,delphes-a9647,podio-f9275,tricktrack-829d0,HepMC-d5a39,HepPDT-dba76,Jinja2-7af1c
lcgenv; 74a32; 1.3.17; ./lcgenv/1.3.17/x86_64-centos7-clang12-dbg; 
absl_py; 9ac3f; 0.11.0; ./absl_py/0.11.0/x86_64-centos7-clang12-dbg; Python-b0f98,setuptools-8e80a
acts; 2ff1f; 6.0.0; ./acts/6.0.0/x86_64-centos7-clang12-dbg; ROOT-a63a9,Boost-fd33b,eigen-642a5,DD4hep-71f66
AIDA; 3fe9f; 3.2.1; ./AIDA/3.2.1/x86_64-centos7-clang12-dbg; 
alabaster; 58729; 0.7.12; ./alabaster/0.7.12/x86_64-centos7-clang12-dbg; Python-b0f98,setuptools-8e80a
alpaka; 79755; 0.5.0; ./alpaka/0.5.0/x86_64-centos7-clang12-dbg; Boost-fd33b,tbb-daa7e
ant; 12058; 1.10.7; ./ant/1.10.7/x86_64-centos7-clang12-dbg; java-884d8
anyio; 92f6e; 3.2.1; ./anyio/3.2.1/x86_64-centos7-clang12-dbg; sniffio-81ed0,pip-525a1,idna-8f438,Python-b0f98
appdirs; e678c; 1.4.4; ./appdirs/1.4.4/x86_64-centos7-clang12-dbg; Python-b0f98,setuptools-8e80a
argon2_cffi; f3252; 20.1.0; ./argon2_cffi/20.1.0/x86_64-centos7-clang12-dbg; cffi-b7ef5,pip-525a1,six-05a82,Python-b0f98
archspec; c7282; 0.1.2; ./archspec/0.1.2/x86_64-centos7-clang12-dbg; click-6dd67,six-05a82,Python-b0f98,setuptools-8e80a
arrow; 78300; 3.0.0; ./arrow/3.0.0/x86_64-centos7-clang12-dbg; brotli-7762d,snappy-28a75,Boost-fd33b,flatbuffers-64f4c,Python-b0f98,double_conversion-6c1f5,gflags-4cfd4,lz4-9bdfe,glog-4bef1,numpy-949ff,rapidjson-0b862,thrift-d95cf
assimp; 2e01c; 5.0.1; ./assimp/5.0.1/x86_64-centos7-clang12-dbg; Boost-fd33b
asn1crypto; 0ba9c; 0.24.0; ./asn1crypto/0.24.0/x86_64-centos7-clang12-dbg; Python-b0f98,setuptools-8e80a
astor; fabc7; 0.8.1; ./astor/0.8.1/x86_64-centos7-clang12-dbg; Python-b0f98,setuptools-8e80a
astroid; d8755; 2.3.3; ./astroid/2.3.3/x86_64-centos7-clang12-dbg; Python-b0f98,lazy_object_proxy-d8bf6,wrapt-fb18f,typed_ast-39b4e,six-05a82,pytest_runner-60db1,setuptools-8e80a
astunparse; 35366; 1.6.3; ./astunparse/1.6.3/x86_64-centos7-clang12-dbg; six-05a82,Python-b0f98,setuptools-8e80a
async_generator; 670fd; 1.10; ./async_generator/1.10/x86_64-centos7-clang12-dbg; Python-b0f98,setuptools-8e80a
atomicwrites; 07e69; 1.3.0; ./atomicwrites/1.3.0/x86_64-centos7-clang12-dbg; Python-b0f98,setuptools-8e80a
attrs; c2572; 21.2.0; ./attrs/21.2.0/x86_64-centos7-clang12-dbg; Python-b0f98,setuptools-8e80a
autoconf; 8d7bc; 2.69; ./autoconf/2.69/x86_64-centos7-clang12-dbg; m4-3bfe7
automake; db22f; 1.16.1; ./automake/1.16.1/x86_64-centos7-clang12-dbg; autoconf-8d7bc
autopep8; e56f8; 1.4.4; ./autopep8/1.4.4/x86_64-centos7-clang12-dbg; pycodestyle-ff694,Python-b0f98,setuptools-8e80a
awkward0; b618c; 0.15.3; ./awkward0/0.15.3/x86_64-centos7-clang12-dbg; numpy-949ff,pytest_runner-60db1
awkward; 39b30; 1.0.2; ./awkward/1.0.2/x86_64-centos7-clang12-dbg; numpy-949ff,pytest_runner-60db1
babel; 36d8a; 2.9.1; ./babel/2.9.1/x86_64-centos7-clang12-dbg; pytz-1fa06,Python-b0f98,setuptools-8e80a
backcall; b6221; 0.2.0; ./backcall/0.2.0/x86_64-centos7-clang12-dbg; Python-b0f98,setuptools-8e80a
bcrypt; ebc48; 3.1.6; ./bcrypt/3.1.6/x86_64-centos7-clang12-dbg; cffi-b7ef5,six-05a82,Python-b0f98,setuptools-8e80a
beniget; 924c1; 0.4.0; ./beniget/0.4.0/x86_64-centos7-clang12-dbg; gast-f9d3a,Python-b0f98,setuptools-8e80a
benchmark; b220e; 1.5.5; ./benchmark/1.5.5/x86_64-centos7-clang12-dbg; gtest-f1f4a
blas; e5f0c; 0.3.17.openblas; ./blas/0.3.17.openblas/x86_64-centos7-clang12-dbg; 
bleach; 6aa1b; 3.3.1; ./bleach/3.3.1/x86_64-centos7-clang12-dbg; html5lib-30212,Python-b0f98,six-05a82,packaging-d2263,setuptools-8e80a
brotli; 7762d; 1.0.7; ./brotli/1.0.7/x86_64-centos7-clang12-dbg; 
bokeh; 3b605; 2.3.1; ./bokeh/2.3.1/x86_64-centos7-clang12-dbg; python_dateutil-376a4,Python-b0f98,pillow-e0d17,tornado-69177,packaging-d2263,typing_extensions-3e251,Jinja2-7af1c,numpy-949ff,PyYAML-aa126,setuptools-8e80a
Boost; fd33b; 1.77.0; ./Boost/1.77.0/x86_64-centos7-clang12-dbg; zlib-8af4c,numpy-949ff,Python-b0f98
boost_histogram; bd673; 0.13.0; ./boost_histogram/0.13.0/x86_64-centos7-clang12-dbg; numpy-949ff,Python-b0f98,setuptools-8e80a
caniusepython3; ca375; 7.1.0; ./caniusepython3/7.1.0/x86_64-centos7-clang12-dbg; Python-b0f98,requests-24605,packaging-d2263,distlib-faab3,setuptools-8e80a
C50; 2aa47; 2.07; ./C50/2.07/x86_64-centos7-clang12-dbg; 
cachetools; c5109; 3.1.1; ./cachetools/3.1.1/x86_64-centos7-clang12-dbg; Python-b0f98,setuptools-8e80a
cairo; f2c05; 1.17.2; ./cairo/1.17.2/x86_64-centos7-clang12-dbg; pkg_config-c6baf,pixman-46112,png-5186a,freetype-08d63,fontconfig-241fb
Catch2; b9219; 2.13.4; ./Catch2/2.13.4/x86_64-centos7-clang12-dbg; 
ccache; ed8d3; 4.3; ./ccache/4.3/x86_64-centos7-clang12-dbg; 
certifi; 4609e; 2021.5.30; ./certifi/2021.5.30/x86_64-centos7-clang12-dbg; Python-b0f98,setuptools-8e80a
cffi; b7ef5; 1.14.6; ./cffi/1.14.6/x86_64-centos7-clang12-dbg; libffi-26487,pycparser-0fcf2,Python-b0f98,setuptools-8e80a
cfitsio; e4bb8; 3.48; ./cfitsio/3.48/x86_64-centos7-clang12-dbg; 
chardet; b5014; 3.0.4; ./chardet/3.0.4/x86_64-centos7-clang12-dbg; Python-b0f98,setuptools-8e80a
clhep; b903d; 2.4.4.0; ./clhep/2.4.4.0/x86_64-centos7-clang12-dbg; 
click; 6dd67; 7.0; ./click/7.0/x86_64-centos7-clang12-dbg; Python-b0f98,setuptools-8e80a
cloudpickle; de0fa; 1.6.0; ./cloudpickle/1.6.0/x86_64-centos7-clang12-dbg; Python-b0f98,setuptools-8e80a
CMake; 790a8; 3.20.0; ./CMake/3.20.0/x86_64-centos7-clang12-dbg; 
cmaketools; 5b765; 1.8; ./cmaketools/1.8/x86_64-centos7-clang12-dbg; 
coin3d; 05e9a; 3.1.3p2; ./coin3d/3.1.3p2/x86_64-centos7-clang12-dbg; 
colorcet; 0ad28; 2.0.2; ./colorcet/2.0.2/x86_64-centos7-clang12-dbg; Python-b0f98,setuptools-8e80a,pyct-6ec2c
control; 63a58; 0.8.2; ./control/0.8.2/x86_64-centos7-clang12-dbg; matplotlib-9a50f,Python-b0f98,scipy-55ead,numpy-949ff,setuptools-8e80a
CouchDB; f92fa; 1.2; ./CouchDB/1.2/x86_64-centos7-clang12-dbg; Python-b0f98,setuptools-8e80a
coverage; 1ae6b; 4.5.3; ./coverage/4.5.3/x86_64-centos7-clang12-dbg; Python-b0f98,setuptools-8e80a
cppgsl; 7a1b6; 3.1.0; ./cppgsl/3.1.0/x86_64-centos7-clang12-dbg; 
CppUnit; b79b3; 1.14.0; ./CppUnit/1.14.0/x86_64-centos7-clang12-dbg; 
cryptography; 85d4f; 3.4.7; ./cryptography/3.4.7/x86_64-centos7-clang12-dbg; Python-b0f98,cffi-b7ef5,asn1crypto-0ba9c,six-05a82,pip-525a1,setuptools-8e80a
cx_oracle; 3dfb8; 7.1.3; ./cx_oracle/7.1.3/x86_64-centos7-clang12-dbg; oracle-69dfe,Python-b0f98,setuptools-8e80a
cycler; 63c9b; 0.10.0; ./cycler/0.10.0/x86_64-centos7-clang12-dbg; six-05a82,Python-b0f98,setuptools-8e80a
cython; 827d8; 0.29.21; ./cython/0.29.21/x86_64-centos7-clang12-dbg; Python-b0f98,setuptools-8e80a
dask; 945d5; 2021.4.1; ./dask/2021.4.1/x86_64-centos7-clang12-dbg; graphviz-11724,graphviz_py-26b82,Python-b0f98,fsspec-b01df,PyYAML-aa126,partd-179d0,setuptools-8e80a,toolz-f799c
Davix; 9e4c2; 0.7.6; ./Davix/0.7.6/x86_64-centos7-clang12-dbg; Boost-fd33b,libxml2-9cd93
debugpy; ed875; 1.3.0; ./debugpy/1.3.0/x86_64-centos7-clang12-dbg; Python-b0f98,setuptools-8e80a
decorator; d1f66; 5.0.9; ./decorator/5.0.9/x86_64-centos7-clang12-dbg; Python-b0f98,setuptools-8e80a
defusedxml; d8644; 0.7.1; ./defusedxml/0.7.1/x86_64-centos7-clang12-dbg; libxml2-9cd93,Python-b0f98,setuptools-8e80a
delphes; a9647; 3.5.0; ./delphes/3.5.0/x86_64-centos7-clang12-dbg; ROOT-a63a9
deprecation; eed8a; 2.1.0; ./deprecation/2.1.0/x86_64-centos7-clang12-dbg; Python-b0f98,setuptools-8e80a
dill; 327fd; 0.3.3; ./dill/0.3.3/x86_64-centos7-clang12-dbg; Python-b0f98,setuptools-8e80a
distlib; faab3; 0.2.9; ./distlib/0.2.9/x86_64-centos7-clang12-dbg; Python-b0f98
distributed; 2c770; 2021.4.1; ./distributed/2021.4.1/x86_64-centos7-clang12-dbg; click-6dd67,dask-945d5,msgpack-2d18c,cloudpickle-de0fa,zict-9f0c7,psutil-98f0b,Python-b0f98,tornado-69177,sortedcontainers-2234b,six-05a82,toolz-f799c,PyYAML-aa126,setuptools-8e80a,tblib-8939f
distro; cf3bd; 1.5.0; ./distro/1.5.0/x86_64-centos7-clang12-dbg; pip-525a1,Python-b0f98
dm_tree; 72606; 0.1.6; ./dm_tree/0.1.6/x86_64-centos7-clang12-dbg; pip-525a1,six-05a82,Python-b0f98,setuptools-8e80a
docopt; 24c09; 0.6.2; ./docopt/0.6.2/x86_64-centos7-clang12-dbg; Python-b0f98,setuptools-8e80a
docutils; ff3d8; 0.16; ./docutils/0.16/x86_64-centos7-clang12-dbg; Python-b0f98,setuptools-8e80a
double_conversion; 6c1f5; 3.1.5; ./double_conversion/3.1.5/x86_64-centos7-clang12-dbg; 
doxygen; edb63; 1.8.18; ./doxygen/1.8.18/x86_64-centos7-clang12-dbg; graphviz-11724,xapian-04e2c,flex-5ae78,bison-d8b6b
eigen; 642a5; 3.3.7; ./eigen/3.3.7/x86_64-centos7-clang12-dbg; 
elasticsearch; 66fb9; 6.3.0; ./elasticsearch/6.3.0/x86_64-centos7-clang12-dbg; urllib3-ad1db,Python-b0f98,setuptools-8e80a
entrypoints; 912d8; 0.3; ./entrypoints/0.3/x86_64-centos7-clang12-dbg; pip-525a1,Python-b0f98
expat; ad2fa; 2.2.6; ./expat/2.2.6/x86_64-centos7-clang12-dbg; 
fastjet; ddbb2; 3.4.0; ./fastjet/3.4.0/x86_64-centos7-clang12-dbg; 
fftw; 102c2; 3.3.8; ./fftw3/3.3.8/x86_64-centos7-clang12-dbg; 
filelock; c8c23; 3.0.12; ./filelock/3.0.12/x86_64-centos7-clang12-dbg; Python-b0f98,setuptools-8e80a
fjcontrib; 21339; 1.044; ./fjcontrib/1.044/x86_64-centos7-clang12-dbg; fastjet-ddbb2
flake8; cc030; 3.7.8; ./flake8/3.7.8/x86_64-centos7-clang12-dbg; Python-b0f98,mccabe-46956,pyflakes-2b3c0,pycodestyle-ff694,entrypoints-912d8,setuptools-8e80a
flatbuffers; 64f4c; 1.12.0; ./flatbuffers/1.12.0/x86_64-centos7-clang12-dbg; numpy-949ff,setuptools-8e80a
fmt; 18428; 7.1.3; ./fmt/7.1.3/x86_64-centos7-clang12-dbg; 
fontconfig; 241fb; 2.13.1; ./fontconfig/2.13.1/x86_64-centos7-clang12-dbg; pkg_config-c6baf,gperf-699d7,freetype-08d63,expat-ad2fa
fplll; 5b7ab; 5.2.1; ./fplll/5.2.1/x86_64-centos7-clang12-dbg; mpfr-61226
freetype; 08d63; 2.10.0; ./freetype/2.10.0/x86_64-centos7-clang12-dbg; zlib-8af4c
Frontier_Client; 1df46; 2.9.1; ./frontier_client/2.9.1/x86_64-centos7-clang12-dbg; pacparser-bd798,expat-ad2fa
fsspec; b01df; 2021.4.0; ./fsspec/2021.4.0/x86_64-centos7-clang12-dbg; Python-b0f98,setuptools-8e80a,panel-364a5
ftjam; c7179; 2.5.2; ./ftjam/2.5.2/x86_64-centos7-clang12-dbg; bison-d8b6b
funcsigs; 165cd; 1.0.2; ./funcsigs/1.0.2/x86_64-centos7-clang12-dbg; Python-b0f98,setuptools-8e80a
future; dfea5; 0.17.1; ./future/0.17.1/x86_64-centos7-clang12-dbg; Python-b0f98,setuptools-8e80a
gast; f9d3a; 0.5.2; ./gast/0.5.2/x86_64-centos7-clang12-dbg; Python-b0f98,setuptools-8e80a
gdal; 116fc; 3.3.0; ./gdal/3.3.0/x86_64-centos7-clang12-dbg; postgresql-b4308,hdf5-a3b1e,proj-c86df,XercesC-714f6,netcdfc-3e74b,zlib-8af4c,tiff-33276,libgeotiff-9a9b9,sqlite-3c47f
pygdal; 4ddfc; 3.3.0; ./pygdal/3.3.0/x86_64-centos7-clang12-dbg; numpy-949ff,gdal-116fc,Python-b0f98,setuptools-8e80a
gdb; 4c0be; 10.2; ./gdb/10.2/x86_64-centos7-clang12-dbg; texinfo-21d20,Python-b0f98
genshi; 79022; 0.7; ./genshi/0.7/x86_64-centos7-clang12-dbg; Python-b0f98,setuptools-8e80a
geos; 8602e; 3.7.2; ./geos/3.7.2/x86_64-centos7-clang12-dbg; 
gettext; 0f6a2; 0.20.1; ./gettext/0.20.1/x86_64-centos7-clang12-dbg; 
gflags; 4cfd4; 2.2.2; ./gflags/2.2.2/x86_64-centos7-clang12-dbg; 
git; e475b; 2.29.2; ./git/2.29.2/x86_64-centos7-clang12-dbg; expat-ad2fa
globus_sdk; 1fad5; 2.0.1; ./globus_sdk/2.0.1/x86_64-centos7-clang12-dbg; requests-24605,six-05a82,PyJWT-a66fb
glog; 4bef1; 0.4.0; ./glog/0.4.0/x86_64-centos7-clang12-dbg; gflags-4cfd4
gl2ps; 2afdb; 1.4.0; ./gl2ps/1.4.0/x86_64-centos7-clang12-dbg; zlib-8af4c,png-5186a
gnuplot; 8aa5d; 5.4.2; ./gnuplot/5.4.2/x86_64-centos7-clang12-dbg; Qt5-3a57b,cairo-f2c05,pango-dc9ba
google_auth; aceff; 1.6.3; ./google_auth/1.6.3/x86_64-centos7-clang12-dbg; rsa-b8deb,pyasn1_modules-8c31d,Python-b0f98,six-05a82,cachetools-c5109,setuptools-8e80a
google_auth_oauthlib; a3dc9; 0.4.1; ./google_auth_oauthlib/0.4.1/x86_64-centos7-clang12-dbg; google_auth-aceff,requests_oauthlib-1c273,Python-b0f98,setuptools-8e80a
google_pasta; 16d97; 0.2.0; ./google_pasta/0.2.0/x86_64-centos7-clang12-dbg; six-05a82,Python-b0f98,setuptools-8e80a
gperf; 699d7; 3.1; ./gperf/3.1/x86_64-centos7-clang12-dbg; 
graphviz; 11724; 2.40.1; ./graphviz/2.40.1/x86_64-centos7-clang12-dbg; libtool-9ad34,pango-dc9ba,expat-ad2fa,fontconfig-241fb,png-5186a
graphviz_py; 26b82; 0.11.1; ./graphviz_py/0.11.1/x86_64-centos7-clang12-dbg; Python-b0f98,setuptools-8e80a
grpcio; b2bea; 1.28.1; ./grpcio/1.28.1/x86_64-centos7-clang12-dbg; six-05a82,Python-b0f98,setuptools-8e80a
GSL; 30ba4; 2.7; ./GSL/2.7/x86_64-centos7-clang12-dbg; 
gtest; f1f4a; 1.10.0; ./gtest/1.10.0/x86_64-centos7-clang12-dbg; Python-b0f98
hadoop; a8f60; 2.7.5.1; ./hadoop/2.7.5.1/x86_64-centos7-clang12-dbg; protobuf-aa8bd,maven-15b64
hadoop_xrootd; 6d913; 1.0.4; ./hadoop_xrootd/1.0.4/x86_64-centos7-clang12-dbg; maven-15b64,hadoop-a8f60,xrootd-e6c66,java-884d8
harfbuzz; 54c61; 1.9.0; ./harfbuzz/1.9.0/x86_64-centos7-clang12-dbg; cairo-f2c05,freetype-08d63
hbase; 20707; 1.2.0; ./hbase/1.2.0/x86_64-centos7-clang12-dbg; java-884d8
HeapDict; 1600c; 1.0.0; ./HeapDict/1.0.0/x86_64-centos7-clang12-dbg; Python-b0f98,setuptools-8e80a
heaptrack; 3107a; 1.2.0; ./heaptrack/1.2.0/x86_64-centos7-clang12-dbg; zlib-8af4c,Boost-fd33b,gdb-4c0be,libunwind-2fa0a
hepdata_validator; 97fc3; 0.2.3; ./hepdata_validator/0.2.3/x86_64-centos7-clang12-dbg; jsonschema-e84d4,PyYAML-aa126,Python-b0f98,setuptools-8e80a
hepdata_converter; a89ff; 0.2.3; ./hepdata_converter/0.2.3/x86_64-centos7-clang12-dbg; hepdata_validator-97fc3,matplotlib-9a50f,Python-b0f98,setuptools-8e80a
hepmc3; 5b12d; 3.2.4; ./hepmc3/3.2.4/x86_64-centos7-clang12-dbg; ROOT-a63a9
HepPDT; dba76; 2.06.01; ./HepPDT/2.06.01/x86_64-centos7-clang12-dbg; 
highfive; 497d5; 2.0; ./highfive/2.0/x86_64-centos7-clang12-dbg; Boost-fd33b,hdf5-a3b1e
hive; 54fee; 1.1.1; ./hive/1.1.1/x86_64-centos7-clang12-dbg; java-884d8
html5lib; 30212; 1.0.1; ./html5lib/1.0.1/x86_64-centos7-clang12-dbg; webencodings-ebb84,six-05a82,Python-b0f98,setuptools-8e80a
h5py; c4c99; 2.10.0; ./h5py/2.10.0/x86_64-centos7-clang12-dbg; pkg_config-c6baf,pkgconfig-466d5,pip-525a1,cython-827d8,hdf5-a3b1e,Python-b0f98,six-05a82,numpy-949ff,setuptools-8e80a
hdf5; a3b1e; 1.10.6; ./hdf5/1.10.6/x86_64-centos7-clang12-dbg; zlib-8af4c
hypothesis; 1d7b9; 5.3.0; ./hypothesis/5.3.0/x86_64-centos7-clang12-dbg; sortedcontainers-2234b,attrs-c2572,Python-b0f98,setuptools-8e80a
idna; 8f438; 3.2; ./idna/3.2/x86_64-centos7-clang12-dbg; Python-b0f98,setuptools-8e80a
imageio; 9e530; 2.5.0; ./imageio/2.5.0/x86_64-centos7-clang12-dbg; pillow-e0d17,numpy-949ff,Python-b0f98,setuptools-8e80a
imagesize; affc4; 1.2.0; ./imagesize/1.2.0/x86_64-centos7-clang12-dbg; Python-b0f98,setuptools-8e80a
imagemagick; 1c0a1; 7.0.8.7; ./imagemagick/7.0.8.7/x86_64-centos7-clang12-dbg; graphviz-11724,pango-dc9ba,freetype-08d63,zlib-8af4c,fftw-102c2,fontconfig-241fb,png-5186a
iminuit; 6e4fe; 1.5.2; ./iminuit/1.5.2/x86_64-centos7-clang12-dbg; ipython-be640,matplotlib-9a50f,cython-827d8,pylint-ea246,Python-b0f98,scipy-55ead,numpy-949ff,pytest-17efa,setuptools-8e80a
importlib_metadata; 08df5; 2.0.0; ./importlib_metadata/2.0.0/x86_64-centos7-clang12-dbg; zipp-b83e9,setuptools_scm-c204b,Python-b0f98,six-05a82,setuptools-8e80a
importlib_resources; e792d; 1.0.2; ./importlib_resources/1.0.2/x86_64-centos7-clang12-dbg; Python-b0f98,setuptools-8e80a,wheel-91237
iniconfig; a94a4; 1.1.1; ./iniconfig/1.1.1/x86_64-centos7-clang12-dbg; Python-b0f98,setuptools-8e80a
ipaddress; 257a4; 1.0.22; ./ipaddress/1.0.22/x86_64-centos7-clang12-dbg; Python-b0f98,setuptools-8e80a
ipydatawidgets; b8e79; 4.0.1; ./ipydatawidgets/4.0.1/x86_64-centos7-clang12-dbg; traittypes-546c6,Python-b0f98,setuptools-8e80a
ipykernel; d0b42; 6.0.2; ./ipykernel/6.0.2/x86_64-centos7-clang12-dbg; ipython-be640,matplotlib_inline-5589b,Python-b0f98,debugpy-ed875,jupyter_client-b00fa,tornado-69177,six-05a82,traitlets-0b97b,setuptools-8e80a
ipympl; fe3ae; 0.7.0; ./ipympl/0.7.0/x86_64-centos7-clang12-dbg; jupyter_packaging-62f9a,ipykernel-d0b42,matplotlib-9a50f,Python-b0f98,ipywidgets-3f4a0,setuptools-8e80a
ipyparallel; 0de5e; 6.2.4; ./ipyparallel/6.2.4/x86_64-centos7-clang12-dbg; pyzmq-1dae1,python_dateutil-376a4,ipykernel-d0b42,ipython-be640,jupyter_client-b00fa,tornado-69177,decorator-d1f66,ipython_genutils-69fd6,traitlets-0b97b
ipython; be640; 7.25.0; ./ipython/7.25.0/x86_64-centos7-clang12-dbg; backcall-b6221,prompt_toolkit-332ce,pexpect-7efac,Python-b0f98,pickleshare-6730a,pygments-3dbab,jedi-bb2a1,ptyprocess-09a88,six-05a82,decorator-d1f66,simplegeneric-980a9,ipython_genutils-69fd6,pip-525a1,traitlets-0b97b,setuptools-8e80a
ipython_genutils; 69fd6; 0.2.0; ./ipython_genutils/0.2.0/x86_64-centos7-clang12-dbg; Python-b0f98,setuptools-8e80a
ipywidgets; 3f4a0; 7.6.3; ./ipywidgets/7.6.3/x86_64-centos7-clang12-dbg; widgetsnbextension-1d4fa,ipykernel-d0b42,ipython-be640,Python-b0f98,nbformat-aa6ac,traitlets-0b97b,setuptools-8e80a
isort; d3ae6; 4.3.20; ./isort/4.3.20/x86_64-centos7-clang12-dbg; Python-b0f98,setuptools-8e80a
itk; 64320; 5.2.0; ./itk/5.2.0/x86_64-centos7-clang12-dbg; numpy-949ff,itk_numerics-695c0,itk_segmentation-42c76,itk_io-54ff3,Python-b0f98,itk_filtering-2c850,itk_registration-ab6be,pip-525a1,itk_core-a0967
itk_core; a0967; 5.2.0; ./itk_core/5.2.0/x86_64-centos7-clang12-dbg; pip-525a1,Python-b0f98
itk_io; 54ff3; 5.2.0; ./itk_io/5.2.0/x86_64-centos7-clang12-dbg; pip-525a1,itk_core-a0967,Python-b0f98
itk_filtering; 2c850; 5.2.0; ./itk_filtering/5.2.0/x86_64-centos7-clang12-dbg; itk_core-a0967,pip-525a1,itk_numerics-695c0,Python-b0f98
itk_meshtopolydata; 7fbe0; 0.7.0; ./itk_meshtopolydata/0.7.0/x86_64-centos7-clang12-dbg; itk_core-a0967,pip-525a1,numpy-949ff,Python-b0f98
itk_numerics; 695c0; 5.2.0; ./itk_numerics/5.2.0/x86_64-centos7-clang12-dbg; pip-525a1,itk_core-a0967,Python-b0f98
itk_registration; ab6be; 5.2.0; ./itk_registration/5.2.0/x86_64-centos7-clang12-dbg; pip-525a1,itk_filtering-2c850,Python-b0f98
itk_segmentation; 42c76; 5.2.0; ./itk_segmentation/5.2.0/x86_64-centos7-clang12-dbg; pip-525a1,itk_filtering-2c850,Python-b0f98
java; 884d8; 8u222; ./java/8u222/x86_64-centos7-clang12-dbg; 
itkwidgets; 68d09; 0.32.0; ./itkwidgets/0.32.0/x86_64-centos7-clang12-dbg; colorcet-0ad28,matplotlib-9a50f,itk_io-54ff3,itk_filtering-2c850,ipydatawidgets-b8e79,ipympl-fe3ae,itk_meshtopolydata-7fbe0,six-05a82,ipywidgets-3f4a0,numpy-949ff,itk_core-a0967,scipy-55ead,zstandard-7ddf2
jax; 30b8e; 0.2.9; ./jax/0.2.9/x86_64-centos7-clang12-dbg; Python-b0f98,opt_einsum-9df27,absl_py-9ac3f,numpy-949ff,setuptools-8e80a
jaxlib; 146ba; 0.1.59; ./jaxlib/0.1.59/x86_64-centos7-clang12-dbg; numpy-949ff,flatbuffers-64f4c,Python-b0f98,six-05a82,absl_py-9ac3f,pip-525a1,scipy-55ead
jedi; bb2a1; 0.18.0; ./jedi/0.18.0/x86_64-centos7-clang12-dbg; parso-08a1f,Python-b0f98,setuptools-8e80a
jemalloc; 8154a; 5.2.1; ./jemalloc/5.2.1/x86_64-centos7-clang12-dbg; 
Jinja2; 7af1c; 3.0.1; ./Jinja2/3.0.1/x86_64-centos7-clang12-dbg; babel-36d8a,MarkupSafe-4af04,Python-b0f98,setuptools-8e80a
joblib; 3a620; 1.0.1; ./joblib/1.0.1/x86_64-centos7-clang12-dbg; Python-b0f98,setuptools-8e80a
jsonc; e004f; 0.12; ./jsonc/0.12/x86_64-centos7-clang12-dbg; 
jsoncpp; 0c1cb; 1.9.3; ./jsoncpp/1.9.3/x86_64-centos7-clang12-dbg; 
jsonmcpp; 72770; 3.9.1; ./jsonmcpp/3.9.1/x86_64-centos7-clang12-dbg; 
jsonpatch; 2dbc7; 1.28; ./jsonpatch/1.28/x86_64-centos7-clang12-dbg; jsonpointer-9e8fb,Python-b0f98,setuptools-8e80a
jsonpointer; 9e8fb; 2.0; ./jsonpointer/2.0/x86_64-centos7-clang12-dbg; Python-b0f98,setuptools-8e80a
jsonschema; e84d4; 3.2.0; ./jsonschema/3.2.0/x86_64-centos7-clang12-dbg; vcversioner-78048,setuptools_scm-c204b,Python-b0f98,pyrsistent-7db64,attrs-c2572,setuptools-8e80a
julia; 3f207; 1.6.0; ./julia/1.6.0/x86_64-centos7-clang12-dbg; pcre2-1d4f8,pkg_config-c6baf,blas-e5f0c,suitesparse-823f9,Python-b0f98,patchelf-ba5ae,libunwind-2fa0a,zlib-8af4c,mpfr-61226,p7zip-a0ec1
pyjson5; a7114; 0.9.6; ./pyjson5/0.9.6/x86_64-centos7-clang12-dbg; Python-b0f98,setuptools-8e80a
jupyter; 70da6; 1.0.0; ./jupyter/1.0.0/x86_64-centos7-clang12-dbg; notebook-39446,ipython-be640,Python-b0f98,ipywidgets-3f4a0,Jinja2-7af1c,certifi-4609e,setuptools-8e80a,qtconsole-9bf41,pyzmq-1dae1,jsonschema-e84d4,nbconvert-2768f,tornado-69177,jupyter_client-b00fa,nbformat-aa6ac,jupyter_core-29281,ipykernel-d0b42,metakernel-e609c,pygments-3dbab,terminado-b185a,MarkupSafe-4af04,mistune-c46f4,widgetsnbextension-1d4fa,jupyter_console-f63f5,entrypoints-912d8
jupyter_client; b00fa; 6.1.12; ./jupyter_client/6.1.12/x86_64-centos7-clang12-dbg; pyzmq-1dae1,python_dateutil-376a4,Python-b0f98,tornado-69177,traitlets-0b97b,jupyter_core-29281,setuptools-8e80a
jupyter_core; 29281; 4.7.1; ./jupyter_core/4.7.1/x86_64-centos7-clang12-dbg; traitlets-0b97b,Python-b0f98,setuptools-8e80a
jupyter_console; f63f5; 6.1.0; ./jupyter_console/6.1.0/x86_64-centos7-clang12-dbg; prompt_toolkit-332ce,ipykernel-d0b42,ipython-be640,Python-b0f98,pygments-3dbab,jupyter_core-29281,setuptools-8e80a
jupyter_contrib_core; 6f664; 0.3.3; ./jupyter_contrib_core/0.3.3/x86_64-centos7-clang12-dbg; notebook-39446,tornado-69177,jupyter_core-29281,traitlets-0b97b,entrypoints-912d8,setuptools-8e80a
jupyter_contrib_nbextensions; 5370a; 0.5.1; ./jupyter_contrib_nbextensions/0.5.1/x86_64-centos7-clang12-dbg; jupyter_highlight_selected_word-3acdb,lxml-58ae5,jupyter-70da6,jsonschema-e84d4,psutil-98f0b,Python-b0f98,jupyter_nbextensions_configurator-19390,decorator-d1f66,jupyter_latex_envs-d47bc,ipython_genutils-69fd6,jupyter_contrib_core-6f664
jupyter_highlight_selected_word; 3acdb; 0.2.0; ./jupyter_highlight_selected_word/0.2.0/x86_64-centos7-clang12-dbg; Python-b0f98,setuptools-8e80a
jupyter_latex_envs; d47bc; 1.4.4; ./jupyter_latex_envs/1.4.4/x86_64-centos7-clang12-dbg; Python-b0f98,setuptools-8e80a
jupyter_nbextensions_configurator; 19390; 0.4.1; ./jupyter_nbextensions_configurator/0.4.1/x86_64-centos7-clang12-dbg; notebook-39446,tornado-69177,PyYAML-aa126,traitlets-0b97b,jupyter_core-29281,jupyter_contrib_core-6f664
jupyter_packaging; 62f9a; 0.10.4; ./jupyter_packaging/0.10.4/x86_64-centos7-clang12-dbg; tomlkit-cda8b,Python-b0f98,packaging-d2263,deprecation-eed8a,setuptools-8e80a
jupyterlab_pygments; e8ace; 0.1.2; ./jupyterlab_pygments/0.1.2/x86_64-centos7-clang12-dbg; pygments-3dbab,Python-b0f98,setuptools-8e80a
jupyterlab; 0f2b5; 3.0.17; ./jupyterlab/3.0.17/x86_64-centos7-clang12-dbg; jupyterlab_server-33cd6,nbclassic-65bbc,ipython-be640,tornado-69177,node.js-ae229,jupyter_server-3b54f,Jinja2-7af1c,packaging-d2263,jupyter_core-29281
jupyterlab_server; 33cd6; 2.6.1; ./jupyterlab_server/2.6.1/x86_64-centos7-clang12-dbg; babel-36d8a,jsonschema-e84d4,pyjson5-a7114,requests-24605,jupyter_server-3b54f,packaging-d2263
jupyter_server; 3b54f; 1.9.0; ./jupyter_server/1.9.0/x86_64-centos7-clang12-dbg; anyio-92f6e,pyzmq-1dae1,argon2_cffi-f3252,websocket_client-72877,nbconvert-2768f,tornado-69177,ipython_genutils-69fd6,jupyter_client-b00fa,send2trash-e71e8,prometheus_client-b5482,terminado-b185a,Jinja2-7af1c,nbformat-aa6ac,traitlets-0b97b,jupyter_core-29281
keras; 88e1b; 2.4.3; ./keras/2.4.3/x86_64-centos7-clang12-dbg; Python-b0f98,scipy-55ead,theano-c7c68,h5py-c4c99,six-05a82,numpy-949ff,PyYAML-aa126,setuptools-8e80a
keras_applications; 1ab9b; 1.0.8; ./keras_applications/1.0.8/x86_64-centos7-clang12-dbg; Python-b0f98,setuptools-8e80a,keras-88e1b
keras_preprocessing; ab401; 1.1.2; ./keras_preprocessing/1.1.2/x86_64-centos7-clang12-dbg; Python-b0f98,setuptools-8e80a,keras-88e1b
keras_tuner; 99f23; 1.0.3; ./keras_tuner/1.0.3/x86_64-centos7-clang12-dbg; ipython-be640,Python-b0f98,tensorboard-857ad,scipy-55ead,requests-24605,numpy-949ff,packaging-d2263,setuptools-8e80a,kt_legacy-07851
kiwisolver; d6224; 1.0.1; ./kiwisolver/1.0.1/x86_64-centos7-clang12-dbg; Python-b0f98,setuptools-8e80a
kt_legacy; 07851; 1.0.3; ./kt_legacy/1.0.3/x86_64-centos7-clang12-dbg; Python-b0f98,setuptools-8e80a
kubernetes; 28e7a; 9.0.0; ./kubernetes/9.0.0/x86_64-centos7-clang12-dbg; python_dateutil-376a4,urllib3-ad1db,requests_oauthlib-1c273,Python-b0f98,websocket_client-72877,ipaddress-257a4,requests-24605,six-05a82,google_auth-aceff,PyYAML-aa126,certifi-4609e,setuptools-8e80a
lazy_object_proxy; d8bf6; 1.6.0; ./lazy_object_proxy/1.6.0/x86_64-centos7-clang12-dbg; pip-525a1,Python-b0f98,setuptools-8e80a
lcov; b9cb3; 1.14; ./lcov/1.14/x86_64-centos7-clang12-dbg; 
libaio; 3a85a; 0.3.110-1; ./libaio/0.3.110-1/x86_64-centos7-clang12-dbg; 
libffi; 26487; 3.2.1; ./libffi/3.2.1/x86_64-centos7-clang12-dbg; 
libgeotiff; 9a9b9; 1.6.0; ./libgeotiff/1.6.0/x86_64-centos7-clang12-dbg; proj-c86df,tiff-33276
libgit2; 942f6; 1.1.1; ./libgit2/1.1.1/x86_64-centos7-clang12-dbg; 
libpqxx; 1445f; 7.6.0; ./libpqxx/7.6.0/x86_64-centos7-clang12-dbg; postgresql-b4308
libsodium; 0b20d; 1.0.18; ./libsodium/1.0.18/x86_64-centos7-clang12-dbg; 
libsvm; 23959; 3.23; ./libsvm/3.23/x86_64-centos7-clang12-dbg; Python-b0f98
libtool; 9ad34; 2.4.2; ./libtool/2.4.2/x86_64-centos7-clang12-dbg; 
libxml2; 9cd93; 2.9.10; ./libxml2/2.9.10/x86_64-centos7-clang12-dbg; 
libxslt; a0f53; 1.1.34; ./libxslt/1.1.34/x86_64-centos7-clang12-dbg; libxml2-9cd93
LCIO; 6b70a; 02.16.01; ./LCIO/02.16.01/x86_64-centos7-clang12-dbg; ROOT-a63a9,clhep-b903d,SIO-6e311
llvmlite; 95575; 0.36.0; ./llvmlite/0.36.0/x86_64-centos7-clang12-dbg; pip-525a1,Python-b0f98,setuptools-8e80a,wheel-91237
locket; c8488; 0.2.1; ./locket/0.2.1/x86_64-centos7-clang12-dbg; Python-b0f98,setuptools-8e80a
logilabcommon; b045f; 1.4.2; ./logilabcommon/1.4.2/x86_64-centos7-clang12-dbg; pytest-17efa,six-05a82,Python-b0f98,setuptools-8e80a
lwtnn; 1c6be; 2.11.1; ./lwtnn/2.11.1/x86_64-centos7-clang12-dbg; Boost-fd33b,eigen-642a5
lxml; 58ae5; 4.6.2; ./lxml/4.6.2/x86_64-centos7-clang12-dbg; libxml2-9cd93,cython-827d8,Python-b0f98,libxslt-a0f53,setuptools-8e80a
lz4; 9bdfe; 1.9.2; ./lz4/1.9.2/x86_64-centos7-clang12-dbg; 
m2crypto; 1ee94; 0.34.0; ./m2crypto/0.34.0/x86_64-centos7-clang12-dbg; swig-fbde9,Python-b0f98,setuptools-8e80a
markdown; 76ce6; 3.1.1; ./markdown/3.1.1/x86_64-centos7-clang12-dbg; Python-b0f98,setuptools-8e80a
MarkupSafe; 4af04; 2.0.1; ./MarkupSafe/2.0.1/x86_64-centos7-clang12-dbg; Python-b0f98,setuptools-8e80a
matplotlib; 9a50f; 3.4.3; ./matplotlib/3.4.3/x86_64-centos7-clang12-dbg; python_dateutil-376a4,pyparsing-e53b9,kiwisolver-d6224,Python-b0f98,pillow-e0d17,pycairo-fbf5e,freetype-08d63,tornado-69177,messaging-38c95,cycler-63c9b,nose-6cf1f,six-05a82,numpy-949ff,pytz-1fa06,certifi-4609e,setuptools-8e80a,mock-9e5ff
matplotlib_inline; 5589b; 0.1.2; ./matplotlib_inline/0.1.2/x86_64-centos7-clang12-dbg; traitlets-0b97b,Python-b0f98,setuptools-8e80a
maven; 15b64; 3.6.1; ./maven/3.6.1/x86_64-centos7-clang12-dbg; java-884d8
mccabe; 46956; 0.6.1; ./mccabe/0.6.1/x86_64-centos7-clang12-dbg; pytest_runner-60db1,Python-b0f98,setuptools-8e80a
messaging; 38c95; 1.1; ./messaging/1.1/x86_64-centos7-clang12-dbg; Python-b0f98,setuptools-8e80a
metakernel; e609c; 0.24.2; ./metakernel/0.24.2/x86_64-centos7-clang12-dbg; ipykernel-d0b42,ipython-be640,Python-b0f98,pexpect-7efac,setuptools-8e80a
mimesis; 3200d; 4.1.3; ./mimesis/4.1.3/x86_64-centos7-clang12-dbg; Python-b0f98,setuptools-8e80a
minrpc; 4d548; 0.0.11; ./minrpc/0.0.11/x86_64-centos7-clang12-dbg; Python-b0f98,setuptools-8e80a
mistune; c46f4; 0.8.4; ./mistune/0.8.4/x86_64-centos7-clang12-dbg; Python-b0f98,setuptools-8e80a
mock; 9e5ff; 3.0.5; ./mock/3.0.5/x86_64-centos7-clang12-dbg; funcsigs-165cd,pbr-c530e,Python-b0f98,setuptools-8e80a
more_itertools; 6c094; 7.0.0; ./more_itertools/7.0.0/x86_64-centos7-clang12-dbg; six-05a82,Python-b0f98,setuptools-8e80a
mpfi; f2a84; 1.5.3; ./mpfi/1.5.3/x86_64-centos7-clang12-dbg; mpfr-61226
mpfr; 61226; 4.0.2; ./mpfr/4.0.2/x86_64-centos7-clang12-dbg; 
mpmath; f123c; 1.2.1; ./mpmath/1.2.1/x86_64-centos7-clang12-dbg; setuptools_scm-c204b,Python-b0f98,setuptools-8e80a
msgpack; 2d18c; 0.6.1; ./msgpack/0.6.1/x86_64-centos7-clang12-dbg; Python-b0f98,setuptools-8e80a
msgpackc; c4011; 3.2.0; ./msgpackc/3.2.0/x86_64-centos7-clang12-dbg; 
multiprocess; 572c0; 0.70.10; ./multiprocess/0.70.10/x86_64-centos7-clang12-dbg; dill-327fd,Python-b0f98,setuptools-8e80a
mysql; f514c; 10.4.20; ./mysql/10.4.20/x86_64-centos7-clang12-dbg; libxml2-9cd93,Boost-fd33b,zlib-8af4c,jemalloc-8154a,msgpackc-c4011,lz4-9bdfe,zeromq-acdd8,bison-d8b6b
mysql_connector_python; 5c264; 8.0.18; ./mysql_connector_python/8.0.18/x86_64-centos7-clang12-dbg; mysql-f514c,Python-b0f98,six-05a82,pip-525a1,setuptools-8e80a
nanomsg; 30ff1; 1.1.5; ./nanomsg/1.1.5/x86_64-centos7-clang12-dbg; 
nbclassic; 65bbc; 0.3.1; ./nbclassic/0.3.1/x86_64-centos7-clang12-dbg; notebook-39446,jupyter_server-3b54f
nbclient; fd471; 0.5.3; ./nbclient/0.5.3/x86_64-centos7-clang12-dbg; async_generator-670fd,Python-b0f98,jupyter_client-b00fa,nest_asyncio-e8579,nbformat-aa6ac,traitlets-0b97b,setuptools-8e80a
nbconvert; 2768f; 6.1.0; ./nbconvert/6.1.0/x86_64-centos7-clang12-dbg; jupyterlab_pygments-e8ace,pandocfilters-73524,nbclient-fd471,Python-b0f98,pygments-3dbab,entrypoints-912d8,defusedxml-d8644,testpath-a2db9,Jinja2-7af1c,bleach-6aa1b,nbformat-aa6ac,traitlets-0b97b,jupyter_core-29281,mistune-c46f4,setuptools-8e80a
nbformat; aa6ac; 5.1.3; ./nbformat/5.1.3/x86_64-centos7-clang12-dbg; jsonschema-e84d4,Python-b0f98,ipython_genutils-69fd6,traitlets-0b97b,jupyter_core-29281,setuptools-8e80a
nest_asyncio; e8579; 1.5.1; ./nest_asyncio/1.5.1/x86_64-centos7-clang12-dbg; Python-b0f98,setuptools-8e80a
netcdfc; 3e74b; 4.7.0; ./netcdfc/4.7.0/x86_64-centos7-clang12-dbg; zlib-8af4c,m4-3bfe7,hdf5-a3b1e
networkx; de1ea; 2.5.1; ./networkx/2.5.1/x86_64-centos7-clang12-dbg; pytest-17efa,decorator-d1f66,Python-b0f98,setuptools-8e80a
ninja; 3d8f6; 1.10.0; ./ninja/1.10.0/x86_64-centos7-clang12-dbg; 
node.js; ae229; 14.16.1; ./node.js/14.16.1/x86_64-centos7-clang12-dbg; Python-b0f98
nose; 6cf1f; 1.3.7; ./nose/1.3.7/x86_64-centos7-clang12-dbg; Python-b0f98,setuptools-8e80a
notebook; 39446; 6.4.0; ./notebook/6.4.0/x86_64-centos7-clang12-dbg; pyzmq-1dae1,ipykernel-d0b42,argon2_cffi-f3252,Python-b0f98,nbconvert-2768f,ipaddress-257a4,tornado-69177,ipython_genutils-69fd6,jupyter_client-b00fa,send2trash-e71e8,prometheus_client-b5482,terminado-b185a,Jinja2-7af1c,nbformat-aa6ac,traitlets-0b97b,jupyter_core-29281
numba; 9f046; 0.51.2; ./numba/0.51.2/x86_64-centos7-clang12-dbg; llvmlite-95575,numpy-949ff,Python-b0f98,setuptools-8e80a
numexpr; 10663; 2.6.9; ./numexpr/2.6.9/x86_64-centos7-clang12-dbg; numpy-949ff,Python-b0f98
numpy; 949ff; 1.21.1; ./numpy/1.21.1/x86_64-centos7-clang12-dbg; cython-827d8,blas-e5f0c,Python-b0f98,setuptools-8e80a
oauthlib; 29c53; 3.0.1; ./oauthlib/3.0.1/x86_64-centos7-clang12-dbg; Python-b0f98,setuptools-8e80a,cryptography-85d4f
ocaml; 1fc72; 4.12.0; ./ocaml/4.12.0/x86_64-centos7-clang12-dbg; 
omniorb; 193d3; 4.2.4; ./omniorb/4.2.4/x86_64-centos7-clang12-dbg; Python-b0f98
onnxruntime; 47224; 1.8.0; ./onnxruntime/1.8.0/x86_64-centos7-clang12-dbg; blas-e5f0c,pip-525a1,Python-b0f98,protobuf-aa8bd,six-05a82,wheel-91237,numpy-949ff,setuptools-8e80a
openmpi; 37032; 3.1.0; ./openmpi/3.1.0/x86_64-centos7-clang12-dbg; 
opt_einsum; 9df27; 3.2.0; ./opt_einsum/3.2.0/x86_64-centos7-clang12-dbg; numpy-949ff,Python-b0f98,setuptools-8e80a
oracle; 69dfe; 19.11.0.0.0; ./oracle/19.11.0.0.0/x86_64-centos7-clang12-dbg; libaio-3a85a
packaging; d2263; 21.0; ./packaging/21.0/x86_64-centos7-clang12-dbg; pyparsing-e53b9,six-05a82,Python-b0f98,setuptools-8e80a
pacparser; bd798; 1.3.7; ./pacparser/1.3.7/x86_64-centos7-clang12-dbg; 
pandas; b0080; 1.2.2; ./pandas/1.2.2/x86_64-centos7-clang12-dbg; python_dateutil-376a4,cython-827d8,Python-b0f98,hypothesis-1d7b9,numpy-949ff,pytz-1fa06,setuptools-8e80a
pandocfilters; 73524; 1.4.3; ./pandocfilters/1.4.3/x86_64-centos7-clang12-dbg; Python-b0f98,setuptools-8e80a
panel; 364a5; 0.11.3; ./panel/0.11.3/x86_64-centos7-clang12-dbg; Python-b0f98,tqdm-0bdee,pyviz_comms-ca17a,requests-24605,param-88f8c,node.js-ae229,pyct-6ec2c,numpy-949ff,bokeh-3b605,setuptools-8e80a,markdown-76ce6
pango; dc9ba; 1.40.13; ./pango/1.40.13/x86_64-centos7-clang12-dbg; cairo-f2c05,harfbuzz-54c61,freetype-08d63,fontconfig-241fb
param; 88f8c; 1.10.1; ./param/1.10.1/x86_64-centos7-clang12-dbg; Python-b0f98,setuptools-8e80a
paramiko; f3af7; 2.4.2; ./paramiko/2.4.2/x86_64-centos7-clang12-dbg; bcrypt-ebc48,Python-b0f98,pyasn1-09f0d,pynacl-845df,setuptools-8e80a,cryptography-85d4f
parse; 07c65; 1.19.0; ./parse/1.19.0/x86_64-centos7-clang12-dbg; Python-b0f98,setuptools-8e80a
parsl; ed365; 0.9.0; ./parsl/0.9.0/x86_64-centos7-clang12-dbg; ipykernel-d0b42,dill-327fd,typeguard-18e96,psutil-98f0b,globus_sdk-1fad5,ipyparallel-0de5e,paramiko-f3af7,requests-24605,tblib-8939f
parso; 08a1f; 0.8.2; ./parso/0.8.2/x86_64-centos7-clang12-dbg; Python-b0f98,setuptools-8e80a
partd; 179d0; 1.2.0; ./partd/1.2.0/x86_64-centos7-clang12-dbg; locket-c8488,Python-b0f98,setuptools-8e80a,toolz-f799c
patchelf; ba5ae; 0.12; ./patchelf/0.12/x86_64-centos7-clang12-dbg; 
pathlib2; 9e295; 2.3.3; ./pathlib2/2.3.3/x86_64-centos7-clang12-dbg; scandir-a79df,six-05a82,Python-b0f98,setuptools-8e80a
pathos; 04053; 0.2.3; ./pathos/0.2.3/x86_64-centos7-clang12-dbg; ppft-2b6b8,multiprocess-572c0,pox-7aba3,Python-b0f98,six-05a82,setuptools-8e80a
patsy; 57940; 0.5.1; ./patsy/0.5.1/x86_64-centos7-clang12-dbg; Python-b0f98,pandas-b0080,six-05a82,numpy-949ff,setuptools-8e80a
pbr; c530e; 5.2.1; ./pbr/5.2.1/x86_64-centos7-clang12-dbg; Python-b0f98,setuptools-8e80a
pcre; 5c0c1; 8.43; ./pcre/8.43/x86_64-centos7-clang12-dbg; 
pcre2; 1d4f8; 10.36; ./pcre2/10.36/x86_64-centos7-clang12-dbg; 
pexpect; 7efac; 4.8.0; ./pexpect/4.8.0/x86_64-centos7-clang12-dbg; ptyprocess-09a88,Python-b0f98,setuptools-8e80a
pickleshare; 6730a; 0.7.5; ./pickleshare/0.7.5/x86_64-centos7-clang12-dbg; Python-b0f98,setuptools-8e80a,pathlib2-9e295
pillow; e0d17; 8.2.0; ./pillow/8.2.0/x86_64-centos7-clang12-dbg; Python-b0f98,freetype-08d63,cffi-b7ef5,zlib-8af4c,libffi-26487,setuptools-8e80a
pip; 525a1; 21.0.1; ./pip/21.0.1/x86_64-centos7-clang12-dbg; Python-b0f98,setuptools-8e80a,wheel-91237
pipenv; e66c3; 2020.11.15; ./pipenv/2020.11.15/x86_64-centos7-clang12-dbg; Python-b0f98,virtualenv_clone-3ec4b,pip-525a1,virtualenv-fa804,certifi-4609e,setuptools-8e80a
pixman; 46112; 0.38.4; ./pixman/0.38.4/x86_64-centos7-clang12-dbg; 
pkgconfig; 466d5; 1.5.1; ./pkgconfig/1.5.1/x86_64-centos7-clang12-dbg; Python-b0f98,setuptools-8e80a
plotly; 6bb41; 4.5.0; ./plotly/4.5.0/x86_64-centos7-clang12-dbg; matplotlib-9a50f,retrying-e09d8,six-05a82,Python-b0f98
pluggy; ed97f; 0.13.1; ./pluggy/0.13.1/x86_64-centos7-clang12-dbg; zipp-b83e9,setuptools_scm-c204b,importlib_metadata-08df5,Python-b0f98,setuptools-8e80a
ply; 2cb25; 3.11; ./ply/3.11/x86_64-centos7-clang12-dbg; Python-b0f98,setuptools-8e80a
png; 5186a; 1.6.37; ./png/1.6.37/x86_64-centos7-clang12-dbg; zlib-8af4c
podio; f9275; 00.13; ./podio/00.13/x86_64-centos7-clang12-dbg; ROOT-a63a9,PyYAML-aa126,SIO-6e311,Python-b0f98
postgresql; b4308; 12.2; ./postgresql/12.2/x86_64-centos7-clang12-dbg; 
pox; 7aba3; 0.2.5; ./pox/0.2.5/x86_64-centos7-clang12-dbg; Python-b0f98,setuptools-8e80a
ppft; 2b6b8; 1.6.4.9; ./ppft/1.6.4.9/x86_64-centos7-clang12-dbg; dill-327fd,Python-b0f98,setuptools-8e80a
prctl; 56d79; 1.7; ./prctl/1.7/x86_64-centos7-clang12-dbg; Python-b0f98,setuptools-8e80a
prettytable; a8ac0; 0.7.2; ./prettytable/0.7.2/x86_64-centos7-clang12-dbg; Python-b0f98,setuptools-8e80a
proj; c86df; 8.0.0; ./proj/8.0.0/x86_64-centos7-clang12-dbg; pkg_config-c6baf,tiff-33276,sqlite-3c47f
prometheus_client; b5482; 0.11.0; ./prometheus_client/0.11.0/x86_64-centos7-clang12-dbg; Python-b0f98,setuptools-8e80a
prompt_toolkit; 332ce; 3.0.19; ./prompt_toolkit/3.0.19/x86_64-centos7-clang12-dbg; wcwidth-9c6e3,six-05a82,Python-b0f98,setuptools-8e80a
protobuf; aa8bd; 2.5.0; ./protobuf/2.5.0/x86_64-centos7-clang12-dbg; 
psutil; 98f0b; 5.6.2; ./psutil/5.6.2/x86_64-centos7-clang12-dbg; Python-b0f98,setuptools-8e80a
ptyprocess; 09a88; 0.7.0; ./ptyprocess/0.7.0/x86_64-centos7-clang12-dbg; Python-b0f98,setuptools-8e80a
py; 7ea55; 1.9.0; ./py/1.9.0/x86_64-centos7-clang12-dbg; setuptools_scm-c204b,Python-b0f98,setuptools-8e80a
py4j; 9fc36; 0.10.9.1; ./py4j/0.10.9.1/x86_64-centos7-clang12-dbg; Python-b0f98,setuptools-8e80a
pynacl; 845df; 1.3.0; ./pynacl/1.3.0/x86_64-centos7-clang12-dbg; Python-b0f98,cffi-b7ef5,six-05a82,pycparser-0fcf2,setuptools-8e80a
pyanalysis; 83552; 2.0; ./pyanalysis/2.0/x86_64-centos7-clang12-dbg; scikitlearn-b8b58,numexpr-10663,pyparsing-e53b9,hepdata_converter-a89ff,hepdata_validator-97fc3,matplotlib-9a50f,joblib-3a620,uncertainties-d7990,elasticsearch-66fb9,numpy-949ff,pytz-1fa06,sympy-7b31a,scipy-55ead,iminuit-6e4fe
pyarrow; 4a1f6; 3.0.0; ./pyarrow/3.0.0/x86_64-centos7-clang12-dbg; pkg_config-c6baf,setuptools_scm-c204b,cython-827d8,arrow-78300,six-05a82,numpy-949ff
pyasn1; 09f0d; 0.4.5; ./pyasn1/0.4.5/x86_64-centos7-clang12-dbg; Python-b0f98,setuptools-8e80a
pyasn1_modules; 8c31d; 0.2.5; ./pyasn1_modules/0.2.5/x86_64-centos7-clang12-dbg; pyasn1-09f0d,Python-b0f98,setuptools-8e80a
pybind11; f9537; 2.6.2; ./pybind11/2.6.2/x86_64-centos7-clang12-dbg; Python-b0f98,setuptools-8e80a
pycairo; fbf5e; 1.18.1; ./pycairo/1.18.1/x86_64-centos7-clang12-dbg; cairo-f2c05,Python-b0f98,setuptools-8e80a
pycodestyle; ff694; 2.5.0; ./pycodestyle/2.5.0/x86_64-centos7-clang12-dbg; Python-b0f98,setuptools-8e80a
pycparser; 0fcf2; 2.20; ./pycparser/2.20/x86_64-centos7-clang12-dbg; Python-b0f98,setuptools-8e80a
pyct; 6ec2c; 0.4.6; ./pyct/0.4.6/x86_64-centos7-clang12-dbg; Python-b0f98,setuptools-8e80a,param-88f8c
pydot; 75f5e; 1.4.1; ./pydot/1.4.1/x86_64-centos7-clang12-dbg; pyparsing-e53b9,Python-b0f98
pydot_ng; 85a47; 2.0.0; ./pydot_ng/2.0.0/x86_64-centos7-clang12-dbg; pyparsing-e53b9,Python-b0f98
pyflakes; 2b3c0; 2.1.1; ./pyflakes/2.1.1/x86_64-centos7-clang12-dbg; Python-b0f98,setuptools-8e80a
pygments; 3dbab; 2.9.0; ./pygments/2.9.0/x86_64-centos7-clang12-dbg; Python-b0f98,setuptools-8e80a
pygraphics; 694ef; 2.0; ./pygraphics/2.0/x86_64-centos7-clang12-dbg; pyqt5-22d4f,sip-b7bbb,pydot-75f5e
pygraphviz; c7261; 1.7; ./pygraphviz/1.7/x86_64-centos7-clang12-dbg; graphviz-11724,Python-b0f98,setuptools-8e80a
PyHEADTAIL; a20be; 1.14.1; ./PyHEADTAIL/1.14.1/x86_64-centos7-clang12-dbg; cython-827d8,Python-b0f98,scipy-55ead,h5py-c4c99,numpy-949ff,setuptools-8e80a
pyhf; 51fee; 0.5.4; ./pyhf/0.5.4/x86_64-centos7-clang12-dbg; click-6dd67,jsonpatch-2dbc7,uproot-da99d,matplotlib-9a50f,jsonschema-e84d4,uproot3-8292c,Python-b0f98,jaxlib-146ba,tqdm-0bdee,requests-24605,iminuit-6e4fe,jax-30b8e,numpy-949ff,tensorflow-a17ed,torch-38e04,scipy-55ead,setuptools-8e80a
PyJWT; a66fb; 2.0.1; ./PyJWT/2.0.1/x86_64-centos7-clang12-dbg; setuptools-8e80a
pylint; ea246; 2.3.1; ./pylint/2.3.1/x86_64-centos7-clang12-dbg; Python-b0f98,mccabe-46956,isort-d3ae6,astroid-d8755,setuptools-8e80a
pyparser; f3ca9; 1.0; ./pyparser/1.0/x86_64-centos7-clang12-dbg; parse-07c65,Python-b0f98,setuptools-8e80a
pyparsing; e53b9; 2.4.7; ./pyparsing/2.4.7/x86_64-centos7-clang12-dbg; Python-b0f98,setuptools-8e80a
pyqt5; 22d4f; 5.12.3; ./pyqt5/5.12.3/x86_64-centos7-clang12-dbg; Qt5-3a57b,sip-b7bbb,Python-b0f98
PyRDF; b43f2; 0.2.1; ./PyRDF/0.2.1/x86_64-centos7-clang12-dbg; ROOT-a63a9,Python-b0f98,py4j-9fc36,nose-6cf1f,spark-3c30f,setuptools-8e80a
pyrsistent; 7db64; 0.18.0; ./pyrsistent/0.18.0/x86_64-centos7-clang12-dbg; six-05a82,Python-b0f98,setuptools-8e80a
pyserial; 0c5a5; 3.4; ./pyserial/3.4/x86_64-centos7-clang12-dbg; Python-b0f98,setuptools-8e80a
pystan; 9ed1a; 3.1.1; ./pystan/3.1.1/x86_64-centos7-clang12-dbg; numpy-949ff,cython-827d8,Python-b0f98,wheel-91237,pip-525a1,setuptools-8e80a
pyshp; 82be9; 2.1.0; ./pyshp/2.1.0/x86_64-centos7-clang12-dbg; setuptools-8e80a
pytables; 3facc; 3.6.1; ./pytables/3.6.1/x86_64-centos7-clang12-dbg; numexpr-10663,cython-827d8,hdf5-a3b1e,Python-b0f98,numpy-949ff
pytest; 17efa; 6.1.1; ./pytest/6.1.1/x86_64-centos7-clang12-dbg; atomicwrites-07e69,py-7ea55,toml-8352c,Python-b0f98,more_itertools-6c094,six-05a82,attrs-c2572,packaging-d2263,funcsigs-165cd,pluggy-ed97f,iniconfig-a94a4,setuptools-8e80a
pytest_runner; 60db1; 5.1; ./pytest_runner/5.1/x86_64-centos7-clang12-dbg; setuptools_scm-c204b,Python-b0f98,setuptools-8e80a
Python; b0f98; 3.9.6; ./Python/3.9.6/x86_64-centos7-clang12-dbg; libffi-26487,sqlite-3c47f
python_dateutil; 376a4; 2.8.2; ./python_dateutil/2.8.2/x86_64-centos7-clang12-dbg; setuptools_scm-c204b,six-05a82,Python-b0f98,setuptools-8e80a
python_gitlab; 6022d; 1.8.0; ./python_gitlab/1.8.0/x86_64-centos7-clang12-dbg; requests-24605,six-05a82,Python-b0f98,setuptools-8e80a
python_vxi11; 1297d; 0.9; ./python_vxi11/0.9/x86_64-centos7-clang12-dbg; Python-b0f98,setuptools-8e80a
pythran; 0fed6; 0.9.12.post1; ./pythran/0.9.12.post1/x86_64-centos7-clang12-dbg; numpy-949ff,ply-2cb25,gast-f9d3a,pip-525a1,Python-b0f98,beniget-924c1,setuptools-8e80a
pytools; ed956; 2019.1.1; ./pytools/2019.1.1/x86_64-centos7-clang12-dbg; lxml-58ae5,notebook-39446,ipython-be640,dill-327fd,sqlalchemy-94f41,wcwidth-9c6e3,requests-24605,ptyprocess-09a88,ipywidgets-3f4a0,Jinja2-7af1c,chardet-b5014,genshi-79022,simplejson-ab340,PyYAML-aa126,setuptools-8e80a,pytz-1fa06,pyzmq-1dae1,ppft-2b6b8,qtconsole-9bf41,prompt_toolkit-332ce,simplegeneric-980a9,certifi-4609e,urllib3-ad1db,m2crypto-1ee94,prctl-56d79,jsonschema-e84d4,pandas-b0080,nbconvert-2768f,jupyter_client-b00fa,pathos-04053,tornado-69177,py4j-9fc36,six-05a82,wheel-91237,ipython_genutils-69fd6,pip-525a1,python_gitlab-6022d,nbformat-aa6ac,jupyter_core-29281,python_dateutil-376a4,py-7ea55,ipykernel-d0b42,cx_oracle-3dfb8,cycler-63c9b,pygments-3dbab,metakernel-e609c,decorator-d1f66,terminado-b185a,CouchDB-f92fa,nose-6cf1f,MarkupSafe-4af04,coverage-1ae6b,traitlets-0b97b,mistune-c46f4,mock-9e5ff,stomppy-68911,jupyter-70da6,pox-7aba3,prettytable-a8ac0,pickleshare-6730a,messaging-38c95,networkx-de1ea,singledispatch-69b13,pathlib2-9e295,jupyter_console-f63f5,pexpect-7efac,pytest-17efa
pytz; 1fa06; 2021.1; ./pytz/2021.1/x86_64-centos7-clang12-dbg; Python-b0f98,setuptools-8e80a
pyviz_comms; ca17a; 2.0.1; ./pyviz_comms/2.0.1/x86_64-centos7-clang12-dbg; Python-b0f98,setuptools-8e80a
pywt; ab071; 1.0.3; ./pywt/1.0.3/x86_64-centos7-clang12-dbg; cython-827d8,Python-b0f98,pillow-e0d17,numpy-949ff,setuptools-8e80a
PyYAML; aa126; 5.3.1; ./pyyaml/5.3.1/x86_64-centos7-clang12-dbg; Python-b0f98,setuptools-8e80a
pyzmq; 1dae1; 22.1.0; ./pyzmq/22.1.0/x86_64-centos7-clang12-dbg; cython-827d8,Python-b0f98,setuptools-8e80a,zeromq-acdd8
p7zip; a0ec1; 16.02; ./p7zip/16.02/x86_64-centos7-clang12-dbg; 
QKeras; 622c3; 0.9.0; ./QKeras/0.9.0/x86_64-centos7-clang12-dbg; scikitlearn-b8b58,pyparser-f3ca9,Python-b0f98,scipy-55ead,tqdm-0bdee,tensorflow_model_optimization-8b9d6,networkx-de1ea,keras_tuner-99f23,numpy-949ff,setuptools-8e80a
QMtest; 0019f; 2.4.1; ./QMtest/2.4.1/x86_64-centos7-clang12-dbg; Python-b0f98
Qt5; 3a57b; 5.12.4; ./qt5/5.12.4/x86_64-centos7-clang12-dbg; libxkbcommon-13e99,Python-b0f98,fontconfig-241fb
qtconsole; 9bf41; 4.5.1; ./qtconsole/4.5.1/x86_64-centos7-clang12-dbg; ipykernel-d0b42,Python-b0f98,pygments-3dbab,jupyter_client-b00fa,Qt5-3a57b,ipython_genutils-69fd6,traitlets-0b97b,jupyter_core-29281,setuptools-8e80a
qtpy; 50b99; 1.7.1; ./qtpy/1.7.1/x86_64-centos7-clang12-dbg; pyqt5-22d4f,Python-b0f98,setuptools-8e80a
rangev3; 79ab4; 0.11.0; ./rangev3/0.11.0/x86_64-centos7-clang12-dbg; 
rapidjson; 0b862; 1.1.0; ./rapidjson/1.1.0/x86_64-centos7-clang12-dbg; 
redis; cf93c; 3.2.1; ./redis/3.2.1/x86_64-centos7-clang12-dbg; Python-b0f98,setuptools-8e80a
requests; 24605; 2.26.0; ./requests/2.26.0/x86_64-centos7-clang12-dbg; urllib3-ad1db,idna-8f438,Python-b0f98,chardet-b5014,certifi-4609e,setuptools-8e80a
requests_oauthlib; 1c273; 1.2.0; ./requests_oauthlib/1.2.0/x86_64-centos7-clang12-dbg; oauthlib-29c53,requests-24605,Python-b0f98,setuptools-8e80a
retrying; e09d8; 1.3.3; ./retrying/1.3.3/x86_64-centos7-clang12-dbg; six-05a82,Python-b0f98
rise; ef395; 5.5.0; ./rise/5.5.0/x86_64-centos7-clang12-dbg; notebook-39446,Python-b0f98,tornado-69177,decorator-d1f66,ipython_genutils-69fd6,traitlets-0b97b,jupyter_core-29281,setuptools-8e80a
rsa; b8deb; 4.0; ./rsa/4.0/x86_64-centos7-clang12-dbg; pyasn1-09f0d,Python-b0f98,setuptools-8e80a
scandir; a79df; 1.10.0; ./scandir/1.10.0/x86_64-centos7-clang12-dbg; Python-b0f98,setuptools-8e80a
scikitimage; fc044; 0.14.3; ./scikitimage/0.14.3/x86_64-centos7-clang12-dbg; cython-827d8,matplotlib-9a50f,Python-b0f98,pillow-e0d17,scipy-55ead,pywt-ab071,networkx-de1ea,numpy-949ff,imageio-9e530,setuptools-8e80a
scikitlearn; b8b58; 0.24.2; ./scikitlearn/0.24.2/x86_64-centos7-clang12-dbg; cython-827d8,joblib-3a620,Python-b0f98,threadpoolctl-c16d7,numpy-949ff,scipy-55ead
scipy; 55ead; 1.7.0; ./scipy/1.7.0/x86_64-centos7-clang12-dbg; pip-525a1,Python-b0f98,pybind11-f9537,pythran-0fed6,numpy-949ff,setuptools-8e80a
seaborn; 40987; 0.11.2; ./seaborn/0.11.2/x86_64-centos7-clang12-dbg; matplotlib-9a50f,Python-b0f98,pandas-b0080,scipy-55ead,statsmodels-8bee6,numpy-949ff,setuptools-8e80a
send2trash; e71e8; 1.7.1; ./send2trash/1.7.1/x86_64-centos7-clang12-dbg; Python-b0f98,setuptools-8e80a
setuptools; 8e80a; 57.1.0; ./setuptools/57.1.0/x86_64-centos7-clang12-dbg; Python-b0f98
setuptools_scm; c204b; 3.3.3; ./setuptools_scm/3.3.3/x86_64-centos7-clang12-dbg; Python-b0f98,setuptools-8e80a
shapely; 8681a; 1.7.1; ./shapely/1.7.1/x86_64-centos7-clang12-dbg; cython-827d8,geos-8602e,Python-b0f98,numpy-949ff,setuptools-8e80a
simdjson; bb0c1; 0.9.2; ./simdjson/0.9.2/x86_64-centos7-clang12-dbg; 
simplegeneric; 980a9; 0.8.1; ./simplegeneric/0.8.1/x86_64-centos7-clang12-dbg; Python-b0f98,setuptools-8e80a
simplejson; ab340; 3.16.1; ./simplejson/3.16.1/x86_64-centos7-clang12-dbg; Python-b0f98,setuptools-8e80a
singledispatch; 69b13; 3.4.0.3; ./singledispatch/3.4.0.3/x86_64-centos7-clang12-dbg; six-05a82,Python-b0f98,setuptools-8e80a
sip; b7bbb; 4.19.15; ./sip/4.19.15/x86_64-centos7-clang12-dbg; Python-b0f98
six; 05a82; 1.16.0; ./six/1.16.0/x86_64-centos7-clang12-dbg; Python-b0f98,setuptools-8e80a
snappy; 28a75; 1.1.7; ./snappy/1.1.7/x86_64-centos7-clang12-dbg; 
sniffio; 81ed0; 1.2.0; ./sniffio/1.2.0/x86_64-centos7-clang12-dbg; pip-525a1,Python-b0f98,setuptools-8e80a
snowballstemmer; 58a08; 2.1.0; ./snowballstemmer/2.1.0/x86_64-centos7-clang12-dbg; Python-b0f98,setuptools-8e80a
sollya; 60a5a; 7.0; ./sollya/7.0/x86_64-centos7-clang12-dbg; fplll-5b7ab,mpfr-61226,mpfi-f2a84,libxml2-9cd93
sortedcontainers; 2234b; 2.1.0; ./sortedcontainers/2.1.0/x86_64-centos7-clang12-dbg; Python-b0f98,setuptools-8e80a
spark; 3c30f; 3.1.2-cern1; ./spark/3.1.2-cern1/x86_64-centos7-clang12-dbg; hadoop-a8f60,Python-b0f98
spdlog; d6cb3; 1.5.0; ./spdlog/1.5.0/x86_64-centos7-clang12-dbg; 
sphinx; 1ed50; 3.4.3; ./sphinx/3.4.3/x86_64-centos7-clang12-dbg; snowballstemmer-58a08,babel-36d8a,alabaster-58729,docutils-ff3d8,Python-b0f98,pygments-3dbab,imagesize-affc4,requests-24605,six-05a82,Jinja2-7af1c,packaging-d2263,setuptools-8e80a
sphinx_rtd_theme; d54b9; 0.5.1; ./sphinx_rtd_theme/0.5.1/x86_64-centos7-clang12-dbg; snowballstemmer-58a08,babel-36d8a,alabaster-58729,docutils-ff3d8,Python-b0f98,pygments-3dbab,imagesize-affc4,requests-24605,six-05a82,Jinja2-7af1c,packaging-d2263,setuptools-8e80a
sqlalchemy; 94f41; 1.2.10; ./sqlalchemy/1.2.10/x86_64-centos7-clang12-dbg; Python-b0f98,setuptools-8e80a
sqlite; 3c47f; 3320300; ./sqlite/3320300/x86_64-centos7-clang12-dbg; 
statsmodels; 8bee6; 0.10.2; ./statsmodels/0.10.2/x86_64-centos7-clang12-dbg; ipython-be640,patsy-57940,cython-827d8,matplotlib-9a50f,Python-b0f98,pandas-b0080,scipy-55ead,nose-6cf1f,numpy-949ff,setuptools-8e80a
stevedore; abe50; 3.3.0; ./stevedore/3.3.0/x86_64-centos7-clang12-dbg; pbr-c530e,Python-b0f98,setuptools-8e80a
stomppy; 68911; 6.1.0; ./stomppy/6.1.0/x86_64-centos7-clang12-dbg; Python-b0f98,setuptools-8e80a
storm; 35afc; 0.23; ./storm/0.23/x86_64-centos7-clang12-dbg; Python-b0f98,setuptools-8e80a
suitesparse; 823f9; 5.10.1; ./suitesparse/5.10.1/x86_64-centos7-clang12-dbg; mpfr-61226,blas-e5f0c
swig; fbde9; 4.0.2; ./swig/4.0.2/x86_64-centos7-clang12-dbg; pcre-5c0c1,Boost-fd33b,Python-b0f98
sympy; 7b31a; 1.8; ./sympy/1.8/x86_64-centos7-clang12-dbg; Python-b0f98,setuptools-8e80a
SIO; 6e311; 00.01.00; ./SIO/00.01.00/x86_64-centos7-clang12-dbg; zlib-8af4c
tabulate; 83671; 0.8.9; ./tabulate/0.8.9/x86_64-centos7-clang12-dbg; Python-b0f98,setuptools-8e80a
tbb; daa7e; 2020_U2; ./tbb/2020_U2/x86_64-centos7-clang12-dbg; 
tblib; 8939f; 1.7.0; ./tblib/1.7.0/x86_64-centos7-clang12-dbg; Python-b0f98,setuptools-8e80a
tensorflow; a17ed; 2.5.0; ./tensorflow/2.5.0/x86_64-centos7-clang12-dbg; numpy-949ff,tensorflow_estimator-84e9b,astunparse-35366,keras_preprocessing-ab401,Python-b0f98,tensorboard-857ad,opt_einsum-9df27,wrapt-fb18f,six-05a82,keras_applications-1ab9b,wheel-91237,absl_py-9ac3f,pip-525a1,setuptools-8e80a,mock-9e5ff
tensorflow_estimator; 84e9b; 2.5.0; ./tensorflow_estimator/2.5.0/x86_64-centos7-clang12-dbg; termcolor-140ad,gast-f9d3a,pip-525a1,Python-b0f98,six-05a82,wheel-91237,absl_py-9ac3f,numpy-949ff,funcsigs-165cd,astor-fabc7,setuptools-8e80a,mock-9e5ff
tensorboard; 857ad; 2.5.0; ./tensorboard/2.5.0/x86_64-centos7-clang12-dbg; numpy-949ff,google_auth_oauthlib-a3dc9,Python-b0f98,werkzeug-a48e0,six-05a82,wheel-91237,absl_py-9ac3f,pip-525a1,markdown-76ce6,grpcio-b2bea,setuptools-8e80a,mock-9e5ff
tensorboard_plugin_wit; d97f4; 1.8.0; ./tensorboard_plugin_wit/1.8.0/x86_64-centos7-clang12-dbg; Python-b0f98,tensorboard-857ad,wheel-91237,pip-525a1,tensorflow-a17ed,setuptools-8e80a
tensorflow_model_optimization; 8b9d6; 0.6.0; ./tensorflow_model_optimization/0.6.0/x86_64-centos7-clang12-dbg; Python-b0f98,dm_tree-72606,six-05a82,numpy-949ff,setuptools-8e80a
termcolor; 140ad; 1.1.0; ./termcolor/1.1.0/x86_64-centos7-clang12-dbg; Python-b0f98,setuptools-8e80a
terminado; b185a; 0.10.1; ./terminado/0.10.1/x86_64-centos7-clang12-dbg; tornado-69177,ptyprocess-09a88,Python-b0f98,setuptools-8e80a
testpath; a2db9; 0.5.0; ./testpath/0.5.0/x86_64-centos7-clang12-dbg; Python-b0f98,setuptools-8e80a
texinfo; 21d20; 6.3; ./texinfo/6.3/x86_64-centos7-clang12-dbg; 
theano; c7c68; 1.0.5; ./theano/1.0.5/x86_64-centos7-clang12-dbg; graphviz-11724,pydot_ng-85a47,pygments-3dbab,nose-6cf1f,six-05a82,numpy-949ff,scipy-55ead,pydot-75f5e
threadpoolctl; c16d7; 2.2.0; ./threadpoolctl/2.2.0/x86_64-centos7-clang12-dbg; 
thrift; d95cf; 0.13.0; ./thrift/0.13.0/x86_64-centos7-clang12-dbg; pkg_config-c6baf,Boost-fd33b,flex-5ae78,bison-d8b6b
tiff; 33276; 4.2.0; ./tiff/4.2.0/x86_64-centos7-clang12-dbg; 
toml; 8352c; 0.10.2; ./toml/0.10.2/x86_64-centos7-clang12-dbg; Python-b0f98,setuptools-8e80a
tomlkit; cda8b; 0.7.2; ./tomlkit/0.7.2/x86_64-centos7-clang12-dbg; Python-b0f98,setuptools-8e80a
toolz; f799c; 0.9.0; ./toolz/0.9.0/x86_64-centos7-clang12-dbg; Python-b0f98,setuptools-8e80a
torch; 38e04; 1.9.0; ./torch/1.9.0/x86_64-centos7-clang12-dbg; blas-e5f0c,Python-b0f98,cffi-b7ef5,CMake-790a8,typing_extensions-3e251,ninja-3d8f6,numpy-949ff,PyYAML-aa126,setuptools-8e80a
torchvision; 31f73; 0.8.1; ./torchvision/0.8.1/x86_64-centos7-clang12-dbg; typing_extensions-3e251,six-05a82,torch-38e04,pillow-e0d17
tornado; 69177; 6.1; ./tornado/6.1/x86_64-centos7-clang12-dbg; certifi-4609e,Python-b0f98,setuptools-8e80a
tqdm; 0bdee; 4.61.2; ./tqdm/4.61.2/x86_64-centos7-clang12-dbg; pip-525a1,Python-b0f98,setuptools-8e80a
traitlets; 0b97b; 5.0.5; ./traitlets/5.0.5/x86_64-centos7-clang12-dbg; Python-b0f98,decorator-d1f66,six-05a82,ipython_genutils-69fd6,setuptools-8e80a
traittypes; 546c6; 0.2.1; ./traittypes/0.2.1/x86_64-centos7-clang12-dbg; Python-b0f98,setuptools-8e80a
tricktrack; 829d0; 1.0.9; ./tricktrack/1.0.9/x86_64-centos7-clang12-dbg; eigen-642a5
typed_ast; 39b4e; 1.4.3; ./typed_ast/1.4.3/x86_64-centos7-clang12-dbg; Python-b0f98,setuptools-8e80a
typeguard; 18e96; 2.7.0; ./typeguard/2.7.0/x86_64-centos7-clang12-dbg; setuptools_scm-c204b
typing_extensions; 3e251; 3.7.4.3; ./typing_extensions/3.7.4.3/x86_64-centos7-clang12-dbg; Python-b0f98,setuptools-8e80a
tzlocal; 5056a; 2.0.0; ./tzlocal/2.0.0/x86_64-centos7-clang12-dbg; pytz-1fa06,Python-b0f98,setuptools-8e80a
umesimd; 14a15; 0.8.1; ./umesimd/0.8.1/x86_64-centos7-clang12-dbg; 
uncertainties; d7990; 3.1.2; ./uncertainties/3.1.2/x86_64-centos7-clang12-dbg; numpy-949ff,Python-b0f98,setuptools-8e80a
unigen; 22b19; 2.2; ./unigen/2.2/x86_64-centos7-clang12-dbg; ROOT-a63a9
upandas; 4de03; 0.2.0; ./upandas/0.2.0/x86_64-centos7-clang12-dbg; uncertainties-d7990,pandas-b0080
uproot; da99d; 4.0.1; ./uproot/4.0.1/x86_64-centos7-clang12-dbg; numpy-949ff,awkward-39b30
uproot3; 8292c; 3.14.2; ./uproot3/3.14.2/x86_64-centos7-clang12-dbg; cachetools-c5109,numpy-949ff,awkward0-b618c,uproot3_methods-bdde6
uproot3_methods; bdde6; 0.10.0; ./uproot3_methods/0.10.0/x86_64-centos7-clang12-dbg; numpy-949ff
urllib3; ad1db; 1.26.6; ./urllib3/1.26.6/x86_64-centos7-clang12-dbg; Python-b0f98,setuptools-8e80a
valgrind; 14406; 3.16.1; ./valgrind/3.16.1/x86_64-centos7-clang12-dbg; 
qcachegrind; 5a789; 20.12.1; ./qcachegrind/20.12.1/x86_64-centos7-clang12-dbg; Qt5-3a57b,valgrind-14406
Vc; 9e06f; 1.4.2; ./Vc/1.4.2/x86_64-centos7-clang12-dbg; 
vcversioner; 78048; 2.16.0.0; ./vcversioner/2.16.0.0/x86_64-centos7-clang12-dbg; Python-b0f98,setuptools-8e80a
vdt; 992df; 0.4.3; ./vdt/0.4.3/x86_64-centos7-clang12-dbg; 
veccore; 22ea3; 0.7.0; ./veccore/0.7.0/x86_64-centos7-clang12-dbg; Vc-9e06f,umesimd-14a15
VecGeom; 2c171; v1.1.16; ./VecGeom/v1.1.16/x86_64-centos7-clang12-dbg; Vc-9e06f,XercesC-714f6,veccore-22ea3
vectorclass; cdfdb; 2.01.02; ./vectorclass/2.01.02/x86_64-centos7-clang12-dbg; 
virtualenv; fa804; 20.4.3; ./virtualenv/20.4.3/x86_64-centos7-clang12-dbg; filelock-c8c23,Python-b0f98,appdirs-e678c,six-05a82,pip-525a1,distlib-faab3,setuptools-8e80a
virtualenv_clone; 3ec4b; 0.5.4; ./virtualenv_clone/0.5.4/x86_64-centos7-clang12-dbg; Python-b0f98,setuptools-8e80a
virtualenvwrapper; 66b69; 4.8.4; ./virtualenvwrapper/4.8.4/x86_64-centos7-clang12-dbg; Python-b0f98,stevedore-abe50,virtualenv_clone-3ec4b,virtualenv-fa804,setuptools-8e80a
wcwidth; 9c6e3; 0.2.5; ./wcwidth/0.2.5/x86_64-centos7-clang12-dbg; Python-b0f98,setuptools-8e80a
webencodings; ebb84; 0.5.1; ./webencodings/0.5.1/x86_64-centos7-clang12-dbg; Python-b0f98,setuptools-8e80a
websocket_client; 72877; 1.1.0; ./websocket_client/1.1.0/x86_64-centos7-clang12-dbg; six-05a82,Python-b0f98,setuptools-8e80a
werkzeug; a48e0; 0.15.4; ./werkzeug/0.15.4/x86_64-centos7-clang12-dbg; Python-b0f98,setuptools-8e80a
wheel; 91237; 0.33.4; ./wheel/0.33.4/x86_64-centos7-clang12-dbg; Python-b0f98,setuptools-8e80a
widgetsnbextension; 1d4fa; 3.5.1; ./widgetsnbextension/3.5.1/x86_64-centos7-clang12-dbg; notebook-39446,Python-b0f98,tornado-69177,decorator-d1f66,ipython_genutils-69fd6,traitlets-0b97b,jupyter_core-29281,setuptools-8e80a
wrapt; fb18f; 1.11.1; ./wrapt/1.11.1/x86_64-centos7-clang12-dbg; Python-b0f98,setuptools-8e80a
xapian; 04e2c; 1.4.18; ./xapian/1.4.18/x86_64-centos7-clang12-dbg; 
xenv; 2854f; 1.0.0; ./xenv/1.0.0/x86_64-centos7-clang12-dbg; nose-6cf1f,setuptools_scm-c204b,Python-b0f98
XercesC; 714f6; 3.2.3; ./XercesC/3.2.3/x86_64-centos7-clang12-dbg; 
xgboost; 931ef; 0.90; ./xgboost/0.90/x86_64-centos7-clang12-dbg; numpy-949ff,Python-b0f98,scipy-55ead,setuptools-8e80a
xqilla; c5cd1; 2.3.4; ./xqilla/2.3.4/x86_64-centos7-clang12-dbg; XercesC-714f6
xrootd; e6c66; 5.3.1; ./xrootd/5.3.1/x86_64-centos7-clang12-dbg; zlib-8af4c,Python-b0f98,libxml2-9cd93
yamlcpp; d05b2; 0.6.3; ./yamlcpp/0.6.3/x86_64-centos7-clang12-dbg; 
zeromq; acdd8; 4.3.4; ./zeromq/4.3.4/x86_64-centos7-clang12-dbg; pkg_config-c6baf,libsodium-0b20d
zict; 9f0c7; 0.1.4; ./zict/0.1.4/x86_64-centos7-clang12-dbg; HeapDict-1600c,Python-b0f98,setuptools-8e80a
zipp; b83e9; 0.5.1; ./zipp/0.5.1/x86_64-centos7-clang12-dbg; setuptools_scm-c204b,Python-b0f98,setuptools-8e80a
zstandard; 7ddf2; 0.14.0; ./zstandard/0.14.0/x86_64-centos7-clang12-dbg; cffi-b7ef5,Python-b0f98,setuptools-8e80a
OWSLib; 9ebdc; 0.17.1; ./OWSLib/0.17.1/x86_64-centos7-clang12-dbg; python_dateutil-376a4,lxml-58ae5,pyproj-868ae,Python-b0f98,requests-24605,pytz-1fa06,setuptools-8e80a
pyproj; 868ae; 3.0.1; ./pyproj/3.0.1/x86_64-centos7-clang12-dbg; cython-827d8,proj-c86df,Python-b0f98,setuptools-8e80a
libunwind; 2fa0a; 1.3.1; ./libunwind/1.3.1/x86_64-centos7-clang12-dbg; 
igprof; 01485; 5.9.16; ./igprof/5.9.16/x86_64-centos7-clang12-dbg; libunwind-2fa0a
ROOT; a63a9; 6.24.06; ./ROOT/6.24.06/x86_64-centos7-clang12-dbg; Vc-9e06f,gl2ps-2afdb,blas-e5f0c,libxml2-9cd93,mysql-f514c,oracle-69dfe,zlib-8af4c,xrootd-e6c66,Python-b0f98,tbb-daa7e,Davix-9e4c2,srm_ifce-be254,jsonmcpp-72770,cfitsio-e4bb8,vdt-992df,dcap-cdd28,GSL-30ba4,numpy-949ff,gfal-6fc75,fftw-102c2
bison; d8b6b; 3.3.2; ./bison/3.3.2/x86_64-centos7-clang12-dbg; m4-3bfe7
catboost; 86407; 0.26.1; ./catboost/0.26.1/x86_64-centos7-clang12-dbg; graphviz-11724,matplotlib-9a50f,flatbuffers-64f4c,Python-b0f98,pandas-b0080,plotly-6bb41,six-05a82,numpy-949ff,scipy-55ead
flex; 5ae78; 2.6.4; ./flex/2.6.4/x86_64-centos7-clang12-dbg; bison-d8b6b
go; ff8e6; 1.12.5; ./go/1.12.5/x86_64-centos7-clang12-dbg; 
gomacro; 05315; c9f381e; ./gomacro/c9f381e/x86_64-centos7-clang12-dbg; go-ff8e6,go_liner-5ab05,go_runewidth-ec180
gophernotes; 64e51; 7c3ca4e; ./gophernotes/7c3ca4e/x86_64-centos7-clang12-dbg; pkg_config-c6baf,go_zmq4-665df,gomacro-05315,go-ff8e6,go_liner-5ab05,go_runewidth-ec180,go.uuid-973d9
go_demangle; 84b17; 5e5cf60; ./go_demangle/5e5cf60/x86_64-centos7-clang12-dbg; go-ff8e6
go_liner; 5ab05; 6f820f8; ./go_liner/6f820f8/x86_64-centos7-clang12-dbg; go-ff8e6,go_runewidth-ec180
go_readline; 02db8; 2972be2; ./go_readline/2972be2/x86_64-centos7-clang12-dbg; go-ff8e6,go_liner-5ab05
go_runewidth; ec180; 703b5e6; ./go_runewidth/703b5e6/x86_64-centos7-clang12-dbg; go-ff8e6
go_zmq4; 665df; 7a493a6; ./go_zmq4/7a493a6/x86_64-centos7-clang12-dbg; go-ff8e6,zeromq-acdd8
go.uuid; 973d9; b2ce238; ./go.uuid/b2ce238/x86_64-centos7-clang12-dbg; go-ff8e6
gperftools; f56d9; 2.9.1; ./gperftools/2.9.1/x86_64-centos7-clang12-dbg; pprof-7afca,libunwind-2fa0a
jl_ijulia; 7e756; 1.23.2; ./jl_ijulia/1.23.2/x86_64-centos7-clang12-dbg; julia-3f207
libxkbcommon; 13e99; 0.7.1; ./libxkbcommon/0.7.1/x86_64-centos7-clang12-dbg; bison-d8b6b
m4; 3bfe7; 1.4.17; ./m4/1.4.17/x86_64-centos7-clang12-dbg; 
madx; cbe18; 5.06.01; ./madx/5.06.01/x86_64-centos7-clang12-dbg; zlib-8af4c,blas-e5f0c
cpymad; a0fc2; 1.6.3; ./cpymad/1.6.3/x86_64-centos7-clang12-dbg; madx-cbe18,importlib_resources-e792d,cython-827d8,Python-b0f98,minrpc-4d548,pathlib2-9e295,numpy-949ff,setuptools-8e80a
octave; 07d06; 6.2.0; ./octave/6.2.0/x86_64-centos7-clang12-dbg; texinfo-21d20,blas-e5f0c,Qt5-3a57b,gnuplot-8aa5d,readline-2ff43,pcre-5c0c1
octavekernel; 1b502; 0.32.0; ./octavekernel/0.32.0/x86_64-centos7-clang12-dbg; ipykernel-d0b42,Python-b0f98,metakernel-e609c,jupyter_client-b00fa,octave-07d06,setuptools-8e80a
pkg_config; c6baf; 0.29.2; ./pkg_config/0.29.2/x86_64-centos7-clang12-dbg; 
pprof; 7afca; 54271f7; ./pprof/54271f7/x86_64-centos7-clang12-dbg; graphviz-11724,go-ff8e6,go_readline-02db8,go_demangle-84b17
pythonsollya; 7da29; 0.3; ./pythonsollya/0.3/x86_64-centos7-clang12-dbg; sollya-60a5a,mpfi-f2a84,cython-827d8,Python-b0f98,six-05a82,pip-525a1,setuptools-8e80a
R; a1b87; 3.6.3; ./R/3.6.3/x86_64-centos7-clang12-dbg; pkg_config-c6baf,libgit2-942f6,proj-c86df,pcre-5c0c1,zeromq-acdd8,zlib-8af4c,cairo-f2c05,gdal-116fc
readline; 2ff43; 8.0; ./readline/8.0/x86_64-centos7-clang12-dbg; 
zlib; 8af4c; 1.2.11; ./zlib/1.2.11/x86_64-centos7-clang12-dbg; 
neurobayes; e06fd; 3.7.0; ./neurobayes/3.7.0/x86_64-centos7-clang12-dbg; 
neurobayes_expert; d587a; 3.7.0; ./neurobayes_expert/3.7.0/x86_64-centos7-clang12-dbg; 
dcap; cdd28; 2.47.7-1; ./Grid/dcap/2.47.7-1/x86_64-centos7-clang12-dbg; 
gfal; 6fc75; 1.13.0-0; ./Grid/gfal/1.13.0-0/x86_64-centos7-clang12-dbg; 
srm_ifce; be254; 1.13.0-0; ./Grid/srm-ifce/1.13.0-0/x86_64-centos7-clang12-dbg; 
