PLATFORM: x86_64-centos7-gcc11-opt
VERSION: 102
COMPILER: gcc;11.2.0
RELAX; ab245; root6; ./RELAX/root6/x86_64-centos7-gcc11-opt; HepPDT-dba76,GSL-30ba4,cmaketools-5b765,ROOT-edd28,HepMC-d5a39,clhep-ebe73
HepMC; d5a39; 2.06.11; ./HepMC/2.06.11/x86_64-centos7-gcc11-opt; 
Geant4; 2ccf4; 11.0.2; ./Geant4/11.0.2/x86_64-centos7-gcc11-opt; Qt5-cb06f,clhep-ebe73,XercesC-714f6,Python-9a1bc,VecGeom-2ed33,expat-ad2fa,Boost-e77cf
Garfield++; 7d28f; HEAD; ./Garfield++/HEAD/x86_64-centos7-gcc11-opt; ROOT-edd28,Geant4-2ccf4
Gaudi; 62eda; v36r3; ./Gaudi/v36r3/x86_64-centos7-gcc11-opt; XercesC-714f6,ROOT-edd28,HepPDT-dba76,xenv-dc586,jsonmcpp-f26c3,gperftools-cb5bd,fmt-18428,AIDA-3fe9f,CppUnit-b79b3,PyYAML-edbb9,rangev3-79ab4,clhep-ebe73,six-7d0d9,GSL-30ba4,pytest-b9bb8,cppgsl-7a1b6,doxygen-dffea,HepMC-d5a39,Python-9a1bc,libunwind-2fa0a,Boost-e77cf
DD4hep; 84abb; 01.20.2; ./DD4hep/01.20.2/x86_64-centos7-gcc11-opt; Geant4-2ccf4,tbb-adcbe,XercesC-714f6,ROOT-edd28,LCIO-6273b,Python-9a1bc,hepmc3-77aba,Boost-e77cf,assimp-723c2,EDM4hep-a5daf
EDM4hep; a5daf; 00.04.01; ./EDM4hep/00.04.01/x86_64-centos7-gcc11-opt; delphes-c55e6,podio-3dc0b,HepPDT-dba76,ROOT-edd28,HepMC-d5a39,Jinja2-766ba,tricktrack-829d0
lcgenv; b8d77; 1.3.21; ./lcgenv/1.3.21/x86_64-centos7-gcc11-opt; 
absl_py; a991e; 0.11.0; ./absl_py/0.11.0/x86_64-centos7-gcc11-opt; setuptools-e5403,Python-9a1bc
acts; c0826; 6.0.0; ./acts/6.0.0/x86_64-centos7-gcc11-opt; Boost-e77cf,eigen-642a5,ROOT-edd28,DD4hep-84abb
AIDA; 3fe9f; 3.2.1; ./AIDA/3.2.1/x86_64-centos7-gcc11-opt; 
alabaster; 0c265; 0.7.12; ./alabaster/0.7.12/x86_64-centos7-gcc11-opt; setuptools-e5403,Python-9a1bc
alpaka; 97a24; 0.5.0; ./alpaka/0.5.0/x86_64-centos7-gcc11-opt; Boost-e77cf,tbb-adcbe
ant; 07056; 1.10.7; ./ant/1.10.7/x86_64-centos7-gcc11-opt; java-80070
anyio; 470ff; 3.2.1; ./anyio/3.2.1/x86_64-centos7-gcc11-opt; pip-0a3af,idna-e6055,sniffio-e93f3,Python-9a1bc
appdirs; abe03; 1.4.4; ./appdirs/1.4.4/x86_64-centos7-gcc11-opt; setuptools-e5403,Python-9a1bc
argon2_cffi; 9748b; 20.1.0; ./argon2_cffi/20.1.0/x86_64-centos7-gcc11-opt; pip-0a3af,cffi-bea67,six-7d0d9,Python-9a1bc
archspec; 1f3b4; 0.1.2; ./archspec/0.1.2/x86_64-centos7-gcc11-opt; six-7d0d9,click-07a71,setuptools-e5403,Python-9a1bc
arrow; 0aff3; 3.0.0; ./arrow/3.0.0/x86_64-centos7-gcc11-opt; flatbuffers-24169,thrift-9ed86,brotli-7762d,double_conversion-6c1f5,gflags-4cfd4,snappy-28a75,numpy-1af8f,lz4-9bdfe,Python-9a1bc,Boost-e77cf,glog-4bef1,rapidjson-0b862
assimp; 723c2; 5.0.1; ./assimp/5.0.1/x86_64-centos7-gcc11-opt; Boost-e77cf
asn1crypto; 0d2ab; 0.24.0; ./asn1crypto/0.24.0/x86_64-centos7-gcc11-opt; setuptools-e5403,Python-9a1bc
astor; 47d05; 0.8.1; ./astor/0.8.1/x86_64-centos7-gcc11-opt; setuptools-e5403,Python-9a1bc
astroid; af74d; 2.9.3; ./astroid/2.9.3/x86_64-centos7-gcc11-opt; typed_ast-54f29,six-7d0d9,lazy_object_proxy-5c71a,setuptools-e5403,Python-9a1bc,wrapt-08b78,pytest_runner-c9786
astropy; 2b1cb; 5.0.4; ./astropy/5.0.4/x86_64-centos7-gcc11-opt; pyerfa-cfc38,numpy-1af8f,packaging-a60db,setuptools-e5403,Python-9a1bc,PyYAML-edbb9,extension_helpers-282b2,Jinja2-766ba
astunparse; 9f38b; 1.6.3; ./astunparse/1.6.3/x86_64-centos7-gcc11-opt; six-7d0d9,setuptools-e5403,Python-9a1bc
async_generator; af015; 1.10; ./async_generator/1.10/x86_64-centos7-gcc11-opt; setuptools-e5403,Python-9a1bc
atomicwrites; 1690a; 1.3.0; ./atomicwrites/1.3.0/x86_64-centos7-gcc11-opt; setuptools-e5403,Python-9a1bc
attrs; 52e86; 21.2.0; ./attrs/21.2.0/x86_64-centos7-gcc11-opt; setuptools-e5403,Python-9a1bc
Authlib; 721be; 0.15.5; ./Authlib/0.15.5/x86_64-centos7-gcc11-opt; cryptography-472f2,setuptools-e5403,Python-9a1bc
auth_get_sso_cookie; ac946; 1.5.0-1; ./auth_get_sso_cookie/1.5.0-1/x86_64-centos7-gcc11-opt; Authlib-721be,beautifulsoup4-afe77,requests-1c034,requests_gssapi-161a7,setuptools-e5403,Python-9a1bc
autoconf; 01523; 2.69; ./autoconf/2.69/x86_64-centos7-gcc11-opt; m4-89870
automake; aa1ac; 1.16.1; ./automake/1.16.1/x86_64-centos7-gcc11-opt; autoconf-01523
autopep8; c8ec5; 1.4.4; ./autopep8/1.4.4/x86_64-centos7-gcc11-opt; pycodestyle-430ab,setuptools-e5403,Python-9a1bc
awkward0; b1a40; 0.15.3; ./awkward0/0.15.3/x86_64-centos7-gcc11-opt; numpy-1af8f,pytest_runner-c9786
awkward; c4392; 1.7.0; ./awkward/1.7.0/x86_64-centos7-gcc11-opt; numpy-1af8f,pytest_runner-c9786,PyYAML-edbb9
babel; 00a2a; 2.9.1; ./babel/2.9.1/x86_64-centos7-gcc11-opt; pytz-2631d,setuptools-e5403,Python-9a1bc
backcall; dc79b; 0.2.0; ./backcall/0.2.0/x86_64-centos7-gcc11-opt; setuptools-e5403,Python-9a1bc
bcrypt; 39f32; 3.1.6; ./bcrypt/3.1.6/x86_64-centos7-gcc11-opt; six-7d0d9,cffi-bea67,setuptools-e5403,Python-9a1bc
beautifulsoup4; afe77; 4.10.0; ./beautifulsoup4/4.10.0/x86_64-centos7-gcc11-opt; setuptools-e5403,Python-9a1bc
beniget; cb8cb; 0.4.0; ./beniget/0.4.0/x86_64-centos7-gcc11-opt; gast-e6b5b,setuptools-e5403,Python-9a1bc
benchmark; 3666a; 1.5.5; ./benchmark/1.5.5/x86_64-centos7-gcc11-opt; gtest-21e8c
bison; 929f9; 3.3.2; ./bison/3.3.2/x86_64-centos7-gcc11-opt; m4-89870
blas; 6339b; 0.3.20.openblas; ./blas/0.3.20.openblas/x86_64-centos7-gcc11-opt; 
blosc; ad5f9; 1.10.6; ./blosc/1.10.6/x86_64-centos7-gcc11-opt; scikitbuild-40b6d,wheel-0cbbc,numpy-1af8f,setuptools-e5403,Python-9a1bc,CMake-790a8,ninja-d608d
bleach; 9e4d1; 3.3.1; ./bleach/3.3.1/x86_64-centos7-gcc11-opt; html5lib-380df,six-7d0d9,packaging-a60db,setuptools-e5403,Python-9a1bc
brotli; 7762d; 1.0.7; ./brotli/1.0.7/x86_64-centos7-gcc11-opt; 
bokeh; 2ea1c; 2.3.1; ./bokeh/2.3.1/x86_64-centos7-gcc11-opt; pillow-401bb,typing_extensions-d8149,tornado-e7c51,numpy-1af8f,packaging-a60db,setuptools-e5403,Python-9a1bc,PyYAML-edbb9,Jinja2-766ba,python_dateutil-1a27e
Boost; e77cf; 1.78.0; ./Boost/1.78.0/x86_64-centos7-gcc11-opt; numpy-1af8f,zlib-8af4c,Python-9a1bc
boost_histogram; 7235c; 1.2.1; ./boost_histogram/1.2.1/x86_64-centos7-gcc11-opt; numpy-1af8f,setuptools-e5403,Python-9a1bc
boto3; 616f4; 1.18.37; ./boto3/1.18.37/x86_64-centos7-gcc11-opt; botocore-2611e,jmespath-bcc72,s3transfer-02c48,setuptools-e5403,Python-9a1bc
botocore; 2611e; 1.21.37; ./botocore/1.21.37/x86_64-centos7-gcc11-opt; jmespath-bcc72,setuptools-e5403,Python-9a1bc,urllib3-cfa90,python_dateutil-1a27e
C50; 2aa47; 2.07; ./C50/2.07/x86_64-centos7-gcc11-opt; 
cachetools; 08f48; 3.1.1; ./cachetools/3.1.1/x86_64-centos7-gcc11-opt; setuptools-e5403,Python-9a1bc
cairo; d1de8; 1.17.2; ./cairo/1.17.2/x86_64-centos7-gcc11-opt; freetype-08d63,pixman-46112,pkg_config-c6baf,png-5186a,fontconfig-47540
cartopy; 6f64a; 0.20.1; ./cartopy/0.20.1/x86_64-centos7-gcc11-opt; six-7d0d9,cython-aa7c8,shapely-c9751,geos-8602e,pyshp-ed499,numpy-1af8f,setuptools-e5403,proj-c86df
catboost; cf88f; 0.26.1; ./catboost/0.26.1/x86_64-centos7-gcc11-opt; flatbuffers-24169,scipy-73b9f,plotly-00963,six-7d0d9,matplotlib-3f48d,numpy-1af8f,graphviz-a682a,Python-9a1bc,pandas-5abcd
Catch2; 3964e; 2.13.4; ./Catch2/2.13.4/x86_64-centos7-gcc11-opt; Python-9a1bc
ccache; ed8d3; 4.3; ./ccache/4.3/x86_64-centos7-gcc11-opt; 
certifi; cd51f; 2021.5.30; ./certifi/2021.5.30/x86_64-centos7-gcc11-opt; setuptools-e5403,Python-9a1bc
cffi; bea67; 1.14.6; ./cffi/1.14.6/x86_64-centos7-gcc11-opt; libffi-a3607,pycparser-86cc5,setuptools-e5403,Python-9a1bc
cfitsio; e4bb8; 3.48; ./cfitsio/3.48/x86_64-centos7-gcc11-opt; 
chardet; 85354; 3.0.4; ./chardet/3.0.4/x86_64-centos7-gcc11-opt; setuptools-e5403,Python-9a1bc
charset_normalizer; ca248; 2.0.6; ./charset_normalizer/2.0.6/x86_64-centos7-gcc11-opt; setuptools-e5403,Python-9a1bc
clhep; ebe73; 2.4.5.1; ./clhep/2.4.5.1/x86_64-centos7-gcc11-opt; 
click; 07a71; 8.0.3; ./click/8.0.3/x86_64-centos7-gcc11-opt; setuptools-e5403,Python-9a1bc
click_didyoumean; fbeaa; 0.3.0; ./click_didyoumean/0.3.0/x86_64-centos7-gcc11-opt; click-07a71,setuptools-e5403,Python-9a1bc
cloudpickle; cdcb0; 1.6.0; ./cloudpickle/1.6.0/x86_64-centos7-gcc11-opt; setuptools-e5403,Python-9a1bc
CMake; 790a8; 3.20.0; ./CMake/3.20.0/x86_64-centos7-gcc11-opt; 
cmaketools; 5b765; 1.8; ./cmaketools/1.8/x86_64-centos7-gcc11-opt; 
coffea; 71db0; 0.7.13; ./coffea/0.7.13/x86_64-centos7-gcc11-opt; scipy-73b9f,correctionlib-2256a,ipywidgets-c5d1c,uproot3-4216f,fsspec-7ff29,uproot-ea7a7,cloudpickle-cdcb0,cachetools-08f48,py_lz4-ce356,blosc-ad5f9,setuptools-e5403,uproot3_methods-15a08,awkward-c4392,bokeh-2ea1c,parsl-0663b,matplotlib-3f48d,mplhep-a6904,packaging-a60db,pandas-5abcd,distributed-11838,numba-dc683,dask-0c439,tqdm-54fb2,numpy-1af8f,Python-9a1bc,pyarrow-54fe6
coin3d; 05e9a; 3.1.3p2; ./coin3d/3.1.3p2/x86_64-centos7-gcc11-opt; 
colorcet; 785ef; 2.0.2; ./colorcet/2.0.2/x86_64-centos7-gcc11-opt; pyct-9c01a,setuptools-e5403,Python-9a1bc
commonmark; 1dc73; 0.9.1; ./commonmark/0.9.1/x86_64-centos7-gcc11-opt; setuptools-e5403,Python-9a1bc
control; 51d28; 0.9.1; ./control/0.9.1/x86_64-centos7-gcc11-opt; scipy-73b9f,matplotlib-3f48d,numpy-1af8f,setuptools-e5403,Python-9a1bc
correctionlib; 2256a; 2.1.0; ./correctionlib/2.1.0/x86_64-centos7-gcc11-opt; pydantic-a4a48,zlib-8af4c,numpy-1af8f,setuptools_scm-e3f04,rich-8c4f5,setuptools-e5403,Python-9a1bc,scikitbuild-40b6d,CMake-790a8,ninja-d608d
CouchDB; afae1; 1.2; ./CouchDB/1.2/x86_64-centos7-gcc11-opt; setuptools-e5403,Python-9a1bc
coverage; cbd70; 6.3.2; ./coverage/6.3.2/x86_64-centos7-gcc11-opt; setuptools-e5403,Python-9a1bc
cppgsl; 7a1b6; 3.1.0; ./cppgsl/3.1.0/x86_64-centos7-gcc11-opt; 
cppzmq; e1d96; 4.8.1; ./cppzmq/4.8.1/x86_64-centos7-gcc11-opt; 
CppUnit; b79b3; 1.14.0; ./CppUnit/1.14.0/x86_64-centos7-gcc11-opt; 
cryptography; 472f2; 3.4.7; ./cryptography/3.4.7/x86_64-centos7-gcc11-opt; cffi-bea67,six-7d0d9,asn1crypto-0d2ab,setuptools-e5403,Python-9a1bc,pip-0a3af
cx_oracle; 0ed37; 7.1.3; ./cx_oracle/7.1.3/x86_64-centos7-gcc11-opt; setuptools-e5403,Python-9a1bc,oracle-69dfe
cycler; e4db8; 0.10.0; ./cycler/0.10.0/x86_64-centos7-gcc11-opt; six-7d0d9,setuptools-e5403,Python-9a1bc
cython; aa7c8; 0.29.28; ./cython/0.29.28/x86_64-centos7-gcc11-opt; setuptools-e5403,Python-9a1bc
dask; 0c439; 2022.2.0; ./dask/2022.2.0/x86_64-centos7-gcc11-opt; partd-a7f36,graphviz_py-9084b,cloudpickle-cdcb0,graphviz-a682a,toolz-6f659,packaging-a60db,setuptools-e5403,Python-9a1bc,PyYAML-edbb9,fsspec-7ff29
dask_jobqueue; e35a5; 0.7.3; ./dask_jobqueue/0.7.3/x86_64-centos7-gcc11-opt; dask-0c439,distributed-11838,setuptools-e5403,Python-9a1bc
dask_kubernetes; a9aa4; 2022.1.0; ./dask_kubernetes/2022.1.0/x86_64-centos7-gcc11-opt; kubernetes-d27e0,dask-0c439,kubernetes_asyncio-a2a49,setuptools-e5403,Python-9a1bc,PyYAML-edbb9,distributed-11838
Davix; c8740; 0.7.6; ./Davix/0.7.6/x86_64-centos7-gcc11-opt; Boost-e77cf,libxml2-9cd93
debugpy; c5280; 1.3.0; ./debugpy/1.3.0/x86_64-centos7-gcc11-opt; setuptools-e5403,Python-9a1bc
DecayLanguage; 0e045; 0.14.1; ./DecayLanguage/0.14.1/x86_64-centos7-gcc11-opt; deprecated-8d612,particle-73796,graphviz_py-9084b,plumbum-0d7b7,lark_parser-1380b,numpy-1af8f,setuptools-e5403,Python-9a1bc,attrs-52e86,pandas-5abcd
decorator; 66e77; 5.0.9; ./decorator/5.0.9/x86_64-centos7-gcc11-opt; setuptools-e5403,Python-9a1bc
defusedxml; 80ed5; 0.7.1; ./defusedxml/0.7.1/x86_64-centos7-gcc11-opt; libxml2-9cd93,setuptools-e5403,Python-9a1bc
delphes; c55e6; 3.5.0; ./delphes/3.5.0/x86_64-centos7-gcc11-opt; ROOT-edd28
deprecated; 8d612; 1.2.13; ./deprecated/1.2.13/x86_64-centos7-gcc11-opt; wrapt-08b78,setuptools-e5403,Python-9a1bc
deprecation; 418d3; 2.1.0; ./deprecation/2.1.0/x86_64-centos7-gcc11-opt; setuptools-e5403,Python-9a1bc
dill; 6d5b4; 0.3.3; ./dill/0.3.3/x86_64-centos7-gcc11-opt; setuptools-e5403,Python-9a1bc
distlib; 8da0d; 0.3.2; ./distlib/0.3.2/x86_64-centos7-gcc11-opt; Python-9a1bc
distributed; 11838; 2022.2.0; ./distributed/2022.2.0/x86_64-centos7-gcc11-opt; six-7d0d9,zict-3c85d,dask-0c439,cloudpickle-cdcb0,tornado-e7c51,psutil-d80ca,sortedcontainers-f9052,Jinja2-766ba,toolz-6f659,setuptools-e5403,Python-9a1bc,PyYAML-edbb9,msgpack-b8b12,tblib-9e102,click-07a71
distro; e0efe; 1.5.0; ./distro/1.5.0/x86_64-centos7-gcc11-opt; pip-0a3af,Python-9a1bc
dm_tree; e0e99; 0.1.6; ./dm_tree/0.1.6/x86_64-centos7-gcc11-opt; pip-0a3af,six-7d0d9,setuptools-e5403,Python-9a1bc
docopt; 7fd49; 0.6.2; ./docopt/0.6.2/x86_64-centos7-gcc11-opt; setuptools-e5403,Python-9a1bc
docutils; 1dbbd; 0.16; ./docutils/0.16/x86_64-centos7-gcc11-opt; setuptools-e5403,Python-9a1bc
double_conversion; 6c1f5; 3.1.5; ./double_conversion/3.1.5/x86_64-centos7-gcc11-opt; 
doxygen; dffea; 1.8.18; ./doxygen/1.8.18/x86_64-centos7-gcc11-opt; flex-4c6ad,graphviz-a682a,bison-929f9,Python-9a1bc,xapian-04e2c
eigen; 642a5; 3.3.7; ./eigen/3.3.7/x86_64-centos7-gcc11-opt; 
elasticsearch; 01ad3; 6.3.0; ./elasticsearch/6.3.0/x86_64-centos7-gcc11-opt; setuptools-e5403,Python-9a1bc,urllib3-cfa90
entrypoints; dc246; 0.3; ./entrypoints/0.3/x86_64-centos7-gcc11-opt; pip-0a3af,Python-9a1bc
et_xmlfile; a48a1; 1.1.0; ./et_xmlfile/1.1.0/x86_64-centos7-gcc11-opt; setuptools-e5403,Python-9a1bc
expat; ad2fa; 2.2.6; ./expat/2.2.6/x86_64-centos7-gcc11-opt; 
extension_helpers; 282b2; 1.0.0; ./extension_helpers/1.0.0/x86_64-centos7-gcc11-opt; pip-0a3af,setuptools-e5403,Python-9a1bc
fastjet; af3e7; 3.4.0p1; ./fastjet/3.4.0p1/x86_64-centos7-gcc11-opt; 
fftw; cd301; 3.3.8; ./fftw3/3.3.8/x86_64-centos7-gcc11-opt; 
filelock; 0a5b2; 3.0.12; ./filelock/3.0.12/x86_64-centos7-gcc11-opt; setuptools-e5403,Python-9a1bc
fjcontrib; 30307; 1.046; ./fjcontrib/1.046/x86_64-centos7-gcc11-opt; fastjet-af3e7
flake8; b0a31; 3.7.8; ./flake8/3.7.8/x86_64-centos7-gcc11-opt; entrypoints-dc246,pycodestyle-430ab,pyflakes-ec6e9,mccabe-55450,setuptools-e5403,Python-9a1bc
flake8_builtins; 52a57; 1.5.3; ./flake8_builtins/1.5.3/x86_64-centos7-gcc11-opt; setuptools-e5403,Python-9a1bc,flake8-b0a31
flatbuffers; 24169; 1.12.0; ./flatbuffers/1.12.0/x86_64-centos7-gcc11-opt; numpy-1af8f,setuptools-e5403
fmt; 18428; 7.1.3; ./fmt/7.1.3/x86_64-centos7-gcc11-opt; 
flex; 4c6ad; 2.6.4; ./flex/2.6.4/x86_64-centos7-gcc11-opt; bison-929f9
fontconfig; 47540; 2.13.1; ./fontconfig/2.13.1/x86_64-centos7-gcc11-opt; gperf-699d7,freetype-08d63,expat-ad2fa,pkg_config-c6baf
fplll; 5b7ab; 5.2.1; ./fplll/5.2.1/x86_64-centos7-gcc11-opt; mpfr-61226
freetype; 08d63; 2.10.0; ./freetype/2.10.0/x86_64-centos7-gcc11-opt; zlib-8af4c
Frontier_Client; 1df46; 2.9.1; ./frontier_client/2.9.1/x86_64-centos7-gcc11-opt; expat-ad2fa,pacparser-bd798
fsspec; 7ff29; 2021.4.0; ./fsspec/2021.4.0/x86_64-centos7-gcc11-opt; panel-95cf2,setuptools-e5403,Python-9a1bc
ftjam; a3c47; 2.5.2; ./ftjam/2.5.2/x86_64-centos7-gcc11-opt; bison-929f9
funcsigs; ef887; 1.0.2; ./funcsigs/1.0.2/x86_64-centos7-gcc11-opt; setuptools-e5403,Python-9a1bc
future; cf5e0; 0.17.1; ./future/0.17.1/x86_64-centos7-gcc11-opt; setuptools-e5403,Python-9a1bc
gast; e6b5b; 0.5.2; ./gast/0.5.2/x86_64-centos7-gcc11-opt; setuptools-e5403,Python-9a1bc
gdal; 4bc45; 3.4.1; ./gdal/3.4.1/x86_64-centos7-gcc11-opt; netcdfc-85e7e,XercesC-714f6,zlib-8af4c,tiff-33276,libgeotiff-9a9b9,postgresql-b4308,proj-c86df,sqlite-3c47f,hdf5-a3b1e
pygdal; f2a5b; 3.3.0; ./pygdal/3.3.0/x86_64-centos7-gcc11-opt; numpy-1af8f,gdal-4bc45,setuptools-e5403,Python-9a1bc
gdb; 78aaa; 11.2; ./gdb/11.2/x86_64-centos7-gcc11-opt; texinfo-21d20,Python-9a1bc
genshi; c0b6b; 0.7; ./genshi/0.7/x86_64-centos7-gcc11-opt; setuptools-e5403,Python-9a1bc
geos; 8602e; 3.7.2; ./geos/3.7.2/x86_64-centos7-gcc11-opt; 
gettext; 0f6a2; 0.20.1; ./gettext/0.20.1/x86_64-centos7-gcc11-opt; 
gflags; 4cfd4; 2.2.2; ./gflags/2.2.2/x86_64-centos7-gcc11-opt; 
git; e475b; 2.29.2; ./git/2.29.2/x86_64-centos7-gcc11-opt; expat-ad2fa
globus_sdk; 7626c; 2.0.1; ./globus_sdk/2.0.1/x86_64-centos7-gcc11-opt; PyJWT-0e291,six-7d0d9,requests-1c034
glog; 4bef1; 0.4.0; ./glog/0.4.0/x86_64-centos7-gcc11-opt; gflags-4cfd4
gl2ps; 2afdb; 1.4.0; ./gl2ps/1.4.0/x86_64-centos7-gcc11-opt; png-5186a,zlib-8af4c
gnuplot; 2c34f; 5.4.2; ./gnuplot/5.4.2/x86_64-centos7-gcc11-opt; pango-b7c7b,Qt5-cb06f,cairo-d1de8
go; ff8e6; 1.12.5; ./go/1.12.5/x86_64-centos7-gcc11-opt; 
gomacro; 05315; c9f381e; ./gomacro/c9f381e/x86_64-centos7-gcc11-opt; go_liner-5ab05,go-ff8e6,go_runewidth-ec180
gophernotes; 64e51; 7c3ca4e; ./gophernotes/7c3ca4e/x86_64-centos7-gcc11-opt; gomacro-05315,go-ff8e6,go_runewidth-ec180,go_zmq4-665df,pkg_config-c6baf,go.uuid-973d9,go_liner-5ab05
go_demangle; 84b17; 5e5cf60; ./go_demangle/5e5cf60/x86_64-centos7-gcc11-opt; go-ff8e6
go_liner; 5ab05; 6f820f8; ./go_liner/6f820f8/x86_64-centos7-gcc11-opt; go-ff8e6,go_runewidth-ec180
go_readline; 02db8; 2972be2; ./go_readline/2972be2/x86_64-centos7-gcc11-opt; go_liner-5ab05,go-ff8e6
go_runewidth; ec180; 703b5e6; ./go_runewidth/703b5e6/x86_64-centos7-gcc11-opt; go-ff8e6
go_zmq4; 665df; 7a493a6; ./go_zmq4/7a493a6/x86_64-centos7-gcc11-opt; go-ff8e6,zeromq-acdd8
go.uuid; 973d9; b2ce238; ./go.uuid/b2ce238/x86_64-centos7-gcc11-opt; go-ff8e6
google_auth; 38125; 1.6.3; ./google_auth/1.6.3/x86_64-centos7-gcc11-opt; six-7d0d9,cachetools-08f48,rsa-3df98,setuptools-e5403,Python-9a1bc,pyasn1_modules-4b58b
google_auth_oauthlib; 6de3a; 0.4.1; ./google_auth_oauthlib/0.4.1/x86_64-centos7-gcc11-opt; google_auth-38125,setuptools-e5403,Python-9a1bc,requests_oauthlib-5c557
google_pasta; 74a43; 0.2.0; ./google_pasta/0.2.0/x86_64-centos7-gcc11-opt; six-7d0d9,setuptools-e5403,Python-9a1bc
gperf; 699d7; 3.1; ./gperf/3.1/x86_64-centos7-gcc11-opt; 
gperftools; cb5bd; 2.9.1; ./gperftools/2.9.1/x86_64-centos7-gcc11-opt; pprof-ebbe2,libunwind-2fa0a
graphviz; a682a; 2.40.1; ./graphviz/2.40.1/x86_64-centos7-gcc11-opt; pango-b7c7b,libtool-490ac,png-5186a,expat-ad2fa,fontconfig-47540
graphviz_py; 9084b; 0.11.1; ./graphviz_py/0.11.1/x86_64-centos7-gcc11-opt; setuptools-e5403,Python-9a1bc
grpcio; 4cf61; 1.28.1; ./grpcio/1.28.1/x86_64-centos7-gcc11-opt; six-7d0d9,setuptools-e5403,Python-9a1bc
GSL; 30ba4; 2.7; ./GSL/2.7/x86_64-centos7-gcc11-opt; 
gssapi; 634ea; 1.7.3; ./gssapi/1.7.3/x86_64-centos7-gcc11-opt; decorator-66e77,setuptools-e5403,Python-9a1bc
gtest; 21e8c; 1.11.0; ./gtest/1.11.0/x86_64-centos7-gcc11-opt; Python-9a1bc
hadoop; bcb29; 3.3.0; ./hadoop/3.3.0/x86_64-centos7-gcc11-opt; zstandard-b8d5c,zlib-8af4c,snappy-28a75,protobuf-5052d,maven-dc6dc
hadoop_xrootd; fd6d0; 1.0.7; ./hadoop_xrootd/1.0.7/x86_64-centos7-gcc11-opt; xrootd-4d6ee,hadoop-bcb29,java-80070,maven-dc6dc
harfbuzz; 7868c; 1.9.0; ./harfbuzz/1.9.0/x86_64-centos7-gcc11-opt; freetype-08d63,cairo-d1de8
hbase; b082a; 1.2.0; ./hbase/1.2.0/x86_64-centos7-gcc11-opt; java-80070
HeapDict; 6e185; 1.0.0; ./HeapDict/1.0.0/x86_64-centos7-gcc11-opt; setuptools-e5403,Python-9a1bc
heaptrack; b1995; 1.3.0; ./heaptrack/1.3.0/x86_64-centos7-gcc11-opt; Boost-e77cf,gdb-78aaa,zlib-8af4c,libunwind-2fa0a
hepmc3; 77aba; 3.2.4; ./hepmc3/3.2.4/x86_64-centos7-gcc11-opt; ROOT-edd28
hepdata_validator; 31b25; 0.2.3; ./hepdata_validator/0.2.3/x86_64-centos7-gcc11-opt; jsonschema-5e669,setuptools-e5403,Python-9a1bc,PyYAML-edbb9
hepdata_converter; e27a9; 0.2.3; ./hepdata_converter/0.2.3/x86_64-centos7-gcc11-opt; hepdata_validator-31b25,matplotlib-3f48d,setuptools-e5403,Python-9a1bc
hepunits; bc244; 2.2.0; ./hepunits/2.2.0/x86_64-centos7-gcc11-opt; hepunits-bc244,setuptools-e5403,Python-9a1bc,attrs-52e86
HepPDT; dba76; 2.06.01; ./HepPDT/2.06.01/x86_64-centos7-gcc11-opt; 
highfive; b8910; 2.0; ./highfive/2.0/x86_64-centos7-gcc11-opt; Boost-e77cf,hdf5-a3b1e
hive; da8fc; 1.1.1; ./hive/1.1.1/x86_64-centos7-gcc11-opt; java-80070
hist; 7cfeb; 2.5.1; ./hist/2.5.1/x86_64-centos7-gcc11-opt; boost_histogram-7235c,more_itertools-6198a,scipy-73b9f,matplotlib-3f48d,mplhep-a6904,numpy-1af8f,iminuit-dc6d6,setuptools-e5403,Python-9a1bc,histoprint-c5ccd
histoprint; c5ccd; 2.2.0; ./histoprint/2.2.0/x86_64-centos7-gcc11-opt; uhi-0b0d0,numpy-1af8f,setuptools-e5403,Python-9a1bc,click-07a71
html5lib; 380df; 1.0.1; ./html5lib/1.0.1/x86_64-centos7-gcc11-opt; six-7d0d9,webencodings-e17ab,setuptools-e5403,Python-9a1bc
h5py; eb0b3; 3.6.0; ./h5py/3.6.0/x86_64-centos7-gcc11-opt; six-7d0d9,cython-aa7c8,numpy-1af8f,pkgconfig-7d301,setuptools-e5403,Python-9a1bc,pkg_config-c6baf,pip-0a3af,hdf5-a3b1e
hdf5; a3b1e; 1.10.6; ./hdf5/1.10.6/x86_64-centos7-gcc11-opt; zlib-8af4c
humanize; 119f3; 4.0.0; ./humanize/4.0.0/x86_64-centos7-gcc11-opt; setuptools-e5403,Python-9a1bc
hwloc; 84144; 2.7.0; ./hwloc/2.7.0/x86_64-centos7-gcc11-opt; 
hypothesis; 81607; 5.3.0; ./hypothesis/5.3.0/x86_64-centos7-gcc11-opt; sortedcontainers-f9052,setuptools-e5403,Python-9a1bc,attrs-52e86
idna; e6055; 3.2; ./idna/3.2/x86_64-centos7-gcc11-opt; setuptools-e5403,Python-9a1bc
imageio; 93b36; 2.5.0; ./imageio/2.5.0/x86_64-centos7-gcc11-opt; numpy-1af8f,pillow-401bb,setuptools-e5403,Python-9a1bc
imagesize; c11f5; 1.2.0; ./imagesize/1.2.0/x86_64-centos7-gcc11-opt; setuptools-e5403,Python-9a1bc
imagemagick; f31f6; 7.0.8.7; ./imagemagick/7.0.8.7/x86_64-centos7-gcc11-opt; pango-b7c7b,zlib-8af4c,graphviz-a682a,fftw-cd301,png-5186a,freetype-08d63,fontconfig-47540
iminuit; dc6d6; 2.9.0; ./iminuit/2.9.0/x86_64-centos7-gcc11-opt; ipython-5f199,scipy-73b9f,cython-aa7c8,matplotlib-3f48d,pytest-b9bb8,numpy-1af8f,setuptools-e5403,Python-9a1bc,pylint-60011
importlib_metadata; a30de; 2.0.0; ./importlib_metadata/2.0.0/x86_64-centos7-gcc11-opt; six-7d0d9,setuptools_scm-e3f04,setuptools-e5403,Python-9a1bc,zipp-11675
importlib_resources; 930b0; 1.0.2; ./importlib_resources/1.0.2/x86_64-centos7-gcc11-opt; wheel-0cbbc,setuptools-e5403,Python-9a1bc
iniconfig; 00635; 1.1.1; ./iniconfig/1.1.1/x86_64-centos7-gcc11-opt; setuptools-e5403,Python-9a1bc
ipaddress; f06ae; 1.0.22; ./ipaddress/1.0.22/x86_64-centos7-gcc11-opt; setuptools-e5403,Python-9a1bc
ipydatawidgets; c29b9; 4.0.1; ./ipydatawidgets/4.0.1/x86_64-centos7-gcc11-opt; traittypes-a6528,setuptools-e5403,Python-9a1bc
ipykernel; a1cca; 6.0.2; ./ipykernel/6.0.2/x86_64-centos7-gcc11-opt; debugpy-c5280,ipython-5f199,matplotlib_inline-f96c3,traitlets-3945c,six-7d0d9,tornado-e7c51,setuptools-e5403,Python-9a1bc,jupyter_client-f080f
ipympl; 9282c; 0.7.0; ./ipympl/0.7.0/x86_64-centos7-gcc11-opt; jupyter_packaging-f51d5,matplotlib-3f48d,ipykernel-a1cca,ipywidgets-c5d1c,setuptools-e5403,Python-9a1bc
ipyparallel; 4bb17; 6.2.4; ./ipyparallel/6.2.4/x86_64-centos7-gcc11-opt; ipython-5f199,ipython_genutils-24129,pyzmq-b2755,traitlets-3945c,decorator-66e77,tornado-e7c51,ipykernel-a1cca,jupyter_client-f080f,python_dateutil-1a27e
ipython; 5f199; 7.25.0; ./ipython/7.25.0/x86_64-centos7-gcc11-opt; pygments-418fc,ipython_genutils-24129,six-7d0d9,traitlets-3945c,simplegeneric-f2fbc,decorator-66e77,jedi-bdcc4,setuptools-e5403,Python-9a1bc,backcall-dc79b,pip-0a3af,prompt_toolkit-8a77a,pickleshare-8024c,ptyprocess-c1fb5,pexpect-c2150
ipython_genutils; 24129; 0.2.0; ./ipython_genutils/0.2.0/x86_64-centos7-gcc11-opt; setuptools-e5403,Python-9a1bc
ipywidgets; c5d1c; 7.6.3; ./ipywidgets/7.6.3/x86_64-centos7-gcc11-opt; ipython-5f199,traitlets-3945c,widgetsnbextension-d2f83,ipykernel-a1cca,setuptools-e5403,Python-9a1bc,nbformat-7dcb1
isort; bb154; 4.3.20; ./isort/4.3.20/x86_64-centos7-gcc11-opt; setuptools-e5403,Python-9a1bc
itk; 0fe5c; 5.2.1; ./itk/5.2.1/x86_64-centos7-gcc11-opt; itk_filtering-2278e,itk_io-73333,numpy-1af8f,itk_numerics-298cd,itk_segmentation-a64fa,itk_core-90f02,Python-9a1bc,pip-0a3af,itk_registration-95283
itk_core; 90f02; 5.2.1; ./itk_core/5.2.1/x86_64-centos7-gcc11-opt; pip-0a3af,numpy-1af8f,Python-9a1bc
itk_io; 73333; 5.2.1; ./itk_io/5.2.1/x86_64-centos7-gcc11-opt; pip-0a3af,itk_core-90f02,Python-9a1bc
itk_filtering; 2278e; 5.2.1; ./itk_filtering/5.2.1/x86_64-centos7-gcc11-opt; pip-0a3af,itk_numerics-298cd,itk_core-90f02,Python-9a1bc
itk_meshtopolydata; 021f0; 0.7.0; ./itk_meshtopolydata/0.7.0/x86_64-centos7-gcc11-opt; pip-0a3af,numpy-1af8f,itk_core-90f02,Python-9a1bc
itk_numerics; 298cd; 5.2.1; ./itk_numerics/5.2.1/x86_64-centos7-gcc11-opt; pip-0a3af,itk_core-90f02,Python-9a1bc
itk_registration; 95283; 5.2.1; ./itk_registration/5.2.1/x86_64-centos7-gcc11-opt; pip-0a3af,itk_filtering-2278e,Python-9a1bc
itk_segmentation; a64fa; 5.2.1; ./itk_segmentation/5.2.1/x86_64-centos7-gcc11-opt; pip-0a3af,itk_filtering-2278e,Python-9a1bc
itkwidgets; c889c; 0.32.0; ./itkwidgets/0.32.0/x86_64-centos7-gcc11-opt; itk_filtering-2278e,ipydatawidgets-c29b9,scipy-73b9f,zstandard-b8d5c,six-7d0d9,matplotlib-3f48d,colorcet-785ef,itk_io-73333,numpy-1af8f,ipywidgets-c5d1c,itk_core-90f02,itk_meshtopolydata-021f0,ipympl-9282c
java; 80070; 8u312; ./java/8u312/x86_64-centos7-gcc11-opt; 
jax; dbe17; 0.3.1; ./jax/0.3.1/x86_64-centos7-gcc11-opt; scipy-73b9f,absl_py-a991e,numpy-1af8f,opt_einsum-14fa7,setuptools-e5403,Python-9a1bc,jaxlib-0fee4,typing_extensions-d8149
jaxlib; 0fee4; 0.3.0; ./jaxlib/0.3.0/x86_64-centos7-gcc11-opt; flatbuffers-24169,scipy-73b9f,absl_py-a991e,six-7d0d9,numpy-1af8f,Python-9a1bc,pip-0a3af
jedi; bdcc4; 0.18.0; ./jedi/0.18.0/x86_64-centos7-gcc11-opt; parso-8f78d,setuptools-e5403,Python-9a1bc
jemalloc; 8154a; 5.2.1; ./jemalloc/5.2.1/x86_64-centos7-gcc11-opt; 
Jinja2; 766ba; 3.0.1; ./Jinja2/3.0.1/x86_64-centos7-gcc11-opt; MarkupSafe-960cd,setuptools-e5403,Python-9a1bc,babel-00a2a
jmespath; bcc72; 0.10.0; ./jmespath/0.10.0/x86_64-centos7-gcc11-opt; setuptools-e5403,Python-9a1bc
joblib; e567c; 1.0.1; ./joblib/1.0.1/x86_64-centos7-gcc11-opt; setuptools-e5403,Python-9a1bc
jsonc; e004f; 0.12; ./jsonc/0.12/x86_64-centos7-gcc11-opt; 
jsoncpp; 0c1cb; 1.9.3; ./jsoncpp/1.9.3/x86_64-centos7-gcc11-opt; 
jsonmcpp; f26c3; 3.10.5; ./jsonmcpp/3.10.5/x86_64-centos7-gcc11-opt; 
jsonpatch; 23d40; 1.28; ./jsonpatch/1.28/x86_64-centos7-gcc11-opt; setuptools-e5403,Python-9a1bc,jsonpointer-38b7d
jsonpointer; 38b7d; 2.0; ./jsonpointer/2.0/x86_64-centos7-gcc11-opt; setuptools-e5403,Python-9a1bc
jsonschema; 5e669; 3.2.0; ./jsonschema/3.2.0/x86_64-centos7-gcc11-opt; pyrsistent-26c9e,setuptools_scm-e3f04,vcversioner-7feb9,setuptools-e5403,Python-9a1bc,attrs-52e86
julia; b9498; 1.7.3; ./julia/1.7.3/x86_64-centos7-gcc11-opt; 
jl_ijulia; 760bb; 1.23.3; ./jl_ijulia/1.23.3/x86_64-centos7-gcc11-opt; julia-b9498
pyjson5; eec87; 0.9.6; ./pyjson5/0.9.6/x86_64-centos7-gcc11-opt; setuptools-e5403,Python-9a1bc
jupyter; eb185; 1.0.0; ./jupyter/1.0.0/x86_64-centos7-gcc11-opt; jupyter_core-524c6,certifi-cd51f,pyzmq-b2755,terminado-abfa7,jsonschema-5e669,ipywidgets-c5d1c,setuptools-e5403,mistune-1c090,Jinja2-766ba,metakernel-77208,entrypoints-dc246,pygments-418fc,tornado-e7c51,jupyter_console-02e88,ipykernel-a1cca,nbformat-7dcb1,nbconvert-754b7,jupyter_client-f080f,ipython-5f199,notebook-7dd88,qtconsole-1fe91,widgetsnbextension-d2f83,Python-9a1bc,MarkupSafe-960cd
jupyter_client; f080f; 6.1.12; ./jupyter_client/6.1.12/x86_64-centos7-gcc11-opt; jupyter_core-524c6,pyzmq-b2755,traitlets-3945c,tornado-e7c51,setuptools-e5403,Python-9a1bc,python_dateutil-1a27e
jupyter_core; 524c6; 4.7.1; ./jupyter_core/4.7.1/x86_64-centos7-gcc11-opt; traitlets-3945c,setuptools-e5403,Python-9a1bc
jupyter_console; 02e88; 6.1.0; ./jupyter_console/6.1.0/x86_64-centos7-gcc11-opt; jupyter_core-524c6,ipython-5f199,pygments-418fc,ipykernel-a1cca,setuptools-e5403,Python-9a1bc,prompt_toolkit-8a77a
jupyter_contrib_core; badfa; 0.3.3; ./jupyter_contrib_core/0.3.3/x86_64-centos7-gcc11-opt; jupyter_core-524c6,entrypoints-dc246,notebook-7dd88,traitlets-3945c,tornado-e7c51,setuptools-e5403
jupyter_contrib_nbextensions; 0179b; 0.5.220308; ./jupyter_contrib_nbextensions/0.5.220308/x86_64-centos7-gcc11-opt; ipython_genutils-24129,jupyter_latex_envs-9b6db,decorator-66e77,psutil-d80ca,jupyter_contrib_core-badfa,jupyter_highlight_selected_word-26289,lxml-e7188,jsonschema-5e669,jupyter-eb185,Python-9a1bc,jupyter_nbextensions_configurator-bc025
jupyter_highlight_selected_word; 26289; 0.2.0; ./jupyter_highlight_selected_word/0.2.0/x86_64-centos7-gcc11-opt; setuptools-e5403,Python-9a1bc
jupyter_latex_envs; 9b6db; 1.4.4p1; ./jupyter_latex_envs/1.4.4p1/x86_64-centos7-gcc11-opt; setuptools-e5403,Python-9a1bc
jupyter_nbextensions_configurator; bc025; 0.4.1; ./jupyter_nbextensions_configurator/0.4.1/x86_64-centos7-gcc11-opt; jupyter_core-524c6,notebook-7dd88,traitlets-3945c,tornado-e7c51,jupyter_contrib_core-badfa,PyYAML-edbb9
jupyter_packaging; f51d5; 0.10.4; ./jupyter_packaging/0.10.4/x86_64-centos7-gcc11-opt; tomlkit-0d0cb,deprecation-418d3,packaging-a60db,setuptools-e5403,Python-9a1bc
jupyterlab_pygments; 4b81f; 0.1.2; ./jupyterlab_pygments/0.1.2/x86_64-centos7-gcc11-opt; pygments-418fc,setuptools-e5403,Python-9a1bc
jupyterlab; e53a5; 3.0.17; ./jupyterlab/3.0.17/x86_64-centos7-gcc11-opt; jupyter_core-524c6,ipython-5f199,node.js-dd4fe,nbclassic-3d471,tornado-e7c51,jupyter_server-e2966,jupyterlab_server-8cc54,packaging-a60db,Jinja2-766ba
jupyterlab_server; 8cc54; 2.6.1; ./jupyterlab_server/2.6.1/x86_64-centos7-gcc11-opt; jupyter_server-e2966,requests-1c034,pyjson5-eec87,jsonschema-5e669,packaging-a60db,babel-00a2a
jupyter_server; e2966; 1.10.2; ./jupyter_server/1.10.2/x86_64-centos7-gcc11-opt; jupyter_core-524c6,websocket_client-b2848,ipython_genutils-24129,pyzmq-b2755,traitlets-3945c,send2trash-2bd40,jupyter_client-f080f,terminado-abfa7,tornado-e7c51,argon2_cffi-9748b,nbconvert-754b7,requests_unixsocket-de294,prometheus_client-3a41e,nbformat-7dcb1,anyio-470ff,Jinja2-766ba
keras; affe6; 2.8.0; ./keras/2.8.0/x86_64-centos7-gcc11-opt; scipy-73b9f,six-7d0d9,h5py-eb0b3,theano-6df53,numpy-1af8f,setuptools-e5403,Python-9a1bc,PyYAML-edbb9,pip-0a3af
keras_applications; 135bc; 1.0.8; ./keras_applications/1.0.8/x86_64-centos7-gcc11-opt; setuptools-e5403,Python-9a1bc,keras-affe6
keras_preprocessing; 100bc; 1.1.2; ./keras_preprocessing/1.1.2/x86_64-centos7-gcc11-opt; setuptools-e5403,Python-9a1bc,keras-affe6
keras_tuner; f1add; 1.0.3; ./keras_tuner/1.0.3/x86_64-centos7-gcc11-opt; ipython-5f199,scipy-73b9f,requests-1c034,numpy-1af8f,tensorboard-cdc81,packaging-a60db,setuptools-e5403,Python-9a1bc,kt_legacy-ae686
kiwisolver; 39226; 1.0.1; ./kiwisolver/1.0.1/x86_64-centos7-gcc11-opt; setuptools-e5403,Python-9a1bc
kt_legacy; ae686; 1.0.3; ./kt_legacy/1.0.3/x86_64-centos7-gcc11-opt; setuptools-e5403,Python-9a1bc
kubernetes; d27e0; 23.3.0; ./kubernetes/23.3.0/x86_64-centos7-gcc11-opt; websocket_client-b2848,certifi-cd51f,ipaddress-f06ae,six-7d0d9,urllib3-cfa90,requests-1c034,requests_oauthlib-5c557,google_auth-38125,setuptools-e5403,Python-9a1bc,PyYAML-edbb9,python_dateutil-1a27e
kubernetes_asyncio; a2a49; 21.7.1; ./kubernetes_asyncio/21.7.1/x86_64-centos7-gcc11-opt; pystan-9e2a6,certifi-cd51f,six-7d0d9,urllib3-cfa90,setuptools-e5403,Python-9a1bc,PyYAML-edbb9,python_dateutil-1a27e
lark_parser; 1380b; 0.12.0; ./lark_parser/0.12.0/x86_64-centos7-gcc11-opt; setuptools-e5403,Python-9a1bc
lazy_object_proxy; 5c71a; 1.6.0; ./lazy_object_proxy/1.6.0/x86_64-centos7-gcc11-opt; pip-0a3af,setuptools-e5403,Python-9a1bc
lcov; b9cb3; 1.14; ./lcov/1.14/x86_64-centos7-gcc11-opt; 
libaio; 3a85a; 0.3.110-1; ./libaio/0.3.110-1/x86_64-centos7-gcc11-opt; 
libffi; a3607; 3.4.2; ./libffi/3.4.2/x86_64-centos7-gcc11-opt; 
libgeotiff; 9a9b9; 1.6.0; ./libgeotiff/1.6.0/x86_64-centos7-gcc11-opt; proj-c86df,tiff-33276
libgit2; 98d83; 1.1.1; ./libgit2/1.1.1/x86_64-centos7-gcc11-opt; Python-9a1bc
libm_aocl; f313a; 3.1.0; ./libm_aocl/3.1.0/x86_64-centos7-gcc11-opt; 
libpqxx; 1445f; 7.6.0; ./libpqxx/7.6.0/x86_64-centos7-gcc11-opt; postgresql-b4308
libsodium; 0b20d; 1.0.18; ./libsodium/1.0.18/x86_64-centos7-gcc11-opt; 
libsvm; 1e906; 3.23; ./libsvm/3.23/x86_64-centos7-gcc11-opt; Python-9a1bc
libtool; 490ac; 2.4.6; ./libtool/2.4.6/x86_64-centos7-gcc11-opt; 
libxkbcommon; 8c5b7; 0.7.1; ./libxkbcommon/0.7.1/x86_64-centos7-gcc11-opt; bison-929f9
libxml2; 9cd93; 2.9.10; ./libxml2/2.9.10/x86_64-centos7-gcc11-opt; 
libxslt; a0f53; 1.1.34; ./libxslt/1.1.34/x86_64-centos7-gcc11-opt; libxml2-9cd93
LCIO; 6273b; 02.16.01; ./LCIO/02.16.01/x86_64-centos7-gcc11-opt; ROOT-edd28,clhep-ebe73,SIO-6e311
llvmlite; d59dc; 0.36.0; ./llvmlite/0.36.0/x86_64-centos7-gcc11-opt; pip-0a3af,wheel-0cbbc,setuptools-e5403,Python-9a1bc
locket; 028a6; 0.2.1; ./locket/0.2.1/x86_64-centos7-gcc11-opt; setuptools-e5403,Python-9a1bc
logilabcommon; 5dc43; 1.8.1; ./logilabcommon/1.8.1/x86_64-centos7-gcc11-opt; pytest-b9bb8,six-7d0d9,setuptools-e5403,Python-9a1bc
lwtnn; 2ee64; 2.11.1; ./lwtnn/2.11.1/x86_64-centos7-gcc11-opt; Boost-e77cf,eigen-642a5
lxml; e7188; 4.6.2; ./lxml/4.6.2/x86_64-centos7-gcc11-opt; cython-aa7c8,setuptools-e5403,libxslt-a0f53,Python-9a1bc,libxml2-9cd93
lz4; 9bdfe; 1.9.2; ./lz4/1.9.2/x86_64-centos7-gcc11-opt; 
m2crypto; 5f2f9; 0.34.0; ./m2crypto/0.34.0/x86_64-centos7-gcc11-opt; swig-18ec1,setuptools-e5403,Python-9a1bc
m4; 89870; 1.4.18; ./m4/1.4.18/x86_64-centos7-gcc11-opt; 
markdown; 781da; 3.1.1; ./markdown/3.1.1/x86_64-centos7-gcc11-opt; setuptools-e5403,Python-9a1bc
MarkupSafe; 960cd; 2.0.1; ./MarkupSafe/2.0.1/x86_64-centos7-gcc11-opt; setuptools-e5403,Python-9a1bc
matplotlib; 3f48d; 3.4.3; ./matplotlib/3.4.3/x86_64-centos7-gcc11-opt; kiwisolver-39226,cycler-e4db8,pytz-2631d,pillow-401bb,six-7d0d9,pyparsing-fa2b1,certifi-cd51f,tornado-e7c51,messaging-5ee4f,numpy-1af8f,setuptools-e5403,nose-8cca8,Python-9a1bc,mock-dee9c,freetype-08d63,pycairo-f2d43,python_dateutil-1a27e
matplotlib_inline; f96c3; 0.1.2; ./matplotlib_inline/0.1.2/x86_64-centos7-gcc11-opt; setuptools-e5403,traitlets-3945c,Python-9a1bc
maven; dc6dc; 3.6.1; ./maven/3.6.1/x86_64-centos7-gcc11-opt; java-80070
mccabe; 55450; 0.6.1; ./mccabe/0.6.1/x86_64-centos7-gcc11-opt; pytest_runner-c9786,setuptools-e5403,Python-9a1bc
messaging; 5ee4f; 1.1; ./messaging/1.1/x86_64-centos7-gcc11-opt; setuptools-e5403,Python-9a1bc
metakernel; 77208; 0.24.2; ./metakernel/0.24.2/x86_64-centos7-gcc11-opt; ipython-5f199,ipykernel-a1cca,setuptools-e5403,Python-9a1bc,pexpect-c2150
mimesis; 5f8d5; 4.1.3; ./mimesis/4.1.3/x86_64-centos7-gcc11-opt; setuptools-e5403,Python-9a1bc
minrpc; 5f0b4; 0.0.11; ./minrpc/0.0.11/x86_64-centos7-gcc11-opt; setuptools-e5403,Python-9a1bc
mistune; 1c090; 0.8.4; ./mistune/0.8.4/x86_64-centos7-gcc11-opt; setuptools-e5403,Python-9a1bc
mock; dee9c; 3.0.5; ./mock/3.0.5/x86_64-centos7-gcc11-opt; pbr-8123e,funcsigs-ef887,setuptools-e5403,Python-9a1bc
more_itertools; 6198a; 7.0.0; ./more_itertools/7.0.0/x86_64-centos7-gcc11-opt; six-7d0d9,setuptools-e5403,Python-9a1bc
mpfi; f2a84; 1.5.3; ./mpfi/1.5.3/x86_64-centos7-gcc11-opt; mpfr-61226
mpfr; 61226; 4.0.2; ./mpfr/4.0.2/x86_64-centos7-gcc11-opt; 
mpi4py; c58ac; 3.1.1; ./mpi4py/3.1.1/x86_64-centos7-gcc11-opt; setuptools-e5403,Python-9a1bc,openmpi-b542c
mplhep; a6904; 0.3.12; ./mplhep/0.3.12/x86_64-centos7-gcc11-opt; matplotlib-3f48d,uhi-0b0d0,mplhep_data-4c4b9,numpy-1af8f,packaging-a60db,setuptools-e5403,Python-9a1bc
mplhep_data; 4c4b9; 0.0.3; ./mplhep_data/0.0.3/x86_64-centos7-gcc11-opt; setuptools-e5403,Python-9a1bc
mpmath; 115ae; 1.2.1; ./mpmath/1.2.1/x86_64-centos7-gcc11-opt; setuptools_scm-e3f04,setuptools-e5403,Python-9a1bc
msgpack; b8b12; 0.6.1; ./msgpack/0.6.1/x86_64-centos7-gcc11-opt; setuptools-e5403,Python-9a1bc
msgpackc; c4011; 3.2.0; ./msgpackc/3.2.0/x86_64-centos7-gcc11-opt; 
multiprocess; 68cbd; 0.70.10; ./multiprocess/0.70.10/x86_64-centos7-gcc11-opt; setuptools-e5403,Python-9a1bc,dill-6d5b4
mypy; 866b9; 0.941; ./mypy/0.941/x86_64-centos7-gcc11-opt; mypy_extensions-7c765,tomli-cd2c0,setuptools-e5403,Python-9a1bc,typing_extensions-d8149
mypy_extensions; 7c765; 0.4.3; ./mypy_extensions/0.4.3/x86_64-centos7-gcc11-opt; mypy_extensions-7c765,tomli-cd2c0,setuptools-e5403,Python-9a1bc,typing_extensions-d8149
mysql; 2fdf3; 10.5.13; ./mysql/10.5.13/x86_64-centos7-gcc11-opt; jemalloc-8154a,zlib-8af4c,msgpackc-c4011,lz4-9bdfe,bison-929f9,zeromq-acdd8,Boost-e77cf,libxml2-9cd93
mysql_connector_python; 4cfd3; 8.0.18; ./mysql_connector_python/8.0.18/x86_64-centos7-gcc11-opt; six-7d0d9,mysql-2fdf3,setuptools-e5403,Python-9a1bc,pip-0a3af
nanomsg; 30ff1; 1.1.5; ./nanomsg/1.1.5/x86_64-centos7-gcc11-opt; 
nbclassic; 3d471; 0.3.1; ./nbclassic/0.3.1/x86_64-centos7-gcc11-opt; notebook-7dd88,jupyter_server-e2966
nbclient; add05; 0.5.3; ./nbclient/0.5.3/x86_64-centos7-gcc11-opt; traitlets-3945c,nest_asyncio-7ed5c,setuptools-e5403,Python-9a1bc,nbformat-7dcb1,jupyter_client-f080f,async_generator-af015
nbconvert; 754b7; 6.1.0; ./nbconvert/6.1.0/x86_64-centos7-gcc11-opt; jupyter_core-524c6,entrypoints-dc246,pygments-418fc,traitlets-3945c,defusedxml-80ed5,bleach-9e4d1,pandocfilters-b1038,setuptools-e5403,Python-9a1bc,nbformat-7dcb1,jupyterlab_pygments-4b81f,testpath-07e51,mistune-1c090,Jinja2-766ba,nbclient-add05
nbformat; 7dcb1; 5.1.3; ./nbformat/5.1.3/x86_64-centos7-gcc11-opt; jupyter_core-524c6,ipython_genutils-24129,traitlets-3945c,jsonschema-5e669,setuptools-e5403,Python-9a1bc
nest_asyncio; 7ed5c; 1.5.1; ./nest_asyncio/1.5.1/x86_64-centos7-gcc11-opt; setuptools-e5403,Python-9a1bc
netcdfc; 85e7e; 4.7.0; ./netcdfc/4.7.0/x86_64-centos7-gcc11-opt; zlib-8af4c,hdf5-a3b1e,m4-89870
networkx; 814fe; 2.5.1; ./networkx/2.5.1/x86_64-centos7-gcc11-opt; decorator-66e77,pytest-b9bb8,setuptools-e5403,Python-9a1bc
ninja; d608d; 1.10.0; ./ninja/1.10.0/x86_64-centos7-gcc11-opt; 
node.js; dd4fe; 14.16.1; ./node.js/14.16.1/x86_64-centos7-gcc11-opt; Python-9a1bc
nose; 8cca8; 1.3.7; ./nose/1.3.7/x86_64-centos7-gcc11-opt; setuptools-e5403,Python-9a1bc
notebook; 7dd88; 6.4.0; ./notebook/6.4.0/x86_64-centos7-gcc11-opt; jupyter_core-524c6,ipython_genutils-24129,pyzmq-b2755,traitlets-3945c,send2trash-2bd40,terminado-abfa7,ipaddress-f06ae,tornado-e7c51,argon2_cffi-9748b,nbconvert-754b7,ipykernel-a1cca,prometheus_client-3a41e,Python-9a1bc,nbformat-7dcb1,jupyter_client-f080f,Jinja2-766ba
numba; dc683; 0.51.2; ./numba/0.51.2/x86_64-centos7-gcc11-opt; llvmlite-d59dc,numpy-1af8f,setuptools-e5403,Python-9a1bc
numexpr; 629c8; 2.6.9; ./numexpr/2.6.9/x86_64-centos7-gcc11-opt; numpy-1af8f,Python-9a1bc
numpy; 1af8f; 1.22.3; ./numpy/1.22.3/x86_64-centos7-gcc11-opt; blas-6339b,setuptools-e5403,Python-9a1bc,cython-aa7c8
oauthlib; a62dd; 3.0.1; ./oauthlib/3.0.1/x86_64-centos7-gcc11-opt; cryptography-472f2,setuptools-e5403,Python-9a1bc
ocaml; 9b40a; 4.13.1; ./ocaml/4.13.1/x86_64-centos7-gcc11-opt; 
octave; 3a5f1; 6.2.0; ./octave/6.2.0/x86_64-centos7-gcc11-opt; Qt5-cb06f,gnuplot-2c34f,pcre-5c0c1,blas-6339b,readline-2ff43,fftw-cd301,texinfo-21d20
octavekernel; ba4be; 0.32.0; ./octavekernel/0.32.0/x86_64-centos7-gcc11-opt; metakernel-77208,octave-3a5f1,ipykernel-a1cca,setuptools-e5403,Python-9a1bc,jupyter_client-f080f
odfpy; 1f0c5; 1.4.1; ./odfpy/1.4.1/x86_64-centos7-gcc11-opt; defusedxml-80ed5,setuptools-e5403,Python-9a1bc
omniorb; a7653; 4.2.4; ./omniorb/4.2.4/x86_64-centos7-gcc11-opt; Python-9a1bc
onnx; 80d55; 1.11.0; ./onnx/1.11.0/x86_64-centos7-gcc11-opt; six-7d0d9,numpy-1af8f,setuptools-e5403,protobuf-5052d,Python-9a1bc,pip-0a3af,typing_extensions-d8149
onnxruntime; 37f9e; 1.11.1; ./onnxruntime/1.11.1/x86_64-centos7-gcc11-opt; wheel-0cbbc,onnx-80d55,six-7d0d9,torch-7c1a4,blas-6339b,numpy-1af8f,setuptools-e5403,Python-9a1bc,protobuf-5052d,pip-0a3af
openmpi; b542c; 4.1.2; ./openmpi/4.1.2/x86_64-centos7-gcc11-opt; hwloc-84144
openpyxl; 314c5; 3.0.9; ./openpyxl/3.0.9/x86_64-centos7-gcc11-opt; setuptools-e5403,Python-9a1bc,et_xmlfile-a48a1
opt_einsum; 14fa7; 3.2.0; ./opt_einsum/3.2.0/x86_64-centos7-gcc11-opt; numpy-1af8f,setuptools-e5403,Python-9a1bc
oracle; 69dfe; 19.11.0.0.0; ./oracle/19.11.0.0.0/x86_64-centos7-gcc11-opt; libaio-3a85a
packaging; a60db; 21.0; ./packaging/21.0/x86_64-centos7-gcc11-opt; six-7d0d9,setuptools-e5403,Python-9a1bc,pyparsing-fa2b1
pacparser; bd798; 1.3.7; ./pacparser/1.3.7/x86_64-centos7-gcc11-opt; 
pandas; 5abcd; 1.2.2; ./pandas/1.2.2/x86_64-centos7-gcc11-opt; openpyxl-314c5,pytz-2631d,odfpy-1f0c5,cython-aa7c8,numpy-1af8f,setuptools_scm-e3f04,xlrd-d22e2,hypothesis-81607,setuptools-e5403,Python-9a1bc,python_dateutil-1a27e
pandocfilters; b1038; 1.4.3; ./pandocfilters/1.4.3/x86_64-centos7-gcc11-opt; setuptools-e5403,Python-9a1bc
panel; 95cf2; 0.11.3; ./panel/0.11.3/x86_64-centos7-gcc11-opt; bokeh-2ea1c,node.js-dd4fe,param-cf5a6,markdown-781da,tqdm-54fb2,pyviz_comms-5d9ce,requests-1c034,numpy-1af8f,pyct-9c01a,setuptools-e5403,Python-9a1bc
pango; b7c7b; 1.40.13; ./pango/1.40.13/x86_64-centos7-gcc11-opt; freetype-08d63,harfbuzz-7868c,fontconfig-47540,cairo-d1de8
param; cf5a6; 1.10.1; ./param/1.10.1/x86_64-centos7-gcc11-opt; setuptools-e5403,Python-9a1bc
paramiko; 65b81; 2.9.2; ./paramiko/2.9.2/x86_64-centos7-gcc11-opt; pynacl-be562,bcrypt-39f32,pyasn1-13fd7,setuptools-e5403,Python-9a1bc,cryptography-472f2
parse; aeba7; 1.19.0; ./parse/1.19.0/x86_64-centos7-gcc11-opt; setuptools-e5403,Python-9a1bc
parsl; 0663b; 1.2.0; ./parsl/1.2.0/x86_64-centos7-gcc11-opt; mpi4py-c58ac,typeguard-19686,globus_sdk-7626c,psutil-d80ca,paramiko-65b81,requests-1c034,dill-6d5b4,ipykernel-a1cca,ipyparallel-4bb17,tblib-9e102
parso; 8f78d; 0.8.2; ./parso/0.8.2/x86_64-centos7-gcc11-opt; setuptools-e5403,Python-9a1bc
partd; a7f36; 1.2.0; ./partd/1.2.0/x86_64-centos7-gcc11-opt; toolz-6f659,locket-028a6,setuptools-e5403,Python-9a1bc
particle; 73796; 0.20.1; ./particle/0.20.1/x86_64-centos7-gcc11-opt; hepunits-bc244,setuptools-e5403,Python-9a1bc,attrs-52e86
patchelf; ba5ae; 0.12; ./patchelf/0.12/x86_64-centos7-gcc11-opt; 
pathlib2; 7b2b3; 2.3.3; ./pathlib2/2.3.3/x86_64-centos7-gcc11-opt; scandir-c95b2,six-7d0d9,setuptools-e5403,Python-9a1bc
pathos; d6299; 0.2.3; ./pathos/0.2.3/x86_64-centos7-gcc11-opt; six-7d0d9,pox-bcc51,setuptools-e5403,multiprocess-68cbd,Python-9a1bc,ppft-8ee76
patsy; 094ff; 0.5.1; ./patsy/0.5.1/x86_64-centos7-gcc11-opt; six-7d0d9,numpy-1af8f,setuptools-e5403,Python-9a1bc,pandas-5abcd
pbr; 8123e; 5.2.1; ./pbr/5.2.1/x86_64-centos7-gcc11-opt; setuptools-e5403,Python-9a1bc
pcre; 5c0c1; 8.43; ./pcre/8.43/x86_64-centos7-gcc11-opt; 
pcre2; 1d4f8; 10.36; ./pcre2/10.36/x86_64-centos7-gcc11-opt; 
pexpect; c2150; 4.8.0; ./pexpect/4.8.0/x86_64-centos7-gcc11-opt; ptyprocess-c1fb5,setuptools-e5403,Python-9a1bc
pickleshare; 8024c; 0.7.5; ./pickleshare/0.7.5/x86_64-centos7-gcc11-opt; pathlib2-7b2b3,setuptools-e5403,Python-9a1bc
pillow; 401bb; 8.2.0; ./pillow/8.2.0/x86_64-centos7-gcc11-opt; libffi-a3607,cffi-bea67,zlib-8af4c,setuptools-e5403,Python-9a1bc,freetype-08d63
pip; 0a3af; 22.0.4; ./pip/22.0.4/x86_64-centos7-gcc11-opt; wheel-0cbbc,setuptools-e5403,Python-9a1bc
pipenv; b8098; 2020.11.15; ./pipenv/2020.11.15/x86_64-centos7-gcc11-opt; certifi-cd51f,virtualenv_clone-07189,virtualenv-9f71c,setuptools-e5403,Python-9a1bc,pip-0a3af
pixman; 46112; 0.38.4; ./pixman/0.38.4/x86_64-centos7-gcc11-opt; 
pkg_config; c6baf; 0.29.2; ./pkg_config/0.29.2/x86_64-centos7-gcc11-opt; 
pkgconfig; 7d301; 1.5.1; ./pkgconfig/1.5.1/x86_64-centos7-gcc11-opt; setuptools-e5403,Python-9a1bc
platformdirs; 133d7; 2.5.1; ./platformdirs/2.5.1/x86_64-centos7-gcc11-opt; setuptools_scm-e3f04,setuptools-e5403,Python-9a1bc
plotly; 00963; 4.5.0; ./plotly/4.5.0/x86_64-centos7-gcc11-opt; matplotlib-3f48d,retrying-998f8,six-7d0d9,Python-9a1bc
pluggy; 45712; 0.13.1; ./pluggy/0.13.1/x86_64-centos7-gcc11-opt; importlib_metadata-a30de,setuptools_scm-e3f04,setuptools-e5403,Python-9a1bc,zipp-11675
plumbum; 0d7b7; 1.7.2; ./plumbum/1.7.2/x86_64-centos7-gcc11-opt; setuptools-e5403,Python-9a1bc
ply; 6d952; 3.11; ./ply/3.11/x86_64-centos7-gcc11-opt; setuptools-e5403,Python-9a1bc
png; 5186a; 1.6.37; ./png/1.6.37/x86_64-centos7-gcc11-opt; zlib-8af4c
podio; 3dc0b; 00.14.01; ./podio/00.14.01/x86_64-centos7-gcc11-opt; SIO-6e311,ROOT-edd28,Python-9a1bc,PyYAML-edbb9
pooch; 76ca9; 1.6.0; ./pooch/1.6.0/x86_64-centos7-gcc11-opt; requests-1c034,setuptools_scm-e3f04,packaging-a60db,setuptools-e5403,Python-9a1bc,pip-0a3af,appdirs-abe03
postgresql; b4308; 12.2; ./postgresql/12.2/x86_64-centos7-gcc11-opt; 
pox; bcc51; 0.2.5; ./pox/0.2.5/x86_64-centos7-gcc11-opt; setuptools-e5403,Python-9a1bc
ppft; 8ee76; 1.6.4.9; ./ppft/1.6.4.9/x86_64-centos7-gcc11-opt; setuptools-e5403,Python-9a1bc,dill-6d5b4
prctl; 7512a; 1.7; ./prctl/1.7/x86_64-centos7-gcc11-opt; setuptools-e5403,Python-9a1bc
pprof; ebbe2; 54271f7; ./pprof/54271f7/x86_64-centos7-gcc11-opt; go_readline-02db8,graphviz-a682a,go_demangle-84b17,go-ff8e6
prettytable; 56e6f; 3.0.0; ./prettytable/3.0.0/x86_64-centos7-gcc11-opt; wcwidth-e6a86,setuptools_scm-e3f04,setuptools-e5403,Python-9a1bc
proj; c86df; 8.0.0; ./proj/8.0.0/x86_64-centos7-gcc11-opt; sqlite-3c47f,tiff-33276,pkg_config-c6baf
prometheus_client; 3a41e; 0.11.0; ./prometheus_client/0.11.0/x86_64-centos7-gcc11-opt; setuptools-e5403,Python-9a1bc
prompt_toolkit; 8a77a; 3.0.19; ./prompt_toolkit/3.0.19/x86_64-centos7-gcc11-opt; six-7d0d9,wcwidth-e6a86,setuptools-e5403,Python-9a1bc
protobuf; 5052d; 3.18.1; ./protobuf/3.18.1/x86_64-centos7-gcc11-opt; setuptools-e5403,Python-9a1bc
psutil; d80ca; 5.8.0; ./psutil/5.8.0/x86_64-centos7-gcc11-opt; setuptools-e5403,Python-9a1bc
ptyprocess; c1fb5; 0.7.0; ./ptyprocess/0.7.0/x86_64-centos7-gcc11-opt; setuptools-e5403,Python-9a1bc
py; 88ac3; 1.9.0; ./py/1.9.0/x86_64-centos7-gcc11-opt; setuptools_scm-e3f04,setuptools-e5403,Python-9a1bc
py4j; 4ccf9; 0.10.9.1; ./py4j/0.10.9.1/x86_64-centos7-gcc11-opt; setuptools-e5403,Python-9a1bc
pynacl; be562; 1.3.0; ./pynacl/1.3.0/x86_64-centos7-gcc11-opt; cffi-bea67,six-7d0d9,setuptools-e5403,Python-9a1bc,pycparser-86cc5
pyanalysis; 8ed2c; 2.0; ./pyanalysis/2.0/x86_64-centos7-gcc11-opt; scipy-73b9f,pytz-2631d,pyparsing-fa2b1,joblib-e567c,matplotlib-3f48d,hepdata_converter-e27a9,elasticsearch-01ad3,numpy-1af8f,numexpr-629c8,hepdata_validator-31b25,uncertainties-a6ef6,scikitlearn-00016,sympy-96503,iminuit-dc6d6
pyarrow; 54fe6; 3.0.0; ./pyarrow/3.0.0/x86_64-centos7-gcc11-opt; six-7d0d9,arrow-0aff3,cython-aa7c8,numpy-1af8f,setuptools_scm-e3f04,pkg_config-c6baf
pyasn1; 13fd7; 0.4.5; ./pyasn1/0.4.5/x86_64-centos7-gcc11-opt; setuptools-e5403,Python-9a1bc
pyasn1_modules; 4b58b; 0.2.5; ./pyasn1_modules/0.2.5/x86_64-centos7-gcc11-opt; pyasn1-13fd7,setuptools-e5403,Python-9a1bc
pybind11; 909f7; 2.6.2; ./pybind11/2.6.2/x86_64-centos7-gcc11-opt; setuptools-e5403,Python-9a1bc
pycairo; f2d43; 1.18.1; ./pycairo/1.18.1/x86_64-centos7-gcc11-opt; setuptools-e5403,Python-9a1bc,cairo-d1de8
pycodestyle; 430ab; 2.5.0; ./pycodestyle/2.5.0/x86_64-centos7-gcc11-opt; setuptools-e5403,Python-9a1bc
pycparser; 86cc5; 2.20; ./pycparser/2.20/x86_64-centos7-gcc11-opt; setuptools-e5403,Python-9a1bc
pyct; 9c01a; 0.4.6; ./pyct/0.4.6/x86_64-centos7-gcc11-opt; param-cf5a6,setuptools-e5403,Python-9a1bc
pydantic; a4a48; 1.9.0; ./pydantic/1.9.0/x86_64-centos7-gcc11-opt; cython-aa7c8,setuptools-e5403,Python-9a1bc,mypy-866b9,typing_extensions-d8149
pydot; 107bc; 1.4.1; ./pydot/1.4.1/x86_64-centos7-gcc11-opt; Python-9a1bc,pyparsing-fa2b1
pydot_ng; c4996; 2.0.0; ./pydot_ng/2.0.0/x86_64-centos7-gcc11-opt; Python-9a1bc,pyparsing-fa2b1
pyerfa; cfc38; 2.0.0.1; ./pyerfa/2.0.0.1/x86_64-centos7-gcc11-opt; numpy-1af8f,setuptools_scm-e3f04,setuptools-e5403,Python-9a1bc
pyflakes; ec6e9; 2.1.1; ./pyflakes/2.1.1/x86_64-centos7-gcc11-opt; setuptools-e5403,Python-9a1bc
pygments; 418fc; 2.9.0; ./pygments/2.9.0/x86_64-centos7-gcc11-opt; setuptools-e5403,Python-9a1bc
pygraphics; 1d9a9; 2.0; ./pygraphics/2.0/x86_64-centos7-gcc11-opt; pydot-107bc,sip-f6884,pyqt5-04aec
pygraphviz; 70d74; 1.7; ./pygraphviz/1.7/x86_64-centos7-gcc11-opt; graphviz-a682a,setuptools-e5403,Python-9a1bc
PyHEADTAIL; ad7f0; 1.14.1; ./PyHEADTAIL/1.14.1/x86_64-centos7-gcc11-opt; scipy-73b9f,cython-aa7c8,numpy-1af8f,setuptools-e5403,Python-9a1bc,h5py-eb0b3
pyhf; 4b3a2; 0.6.3; ./pyhf/0.6.3/x86_64-centos7-gcc11-opt; uproot-ea7a7,scipy-73b9f,jsonpatch-23d40,matplotlib-3f48d,torch-7c1a4,tqdm-54fb2,tensorflow_probability-4ad1b,requests-1c034,numpy-1af8f,iminuit-dc6d6,jsonschema-5e669,setuptools-e5403,Python-9a1bc,jax-dbe17,jaxlib-0fee4,tensorflow-a7d62,click-07a71
PyJWT; 0e291; 2.0.1; ./PyJWT/2.0.1/x86_64-centos7-gcc11-opt; setuptools-e5403
pylint; 60011; 2.12.2; ./pylint/2.12.2/x86_64-centos7-gcc11-opt; mccabe-55450,isort-bb154,setuptools-e5403,Python-9a1bc,astroid-af74d,platformdirs-133d7
py_lz4; ce356; 4.0.0; ./py_lz4/4.0.0/x86_64-centos7-gcc11-opt; pkgconfig-7d301,setuptools_scm-e3f04,lz4-9bdfe,setuptools-e5403,Python-9a1bc
pyparser; 74715; 1.0; ./pyparser/1.0/x86_64-centos7-gcc11-opt; setuptools-e5403,Python-9a1bc,parse-aeba7
pyparsing; fa2b1; 2.4.7; ./pyparsing/2.4.7/x86_64-centos7-gcc11-opt; setuptools-e5403,Python-9a1bc,railroad_diagrams-402da
pyqt5; 04aec; 5.12.3; ./pyqt5/5.12.3/x86_64-centos7-gcc11-opt; Qt5-cb06f,sip-f6884,Python-9a1bc
PyRDF; 234aa; 0.2.1; ./PyRDF/0.2.1/x86_64-centos7-gcc11-opt; py4j-4ccf9,ROOT-edd28,setuptools-e5403,nose-8cca8,Python-9a1bc,spark-a6809
pyrsistent; 26c9e; 0.18.0; ./pyrsistent/0.18.0/x86_64-centos7-gcc11-opt; six-7d0d9,setuptools-e5403,Python-9a1bc
pyserial; e6d49; 3.4; ./pyserial/3.4/x86_64-centos7-gcc11-opt; setuptools-e5403,Python-9a1bc
pystan; 9e2a6; 3.1.1; ./pystan/3.1.1/x86_64-centos7-gcc11-opt; charset_normalizer-ca248,wheel-0cbbc,idna-e6055,cython-aa7c8,numpy-1af8f,setuptools-e5403,Python-9a1bc,attrs-52e86,pip-0a3af,appdirs-abe03
pyshp; ed499; 2.1.0; ./pyshp/2.1.0/x86_64-centos7-gcc11-opt; setuptools-e5403
pyshtools; 34866; 4.10; ./pyshtools/4.10/x86_64-centos7-gcc11-opt; pooch-76ca9,scipy-73b9f,xarray-99b6c,matplotlib-3f48d,geos-8602e,tqdm-54fb2,requests-1c034,numpy-1af8f,fftw-cd301,setuptools-e5403,Python-9a1bc,proj-c86df,astropy-2b1cb
pytables; 705c3; 3.6.1; ./pytables/3.6.1/x86_64-centos7-gcc11-opt; cython-aa7c8,numpy-1af8f,numexpr-629c8,Python-9a1bc,hdf5-a3b1e
pytest; b9bb8; 7.0.1; ./pytest/7.0.1/x86_64-centos7-gcc11-opt; more_itertools-6198a,six-7d0d9,funcsigs-ef887,atomicwrites-1690a,toml-4fcaa,py-88ac3,packaging-a60db,setuptools-e5403,Python-9a1bc,attrs-52e86,pip-0a3af,iniconfig-00635,pluggy-45712
pytest_cov; 46617; 3.0.0; ./pytest_cov/3.0.0/x86_64-centos7-gcc11-opt; pytest-b9bb8,setuptools-e5403,Python-9a1bc
pytest_runner; c9786; 5.1; ./pytest_runner/5.1/x86_64-centos7-gcc11-opt; setuptools_scm-e3f04,setuptools-e5403,Python-9a1bc
Python; 9a1bc; 3.9.12; ./Python/3.9.12/x86_64-centos7-gcc11-opt; libffi-a3607,sqlite-3c47f
python_dateutil; 1a27e; 2.8.2; ./python_dateutil/2.8.2/x86_64-centos7-gcc11-opt; six-7d0d9,setuptools_scm-e3f04,setuptools-e5403,Python-9a1bc
python_gitlab; d9c7e; 1.8.0; ./python_gitlab/1.8.0/x86_64-centos7-gcc11-opt; six-7d0d9,requests-1c034,setuptools-e5403,Python-9a1bc
pythonsollya; f5ea7; 0.3; ./pythonsollya/0.3/x86_64-centos7-gcc11-opt; six-7d0d9,cython-aa7c8,setuptools-e5403,Python-9a1bc,pip-0a3af,mpfi-f2a84,sollya-60a5a
python_vxi11; d5a23; 0.9; ./python_vxi11/0.9/x86_64-centos7-gcc11-opt; setuptools-e5403,Python-9a1bc
pythran; b39d8; 0.11.0; ./pythran/0.11.0/x86_64-centos7-gcc11-opt; numpy-1af8f,gast-e6b5b,ply-6d952,setuptools-e5403,Python-9a1bc,pip-0a3af,beniget-cb8cb
pytools; 8d3ff; 2019.1.1; ./pytools/2019.1.1/x86_64-centos7-gcc11-opt; jupyter_core-524c6,certifi-cd51f,pyzmq-b2755,terminado-abfa7,stomppy-2dd75,requests-1c034,py-88ac3,jsonschema-5e669,ipywidgets-c5d1c,m2crypto-5f2f9,simplejson-c7ff1,pip-0a3af,mock-dee9c,urllib3-cfa90,decorator-66e77,pox-bcc51,python_gitlab-d9c7e,pathlib2-7b2b3,CouchDB-afae1,lxml-e7188,setuptools-e5403,networkx-814fe,PyYAML-edbb9,jupyter-eb185,prompt_toolkit-8a77a,mistune-1c090,Jinja2-766ba,prettytable-56e6f,ppft-8ee76,pexpect-c2150,metakernel-77208,pygments-418fc,ipython_genutils-24129,pytz-2631d,traitlets-3945c,six-7d0d9,cycler-e4db8,tornado-e7c51,jupyter_console-02e88,pytest-b9bb8,messaging-5ee4f,ipykernel-a1cca,nbconvert-754b7,nbformat-7dcb1,pandas-5abcd,jupyter_client-f080f,ptyprocess-c1fb5,python_dateutil-1a27e,singledispatch-eab42,ipython-5f199,sqlalchemy-71fde,wheel-0cbbc,notebook-7dd88,qtconsole-1fe91,simplegeneric-f2fbc,prctl-7512a,py4j-4ccf9,genshi-c0b6b,coverage-cbd70,pathos-d6299,cx_oracle-0ed37,dill-6d5b4,wcwidth-e6a86,nose-8cca8,MarkupSafe-960cd,pickleshare-8024c,chardet-85354
pytz; 2631d; 2021.1; ./pytz/2021.1/x86_64-centos7-gcc11-opt; setuptools-e5403,Python-9a1bc
pyviz_comms; 5d9ce; 2.0.1; ./pyviz_comms/2.0.1/x86_64-centos7-gcc11-opt; setuptools-e5403,Python-9a1bc
pywt; b3fe2; 1.0.3; ./pywt/1.0.3/x86_64-centos7-gcc11-opt; pillow-401bb,cython-aa7c8,numpy-1af8f,setuptools-e5403,Python-9a1bc
PyYAML; edbb9; 5.3.1; ./pyyaml/5.3.1/x86_64-centos7-gcc11-opt; setuptools-e5403,Python-9a1bc
pyzmq; b2755; 22.1.0; ./pyzmq/22.1.0/x86_64-centos7-gcc11-opt; cython-aa7c8,setuptools-e5403,Python-9a1bc,zeromq-acdd8
p7zip; a0ec1; 16.02; ./p7zip/16.02/x86_64-centos7-gcc11-opt; 
QKeras; 9e114; 0.9.0; ./QKeras/0.9.0/x86_64-centos7-gcc11-opt; keras_tuner-f1add,scipy-73b9f,tqdm-54fb2,pyparser-74715,numpy-1af8f,tensorflow_model_optimization-03345,setuptools-e5403,Python-9a1bc,scikitlearn-00016,networkx-814fe
QMtest; e4065; 2.4.1; ./QMtest/2.4.1/x86_64-centos7-gcc11-opt; Python-9a1bc
Qt5; cb06f; 5.15.2; ./qt5/5.15.2/x86_64-centos7-gcc11-opt; libxkbcommon-8c5b7,fontconfig-47540,Python-9a1bc
qtconsole; 1fe91; 4.5.1; ./qtconsole/4.5.1/x86_64-centos7-gcc11-opt; jupyter_core-524c6,Qt5-cb06f,pygments-418fc,ipython_genutils-24129,traitlets-3945c,ipykernel-a1cca,setuptools-e5403,Python-9a1bc,jupyter_client-f080f
qtpy; 0e9c1; 1.7.1; ./qtpy/1.7.1/x86_64-centos7-gcc11-opt; pyqt5-04aec,setuptools-e5403,Python-9a1bc
R; 234e4; 4.1.2; ./R/4.1.2/x86_64-centos7-gcc11-opt; pcre-5c0c1,zeromq-acdd8,zlib-8af4c,gdal-4bc45,cairo-d1de8,libgit2-98d83,proj-c86df,pkg_config-c6baf,java-80070
rangev3; 79ab4; 0.11.0; ./rangev3/0.11.0/x86_64-centos7-gcc11-opt; 
railroad_diagrams; 402da; 1.1.1; ./railroad_diagrams/1.1.1/x86_64-centos7-gcc11-opt; setuptools-e5403,Python-9a1bc
rapidjson; 0b862; 1.1.0; ./rapidjson/1.1.0/x86_64-centos7-gcc11-opt; 
readline; 2ff43; 8.0; ./readline/8.0/x86_64-centos7-gcc11-opt; 
redis; 4d995; 3.2.1; ./redis/3.2.1/x86_64-centos7-gcc11-opt; setuptools-e5403,Python-9a1bc
requests; 1c034; 2.27.1; ./requests/2.27.1/x86_64-centos7-gcc11-opt; charset_normalizer-ca248,idna-e6055,certifi-cd51f,setuptools-e5403,Python-9a1bc,urllib3-cfa90,chardet-85354
requests_gssapi; 161a7; 1.2.3; ./requests_gssapi/1.2.3/x86_64-centos7-gcc11-opt; requests-1c034,gssapi-634ea,setuptools-e5403,Python-9a1bc
requests_oauthlib; 5c557; 1.2.0; ./requests_oauthlib/1.2.0/x86_64-centos7-gcc11-opt; oauthlib-a62dd,requests-1c034,setuptools-e5403,Python-9a1bc
requests_unixsocket; de294; 0.2.0; ./requests_unixsocket/0.2.0/x86_64-centos7-gcc11-opt; requests-1c034,pbr-8123e,setuptools-e5403,Python-9a1bc,urllib3-cfa90
retrying; 998f8; 1.3.3; ./retrying/1.3.3/x86_64-centos7-gcc11-opt; six-7d0d9,Python-9a1bc
rich; 8c4f5; 12.0.0; ./rich/12.0.0/x86_64-centos7-gcc11-opt; commonmark-1dc73,setuptools-e5403,Python-9a1bc
rise; bda25; 5.5.0; ./rise/5.5.0/x86_64-centos7-gcc11-opt; jupyter_core-524c6,ipython_genutils-24129,notebook-7dd88,traitlets-3945c,decorator-66e77,tornado-e7c51,setuptools-e5403,Python-9a1bc
rq; b3d8f; 1.10.1; ./rq/1.10.1/x86_64-centos7-gcc11-opt; redis-4d995,click-07a71,setuptools-e5403,Python-9a1bc
rsa; 3df98; 4.0; ./rsa/4.0/x86_64-centos7-gcc11-opt; pyasn1-13fd7,setuptools-e5403,Python-9a1bc
ruamel_yaml; e6b47; 0.17.16; ./ruamel_yaml/0.17.16/x86_64-centos7-gcc11-opt; setuptools-e5403,Python-9a1bc
s3transfer; 02c48; 0.5.0; ./s3transfer/0.5.0/x86_64-centos7-gcc11-opt; botocore-2611e,setuptools-e5403,Python-9a1bc
scandir; c95b2; 1.10.0; ./scandir/1.10.0/x86_64-centos7-gcc11-opt; setuptools-e5403,Python-9a1bc
scikitbuild; 40b6d; 0.13.1; ./scikitbuild/0.13.1/x86_64-centos7-gcc11-opt; wheel-0cbbc,distro-e0efe,packaging-a60db,setuptools-e5403,Python-9a1bc
scikitimage; 9641c; 0.14.3; ./scikitimage/0.14.3/x86_64-centos7-gcc11-opt; pillow-401bb,scipy-73b9f,imageio-93b36,cython-aa7c8,matplotlib-3f48d,numpy-1af8f,setuptools-e5403,Python-9a1bc,networkx-814fe,pywt-b3fe2
scikitlearn; 00016; 0.24.2; ./scikitlearn/0.24.2/x86_64-centos7-gcc11-opt; scipy-73b9f,cython-aa7c8,joblib-e567c,threadpoolctl-2ad4b,numpy-1af8f,Python-9a1bc
scipy; 73b9f; 1.8.0; ./scipy/1.8.0/x86_64-centos7-gcc11-opt; pybind11-909f7,numpy-1af8f,pythran-b39d8,setuptools-e5403,Python-9a1bc,pip-0a3af
seaborn; 98995; 0.11.2; ./seaborn/0.11.2/x86_64-centos7-gcc11-opt; statsmodels-3d365,scipy-73b9f,matplotlib-3f48d,numpy-1af8f,setuptools-e5403,Python-9a1bc,pandas-5abcd
send2trash; 2bd40; 1.7.1; ./send2trash/1.7.1/x86_64-centos7-gcc11-opt; setuptools-e5403,Python-9a1bc
setuptools; e5403; 57.1.0; ./setuptools/57.1.0/x86_64-centos7-gcc11-opt; Python-9a1bc
setuptools_scm; e3f04; 6.4.2; ./setuptools_scm/6.4.2/x86_64-centos7-gcc11-opt; packaging-a60db,setuptools-e5403,Python-9a1bc,tomli-cd2c0
shapely; c9751; 1.7.1; ./shapely/1.7.1/x86_64-centos7-gcc11-opt; cython-aa7c8,geos-8602e,numpy-1af8f,setuptools-e5403,Python-9a1bc
simdjson; bb0c1; 0.9.2; ./simdjson/0.9.2/x86_64-centos7-gcc11-opt; 
simplegeneric; f2fbc; 0.8.1; ./simplegeneric/0.8.1/x86_64-centos7-gcc11-opt; setuptools-e5403,Python-9a1bc
simplejson; c7ff1; 3.16.1; ./simplejson/3.16.1/x86_64-centos7-gcc11-opt; setuptools-e5403,Python-9a1bc
singledispatch; eab42; 3.4.0.3; ./singledispatch/3.4.0.3/x86_64-centos7-gcc11-opt; six-7d0d9,setuptools-e5403,Python-9a1bc
sip; f6884; 4.19.15; ./sip/4.19.15/x86_64-centos7-gcc11-opt; Python-9a1bc
six; 7d0d9; 1.16.0; ./six/1.16.0/x86_64-centos7-gcc11-opt; setuptools-e5403,Python-9a1bc
snappy; 28a75; 1.1.7; ./snappy/1.1.7/x86_64-centos7-gcc11-opt; 
sniffio; e93f3; 1.2.0; ./sniffio/1.2.0/x86_64-centos7-gcc11-opt; pip-0a3af,setuptools-e5403,Python-9a1bc
snowballstemmer; 65b6e; 2.1.0; ./snowballstemmer/2.1.0/x86_64-centos7-gcc11-opt; setuptools-e5403,Python-9a1bc
sollya; 60a5a; 7.0; ./sollya/7.0/x86_64-centos7-gcc11-opt; libxml2-9cd93,mpfi-f2a84,fplll-5b7ab,mpfr-61226
sortedcontainers; f9052; 2.1.0; ./sortedcontainers/2.1.0/x86_64-centos7-gcc11-opt; setuptools-e5403,Python-9a1bc
spark; a6809; 3.2.1-cern1; ./spark/3.2.1-cern1/x86_64-centos7-gcc11-opt; hadoop-bcb29,Python-9a1bc
spdlog; 15a38; 1.9.2; ./spdlog/1.9.2/x86_64-centos7-gcc11-opt; 
sphinx; b7350; 4.2.0; ./sphinx/4.2.0/x86_64-centos7-gcc11-opt; sphinxcontrib_serializinghtml-1aaee,sphinxcontrib_jsmath-eb6c4,pygments-418fc,six-7d0d9,sphinxcontrib_applehelp-403d0,sphinxcontrib_qthelp-2408d,sphinxcontrib_htmlhelp-83488,requests-1c034,imagesize-c11f5,snowballstemmer-65b6e,docutils-1dbbd,setuptools-e5403,Python-9a1bc,babel-00a2a,packaging-a60db,sphinxcontrib_devhelp-38b5a,Jinja2-766ba,alabaster-0c265
sphinxcontrib_applehelp; 403d0; 1.0.2; ./sphinxcontrib_applehelp/1.0.2/x86_64-centos7-gcc11-opt; setuptools-e5403,Python-9a1bc
sphinxcontrib_devhelp; 38b5a; 1.0.2; ./sphinxcontrib_devhelp/1.0.2/x86_64-centos7-gcc11-opt; setuptools-e5403,Python-9a1bc
sphinxcontrib_htmlhelp; 83488; 2.0.0; ./sphinxcontrib_htmlhelp/2.0.0/x86_64-centos7-gcc11-opt; setuptools-e5403,Python-9a1bc
sphinxcontrib_jsmath; eb6c4; 1.0.1; ./sphinxcontrib_jsmath/1.0.1/x86_64-centos7-gcc11-opt; setuptools-e5403,Python-9a1bc
sphinxcontrib_qthelp; 2408d; 1.0.3; ./sphinxcontrib_qthelp/1.0.3/x86_64-centos7-gcc11-opt; setuptools-e5403,Python-9a1bc
sphinxcontrib_serializinghtml; 1aaee; 1.1.5; ./sphinxcontrib_serializinghtml/1.1.5/x86_64-centos7-gcc11-opt; setuptools-e5403,Python-9a1bc
sphinx_rtd_theme; ddba1; 0.5.1; ./sphinx_rtd_theme/0.5.1/x86_64-centos7-gcc11-opt; pygments-418fc,six-7d0d9,requests-1c034,imagesize-c11f5,snowballstemmer-65b6e,docutils-1dbbd,setuptools-e5403,Python-9a1bc,babel-00a2a,packaging-a60db,Jinja2-766ba,alabaster-0c265
sqlalchemy; 71fde; 1.2.10; ./sqlalchemy/1.2.10/x86_64-centos7-gcc11-opt; setuptools-e5403,Python-9a1bc
sqlite; 3c47f; 3320300; ./sqlite/3320300/x86_64-centos7-gcc11-opt; 
statsmodels; 3d365; 0.13.2; ./statsmodels/0.13.2/x86_64-centos7-gcc11-opt; ipython-5f199,scipy-73b9f,cython-aa7c8,matplotlib-3f48d,patsy-094ff,numpy-1af8f,setuptools-e5403,Python-9a1bc,nose-8cca8,pandas-5abcd
stevedore; 57596; 3.3.0; ./stevedore/3.3.0/x86_64-centos7-gcc11-opt; pbr-8123e,setuptools-e5403,Python-9a1bc
stomppy; 2dd75; 6.1.0; ./stomppy/6.1.0/x86_64-centos7-gcc11-opt; docopt-7fd49,setuptools-e5403,Python-9a1bc
storm; 8380c; 0.23; ./storm/0.23/x86_64-centos7-gcc11-opt; setuptools-e5403,Python-9a1bc
suitesparse; 65832; 5.10.1; ./suitesparse/5.10.1/x86_64-centos7-gcc11-opt; blas-6339b,mpfr-61226
swig; 18ec1; 4.0.2; ./swig/4.0.2/x86_64-centos7-gcc11-opt; Boost-e77cf,pcre-5c0c1,Python-9a1bc
sympy; 96503; 1.8; ./sympy/1.8/x86_64-centos7-gcc11-opt; setuptools-e5403,Python-9a1bc
synr; b6cb4; 0.5.0; ./synr/0.5.0/x86_64-centos7-gcc11-opt; setuptools-e5403,Python-9a1bc
SIO; 6e311; 00.01.00; ./SIO/00.01.00/x86_64-centos7-gcc11-opt; zlib-8af4c
tabulate; 7edcf; 0.8.9; ./tabulate/0.8.9/x86_64-centos7-gcc11-opt; setuptools-e5403,Python-9a1bc
tbb; adcbe; 2020_U2; ./tbb/2020_U2/x86_64-centos7-gcc11-opt; 
tblib; 9e102; 1.7.0; ./tblib/1.7.0/x86_64-centos7-gcc11-opt; setuptools-e5403,Python-9a1bc
tensorflow; a7d62; 2.8.0; ./tensorflow/2.8.0/x86_64-centos7-gcc11-opt; wheel-0cbbc,tensorflow_estimator-d5f25,six-7d0d9,absl_py-a991e,wrapt-08b78,numpy-1af8f,keras_applications-135bc,tensorboard-cdc81,opt_einsum-14fa7,setuptools-e5403,Python-9a1bc,pip-0a3af,mock-dee9c,astunparse-9f38b,keras_preprocessing-100bc
tensorflow_estimator; d5f25; 2.8.0; ./tensorflow_estimator/2.8.0/x86_64-centos7-gcc11-opt; wheel-0cbbc,six-7d0d9,absl_py-a991e,termcolor-9ff2d,astor-47d05,funcsigs-ef887,numpy-1af8f,setuptools-e5403,Python-9a1bc,pip-0a3af,mock-dee9c,gast-e6b5b
tensorboard; cdc81; 2.8.0; ./tensorboard/2.8.0/x86_64-centos7-gcc11-opt; wheel-0cbbc,markdown-781da,six-7d0d9,absl_py-a991e,grpcio-4cf61,numpy-1af8f,google_auth_oauthlib-6de3a,setuptools-e5403,Python-9a1bc,pip-0a3af,mock-dee9c,werkzeug-db345
tensorboard_plugin_wit; ec610; 1.8.1; ./tensorboard_plugin_wit/1.8.1/x86_64-centos7-gcc11-opt; wheel-0cbbc,tensorboard-cdc81,setuptools-e5403,Python-9a1bc,pip-0a3af,tensorflow-a7d62
tensorflow_model_optimization; 03345; 0.7.0; ./tensorflow_model_optimization/0.7.0/x86_64-centos7-gcc11-opt; six-7d0d9,numpy-1af8f,setuptools-e5403,Python-9a1bc,dm_tree-e0e99
termcolor; 9ff2d; 1.1.0; ./termcolor/1.1.0/x86_64-centos7-gcc11-opt; setuptools-e5403,Python-9a1bc
tensorflow_probability; 4ad1b; 0.16.0; ./tensorflow_probability/0.16.0/x86_64-centos7-gcc11-opt; six-7d0d9,absl_py-a991e,decorator-66e77,cloudpickle-cdcb0,numpy-1af8f,setuptools-e5403,Python-9a1bc,dm_tree-e0e99,gast-e6b5b
terminado; abfa7; 0.10.1; ./terminado/0.10.1/x86_64-centos7-gcc11-opt; tornado-e7c51,ptyprocess-c1fb5,setuptools-e5403,Python-9a1bc
testpath; 07e51; 0.5.0; ./testpath/0.5.0/x86_64-centos7-gcc11-opt; setuptools-e5403,Python-9a1bc
texinfo; 21d20; 6.3; ./texinfo/6.3/x86_64-centos7-gcc11-opt; 
tfs_pandas; ba3e0; 3.1.0; ./tfs_pandas/3.1.0/x86_64-centos7-gcc11-opt; numpy-1af8f,pandas-5abcd,setuptools-e5403,Python-9a1bc
theano; 6df53; 1.0.5; ./theano/1.0.5/x86_64-centos7-gcc11-opt; pygments-418fc,scipy-73b9f,six-7d0d9,pydot-107bc,pydot_ng-c4996,numpy-1af8f,graphviz-a682a,nose-8cca8
threadpoolctl; 2ad4b; 2.2.0; ./threadpoolctl/2.2.0/x86_64-centos7-gcc11-opt; Python-9a1bc
thrift; 9ed86; 0.13.0; ./thrift/0.13.0/x86_64-centos7-gcc11-opt; Boost-e77cf,bison-929f9,flex-4c6ad,pkg_config-c6baf
tiff; 33276; 4.2.0; ./tiff/4.2.0/x86_64-centos7-gcc11-opt; 
toml; 4fcaa; 0.10.2; ./toml/0.10.2/x86_64-centos7-gcc11-opt; setuptools-e5403,Python-9a1bc
tomli; cd2c0; 2.0.1; ./tomli/2.0.1/x86_64-centos7-gcc11-opt; pip-0a3af,Python-9a1bc
tomlkit; 0d0cb; 0.7.2; ./tomlkit/0.7.2/x86_64-centos7-gcc11-opt; setuptools-e5403,Python-9a1bc
toolz; 6f659; 0.9.0; ./toolz/0.9.0/x86_64-centos7-gcc11-opt; setuptools-e5403,Python-9a1bc
torch; 7c1a4; 1.11.0; ./torch/1.11.0/x86_64-centos7-gcc11-opt; cffi-bea67,blas-6339b,numpy-1af8f,setuptools-e5403,Python-9a1bc,PyYAML-edbb9,CMake-790a8,ninja-d608d,typing_extensions-d8149
torchvision; 8da07; 0.12.0; ./torchvision/0.12.0/x86_64-centos7-gcc11-opt; torch-7c1a4,pillow-401bb,six-7d0d9,typing_extensions-d8149
tornado; e7c51; 6.1; ./tornado/6.1/x86_64-centos7-gcc11-opt; certifi-cd51f,setuptools-e5403,Python-9a1bc
tqdm; 54fb2; 4.61.2; ./tqdm/4.61.2/x86_64-centos7-gcc11-opt; pip-0a3af,setuptools-e5403,Python-9a1bc
traitlets; 3945c; 5.0.5; ./traitlets/5.0.5/x86_64-centos7-gcc11-opt; ipython_genutils-24129,six-7d0d9,decorator-66e77,setuptools-e5403,Python-9a1bc
traittypes; a6528; 0.2.1; ./traittypes/0.2.1/x86_64-centos7-gcc11-opt; setuptools-e5403,Python-9a1bc
tricktrack; 829d0; 1.0.9; ./tricktrack/1.0.9/x86_64-centos7-gcc11-opt; eigen-642a5
typed_ast; 54f29; 1.5.3; ./typed_ast/1.5.3/x86_64-centos7-gcc11-opt; setuptools-e5403,Python-9a1bc
typeguard; 19686; 2.7.0; ./typeguard/2.7.0/x86_64-centos7-gcc11-opt; setuptools_scm-e3f04
typing_extensions; d8149; 3.10.0.2; ./typing_extensions/3.10.0.2/x86_64-centos7-gcc11-opt; setuptools-e5403,Python-9a1bc
tzlocal; a22ef; 2.0.0; ./tzlocal/2.0.0/x86_64-centos7-gcc11-opt; pytz-2631d,setuptools-e5403,Python-9a1bc
uhi; 0b0d0; 0.3.0; ./uhi/0.3.0/x86_64-centos7-gcc11-opt; numpy-1af8f,setuptools-e5403,Python-9a1bc
umesimd; ae895; 0.8.1; ./umesimd/0.8.1/x86_64-centos7-gcc11-opt; 
uncertainties; a6ef6; 3.1.2; ./uncertainties/3.1.2/x86_64-centos7-gcc11-opt; numpy-1af8f,setuptools-e5403,Python-9a1bc
unigen; 82f54; 2.2; ./unigen/2.2/x86_64-centos7-gcc11-opt; ROOT-edd28
upandas; 8b659; 0.2.0; ./upandas/0.2.0/x86_64-centos7-gcc11-opt; pandas-5abcd,uncertainties-a6ef6
uproot; ea7a7; 4.2.0; ./uproot/4.2.0/x86_64-centos7-gcc11-opt; numpy-1af8f,xrootd-4d6ee,awkward-c4392
uproot3; 4216f; 3.14.2; ./uproot3/3.14.2/x86_64-centos7-gcc11-opt; numpy-1af8f,cachetools-08f48,uproot3_methods-15a08,awkward0-b1a40
uproot3_methods; 15a08; 0.10.0; ./uproot3_methods/0.10.0/x86_64-centos7-gcc11-opt; numpy-1af8f
urllib3; cfa90; 1.26.6; ./urllib3/1.26.6/x86_64-centos7-gcc11-opt; setuptools-e5403,Python-9a1bc
valgrind; 54639; 3.19.0; ./valgrind/3.19.0/x86_64-centos7-gcc11-opt; 
qcachegrind; e3f82; 20.12.1; ./qcachegrind/20.12.1/x86_64-centos7-gcc11-opt; Qt5-cb06f,valgrind-54639
Vc; 57098; 1.4.3; ./Vc/1.4.3/x86_64-centos7-gcc11-opt; 
vcversioner; 7feb9; 2.16.0.0; ./vcversioner/2.16.0.0/x86_64-centos7-gcc11-opt; setuptools-e5403,Python-9a1bc
vdt; 7622c; 0.4.3; ./vdt/0.4.3/x86_64-centos7-gcc11-opt; Python-9a1bc
veccore; b5c00; 0.8.0; ./veccore/0.8.0/x86_64-centos7-gcc11-opt; umesimd-ae895,Vc-57098
VecGeom; 2ed33; 1.1.18; ./VecGeom/1.1.18/x86_64-centos7-gcc11-opt; veccore-b5c00,Vc-57098,XercesC-714f6
vector; c1a82; 0.8.5; ./vector/0.8.5/x86_64-centos7-gcc11-opt; numpy-1af8f,packaging-a60db,setuptools-e5403,Python-9a1bc
vectorclass; cdfdb; 2.01.02; ./vectorclass/2.01.02/x86_64-centos7-gcc11-opt; 
virtualenv; 9f71c; 20.4.3; ./virtualenv/20.4.3/x86_64-centos7-gcc11-opt; six-7d0d9,filelock-0a5b2,distlib-8da0d,setuptools-e5403,Python-9a1bc,pip-0a3af,appdirs-abe03
virtualenv_clone; 07189; 0.5.4; ./virtualenv_clone/0.5.4/x86_64-centos7-gcc11-opt; setuptools-e5403,Python-9a1bc
virtualenvwrapper; 070d7; 4.8.4; ./virtualenvwrapper/4.8.4/x86_64-centos7-gcc11-opt; virtualenv_clone-07189,virtualenv-9f71c,setuptools-e5403,Python-9a1bc,stevedore-57596
watchdog; 18a9c; 2.1.7; ./watchdog/2.1.7/x86_64-centos7-gcc11-opt; setuptools-e5403,Python-9a1bc
wcwidth; e6a86; 0.2.5; ./wcwidth/0.2.5/x86_64-centos7-gcc11-opt; setuptools-e5403,Python-9a1bc
webencodings; e17ab; 0.5.1; ./webencodings/0.5.1/x86_64-centos7-gcc11-opt; setuptools-e5403,Python-9a1bc
websocket_client; b2848; 1.1.0; ./websocket_client/1.1.0/x86_64-centos7-gcc11-opt; six-7d0d9,setuptools-e5403,Python-9a1bc
werkzeug; db345; 0.15.4; ./werkzeug/0.15.4/x86_64-centos7-gcc11-opt; setuptools-e5403,Python-9a1bc
wheel; 0cbbc; 0.37.1; ./wheel/0.37.1/x86_64-centos7-gcc11-opt; setuptools-e5403,Python-9a1bc
widgetsnbextension; d2f83; 3.5.1; ./widgetsnbextension/3.5.1/x86_64-centos7-gcc11-opt; jupyter_core-524c6,ipython_genutils-24129,notebook-7dd88,traitlets-3945c,decorator-66e77,tornado-e7c51,setuptools-e5403,Python-9a1bc
wrapt; 08b78; 1.13.3; ./wrapt/1.13.3/x86_64-centos7-gcc11-opt; setuptools-e5403,Python-9a1bc
xapian; 04e2c; 1.4.18; ./xapian/1.4.18/x86_64-centos7-gcc11-opt; 
xarray; 99b6c; 2022.3.0; ./xarray/2022.3.0/x86_64-centos7-gcc11-opt; numpy-1af8f,packaging-a60db,setuptools-e5403,Python-9a1bc,pandas-5abcd
xenv; dc586; 1.0.0; ./xenv/1.0.0/x86_64-centos7-gcc11-opt; nose-8cca8,setuptools_scm-e3f04,Python-9a1bc
XercesC; 714f6; 3.2.3; ./XercesC/3.2.3/x86_64-centos7-gcc11-opt; 
xgboost; c54cb; 0.90; ./xgboost/0.90/x86_64-centos7-gcc11-opt; numpy-1af8f,scipy-73b9f,setuptools-e5403,Python-9a1bc
xqilla; c5cd1; 2.3.4; ./xqilla/2.3.4/x86_64-centos7-gcc11-opt; XercesC-714f6
xlrd; d22e2; 2.0.1; ./xlrd/2.0.1/x86_64-centos7-gcc11-opt; setuptools-e5403,Python-9a1bc
xrootd; 4d6ee; 5.4.2; ./xrootd/5.4.2/x86_64-centos7-gcc11-opt; libxml2-9cd93,zlib-8af4c,Python-9a1bc
yamlcpp; d05b2; 0.6.3; ./yamlcpp/0.6.3/x86_64-centos7-gcc11-opt; 
zeromq; acdd8; 4.3.4; ./zeromq/4.3.4/x86_64-centos7-gcc11-opt; libsodium-0b20d,pkg_config-c6baf
zict; 3c85d; 0.1.4; ./zict/0.1.4/x86_64-centos7-gcc11-opt; HeapDict-6e185,setuptools-e5403,Python-9a1bc
zipp; 11675; 0.5.1; ./zipp/0.5.1/x86_64-centos7-gcc11-opt; setuptools_scm-e3f04,setuptools-e5403,Python-9a1bc
zlib; 8af4c; 1.2.11; ./zlib/1.2.11/x86_64-centos7-gcc11-opt; 
zstandard; b8d5c; 0.14.0; ./zstandard/0.14.0/x86_64-centos7-gcc11-opt; cffi-bea67,setuptools-e5403,Python-9a1bc
OWSLib; a547e; 0.17.1; ./OWSLib/0.17.1/x86_64-centos7-gcc11-opt; pytz-2631d,requests-1c034,lxml-e7188,pyproj-7da09,setuptools-e5403,Python-9a1bc,python_dateutil-1a27e
pyproj; 7da09; 3.0.1; ./pyproj/3.0.1/x86_64-centos7-gcc11-opt; cython-aa7c8,setuptools-e5403,Python-9a1bc,proj-c86df
libunwind; 2fa0a; 1.3.1; ./libunwind/1.3.1/x86_64-centos7-gcc11-opt; 
igprof; 01485; 5.9.16; ./igprof/5.9.16/x86_64-centos7-gcc11-opt; libunwind-2fa0a
neurobayes; e06fd; 3.7.0; ./neurobayes/3.7.0/x86_64-centos7-gcc11-opt; 
neurobayes_expert; d587a; 3.7.0; ./neurobayes_expert/3.7.0/x86_64-centos7-gcc11-opt; 
ROOT; edd28; 6.26.04; ./ROOT/6.26.04/x86_64-centos7-gcc11-opt; xrootd-4d6ee,protobuf-5052d,dcap-cdd28,tbb-adcbe,jsonmcpp-f26c3,blas-6339b,fftw-cd301,vdt-7622c,oracle-69dfe,gfal-6fc75,GSL-30ba4,srm_ifce-be254,libxml2-9cd93,Davix-c8740,zlib-8af4c,Vc-57098,mysql-2fdf3,cfitsio-e4bb8,numpy-1af8f,gl2ps-2afdb,Python-9a1bc
dcap; cdd28; 2.47.7-1; ./Grid/dcap/2.47.7-1/x86_64-centos7-gcc11-opt; 
gfal; 6fc75; 1.13.0-0; ./Grid/gfal/1.13.0-0/x86_64-centos7-gcc11-opt; 
srm_ifce; be254; 1.13.0-0; ./Grid/srm-ifce/1.13.0-0/x86_64-centos7-gcc11-opt; 
