{ 
   "MC_2016_MagDown": {
        "options": ["options/mc_ntuple_options_mue_nostripping_md.py"],
        "bookkeeping_path": "/MC/2016/Beam6500GeV-2016-MagDown-Nu1.6-25ns-Pythia8/Sim09b/Trig0x6138160F/Reco16/Turbo03/Stripping26NoPrescalingFlagged/12113063/ALLSTREAMS.DST",
        "dq_flag": "ALL",
        "application": "DaVinci",
        "application_version": "v45r3",
        "output_type": "RD_B2MUEPI_DVNTUPLE_MC_MD_2016.ROOT"
    },
    "MC_2016_MagUp": {
        "options": ["options/mc_ntuple_options_mue_nostripping_mu.py"],
        "bookkeeping_path": "/MC/2016/Beam6500GeV-2016-MagUp-Nu1.6-25ns-Pythia8/Sim09b/Trig0x6138160F/Reco16/Turbo03/Stripping26NoPrescalingFlagged/12113063/ALLSTREAMS.DST",
        "dq_flag": "ALL",
        "application": "DaVinci",
        "application_version": "v45r3",
        "output_type": "RD_B2MUEPI_DVNTUPLE_MC_MU_2016.ROOT"
    }
}

