{
    
    "2016_MagDown": {
	"options": ["DataType-2016.py","KPiPiLep_options.py"],
	"bookkeeping_path": "/LHCb/Collision16/Beam6500GeV-VeloClosed-MagDown/Real Data/Reco16/Stripping28r2/90000000/CHARMCOMPLETEEVENT.DST",
	"dq_flag": "OK",
	"application": "DaVinci",
	"application_version": "v45r2",
	"output_type": "D2KPIPIMUNU_NTUPLE.ROOT"
    },
    "2016_MagUp": {
	"options": ["DataType-2016.py","KPiPiLep_options.py"],
	"bookkeeping_path": "/LHCb/Collision16/Beam6500GeV-VeloClosed-MagUp/Real Data/Reco16/Stripping28r2/90000000/CHARMCOMPLETEEVENT.DST",
	"dq_flag": "OK",
	"application": "DaVinci",
	"application_version": "v45r2",
	"output_type": "D2KPIPIMUNU_NTUPLE.ROOT"
    },


    "2015_MagDown": {
	"options": ["DataType-2015.py","KPiPiLep_options.py"],
	"bookkeeping_path": "/LHCb/Collision15/Beam6500GeV-VeloClosed-MagDown/Real Data/Reco15a/Stripping24r2/90000000/CHARMCOMPLETEEVENT.DST",
	"dq_flag": "OK",
	"application": "DaVinci",
	"application_version": "v45r2",
	"output_type": "D2KPIPIMUNU_NTUPLE.ROOT"
    },
    "2015_MagUp": {
	"options": ["DataType-2015.py","KPiPiLep_options.py"],
	"bookkeeping_path": "/LHCb/Collision15/Beam6500GeV-VeloClosed-MagUp/Real Data/Reco15a/Stripping24r2/90000000/CHARMCOMPLETEEVENT.DST",
	"dq_flag": "OK",
	"application": "DaVinci",
	"application_version": "v45r2",
	"output_type": "D2KPIPIMUNU_NTUPLE.ROOT"
    }
}
