<svg xmlns="http://www.w3.org/2000/svg" width="32" height="32" viewBox="0 0 32 32">
  <circle cx="16" cy="8" r="4" fill="#1f78b4"/>
  <circle cx="24" cy="24" r="4" fill="#e31a1c"/>
  <circle cx="8" cy="24" r="4" fill="#33a02c"/>

  <path d="M16 8 Q20 16, 24 24" stroke="#1f78b4" stroke-width="1" fill="none"/>
  <path d="M16 8 Q12 16, 8 24" stroke="#1f78b4" stroke-width="1" fill="none"/>
  <path d="M24 24 Q20 20, 16 8" stroke="#e31a1c" stroke-width="1" fill="none"/>
  <path d="M24 24 Q16 24, 8 24" stroke="#e31a1c" stroke-width="1" fill="none"/>
  <path d="M8 24 Q12 20, 16 8" stroke="#33a02c" stroke-width="1" fill="none"/>
  <path d="M8 24 Q16 24, 24 24" stroke="#33a02c" stroke-width="1" fill="none"/>
</svg>