{
  "object_kind": "merge_request",
  "event_type": "merge_request",
  "user": {
    "id": 199,
    "name": "Chris Burr",
    "username": "cburr",
    "avatar_url": "https://gitlab.cern.ch/uploads/-/system/user/avatar/199/avatar.png",
    "email": "[REDACTED]"
  },
  "project": {
    "id": 148168,
    "name": "test-repo",
    "description": "Repository used by LbAPI's CI",
    "web_url": "https://gitlab.cern.ch/lhcb-dpa/analysis-productions/test-repo",
    "avatar_url": null,
    "git_ssh_url": "ssh://git@gitlab.cern.ch:7999/lhcb-dpa/analysis-productions/test-repo.git",
    "git_http_url": "https://gitlab.cern.ch/lhcb-dpa/analysis-productions/test-repo.git",
    "namespace": "Analysis Productions",
    "visibility_level": 20,
    "path_with_namespace": "lhcb-dpa/analysis-productions/test-repo",
    "default_branch": "main",
    "ci_config_path": "",
    "homepage": "https://gitlab.cern.ch/lhcb-dpa/analysis-productions/test-repo",
    "url": "ssh://git@gitlab.cern.ch:7999/lhcb-dpa/analysis-productions/test-repo.git",
    "ssh_url": "ssh://git@gitlab.cern.ch:7999/lhcb-dpa/analysis-productions/test-repo.git",
    "http_url": "https://gitlab.cern.ch/lhcb-dpa/analysis-productions/test-repo.git"
  },
  "object_attributes": {
    "assignee_id": null,
    "author_id": 199,
    "created_at": "2024-03-24 16:40:58 +0100",
    "description": "",
    "draft": true,
    "head_pipeline_id": 7150806,
    "id": 651922,
    "iid": 23,
    "last_edited_at": null,
    "last_edited_by_id": null,
    "merge_commit_sha": null,
    "merge_error": null,
    "merge_params": {
      "force_remove_source_branch": "1"
    },
    "merge_status": "unchecked",
    "merge_user_id": null,
    "merge_when_pipeline_succeeds": false,
    "milestone_id": null,
    "source_branch": "ana-prod-test",
    "source_project_id": 148168,
    "state_id": 1,
    "target_branch": "main",
    "target_project_id": 148168,
    "time_estimate": 0,
    "title": "Draft: [AP] Add D02HH_Starterkit production",
    "updated_at": "2024-04-01 11:46:05 +0200",
    "updated_by_id": null,
    "url": "https://gitlab.cern.ch/lhcb-dpa/analysis-productions/test-repo/-/merge_requests/23",
    "source": {
      "id": 148168,
      "name": "test-repo",
      "description": "Repository used by LbAPI's CI",
      "web_url": "https://gitlab.cern.ch/lhcb-dpa/analysis-productions/test-repo",
      "avatar_url": null,
      "git_ssh_url": "ssh://git@gitlab.cern.ch:7999/lhcb-dpa/analysis-productions/test-repo.git",
      "git_http_url": "https://gitlab.cern.ch/lhcb-dpa/analysis-productions/test-repo.git",
      "namespace": "Analysis Productions",
      "visibility_level": 20,
      "path_with_namespace": "lhcb-dpa/analysis-productions/test-repo",
      "default_branch": "main",
      "ci_config_path": "",
      "homepage": "https://gitlab.cern.ch/lhcb-dpa/analysis-productions/test-repo",
      "url": "ssh://git@gitlab.cern.ch:7999/lhcb-dpa/analysis-productions/test-repo.git",
      "ssh_url": "ssh://git@gitlab.cern.ch:7999/lhcb-dpa/analysis-productions/test-repo.git",
      "http_url": "https://gitlab.cern.ch/lhcb-dpa/analysis-productions/test-repo.git"
    },
    "target": {
      "id": 148168,
      "name": "test-repo",
      "description": "Repository used by LbAPI's CI",
      "web_url": "https://gitlab.cern.ch/lhcb-dpa/analysis-productions/test-repo",
      "avatar_url": null,
      "git_ssh_url": "ssh://git@gitlab.cern.ch:7999/lhcb-dpa/analysis-productions/test-repo.git",
      "git_http_url": "https://gitlab.cern.ch/lhcb-dpa/analysis-productions/test-repo.git",
      "namespace": "Analysis Productions",
      "visibility_level": 20,
      "path_with_namespace": "lhcb-dpa/analysis-productions/test-repo",
      "default_branch": "main",
      "ci_config_path": "",
      "homepage": "https://gitlab.cern.ch/lhcb-dpa/analysis-productions/test-repo",
      "url": "ssh://git@gitlab.cern.ch:7999/lhcb-dpa/analysis-productions/test-repo.git",
      "ssh_url": "ssh://git@gitlab.cern.ch:7999/lhcb-dpa/analysis-productions/test-repo.git",
      "http_url": "https://gitlab.cern.ch/lhcb-dpa/analysis-productions/test-repo.git"
    },
    "last_commit": {
      "id": "1573aba28b7a13a1a36897d3510754289f28fd0d",
      "message": "Fix wrong key name\n",
      "title": "Fix wrong key name",
      "timestamp": "2024-04-01T11:46:00+02:00",
      "url": "https://gitlab.cern.ch/lhcb-dpa/analysis-productions/test-repo/-/commit/1573aba28b7a13a1a36897d3510754289f28fd0d",
      "author": {
        "name": "Chris Burr",
        "email": "[REDACTED]"
      }
    },
    "work_in_progress": true,
    "total_time_spent": 0,
    "time_change": 0,
    "human_total_time_spent": null,
    "human_time_change": null,
    "human_time_estimate": null,
    "assignee_ids": [

    ],
    "reviewer_ids": [

    ],
    "labels": [

    ],
    "state": "opened",
    "blocking_discussions_resolved": true,
    "first_contribution": false,
    "detailed_merge_status": "unchecked",
    "action": "update",
    "oldrev": "5a95b3b38e83ccd4138762625d56de70894aa0eb"
  },
  "labels": [

  ],
  "changes": {
    "updated_at": {
      "previous": "2024-04-01 10:48:15 +0200",
      "current": "2024-04-01 11:46:05 +0200"
    }
  },
  "repository": {
    "name": "test-repo",
    "url": "ssh://git@gitlab.cern.ch:7999/lhcb-dpa/analysis-productions/test-repo.git",
    "description": "Repository used by LbAPI's CI",
    "homepage": "https://gitlab.cern.ch/lhcb-dpa/analysis-productions/test-repo"
  }
}
