{
  "object_kind": "merge_request",
  "event_type": "merge_request",
  "user": {
    "id": 20156,
    "name": "Ryunosuke O'Neil",
    "username": "roneil",
    "avatar_url": "https://gitlab.cern.ch/uploads/-/system/user/avatar/20156/avatar.png",
    "email": "[REDACTED]"
  },
  "project": {
    "id": 148168,
    "name": "test-repo",
    "description": "Repository used by LbAPI's CI",
    "web_url": "https://gitlab.cern.ch/lhcb-dpa/analysis-productions/test-repo",
    "avatar_url": null,
    "git_ssh_url": "ssh://git@gitlab.cern.ch:7999/lhcb-dpa/analysis-productions/test-repo.git",
    "git_http_url": "https://gitlab.cern.ch/lhcb-dpa/analysis-productions/test-repo.git",
    "namespace": "Analysis Productions",
    "visibility_level": 20,
    "path_with_namespace": "lhcb-dpa/analysis-productions/test-repo",
    "default_branch": "main",
    "ci_config_path": "",
    "homepage": "https://gitlab.cern.ch/lhcb-dpa/analysis-productions/test-repo",
    "url": "ssh://git@gitlab.cern.ch:7999/lhcb-dpa/analysis-productions/test-repo.git",
    "ssh_url": "ssh://git@gitlab.cern.ch:7999/lhcb-dpa/analysis-productions/test-repo.git",
    "http_url": "https://gitlab.cern.ch/lhcb-dpa/analysis-productions/test-repo.git"
  },
  "object_attributes": {
    "assignee_id": null,
    "author_id": 199,
    "created_at": "2022-11-24 13:47:38 +0100",
    "description": "",
    "head_pipeline_id": null,
    "id": 508259,
    "iid": 1,
    "last_edited_at": null,
    "last_edited_by_id": null,
    "merge_commit_sha": null,
    "merge_error": null,
    "merge_params": {
      "force_remove_source_branch": "1"
    },
    "merge_status": "unchecked",
    "merge_user_id": null,
    "merge_when_pipeline_succeeds": false,
    "milestone_id": null,
    "source_branch": "mc-request",
    "source_project_id": 148168,
    "state_id": 1,
    "target_branch": "main",
    "target_project_id": 148168,
    "time_estimate": 0,
    "title": "Draft: Example MC request",
    "updated_at": "2022-12-08 16:06:59 +0100",
    "updated_by_id": null,
    "url": "https://gitlab.cern.ch/lhcb-dpa/analysis-productions/test-repo/-/merge_requests/1",
    "source": {
      "id": 148168,
      "name": "test-repo",
      "description": "Repository used by LbAPI's CI",
      "web_url": "https://gitlab.cern.ch/lhcb-dpa/analysis-productions/test-repo",
      "avatar_url": null,
      "git_ssh_url": "ssh://git@gitlab.cern.ch:7999/lhcb-dpa/analysis-productions/test-repo.git",
      "git_http_url": "https://gitlab.cern.ch/lhcb-dpa/analysis-productions/test-repo.git",
      "namespace": "Analysis Productions",
      "visibility_level": 20,
      "path_with_namespace": "lhcb-dpa/analysis-productions/test-repo",
      "default_branch": "main",
      "ci_config_path": "",
      "homepage": "https://gitlab.cern.ch/lhcb-dpa/analysis-productions/test-repo",
      "url": "ssh://git@gitlab.cern.ch:7999/lhcb-dpa/analysis-productions/test-repo.git",
      "ssh_url": "ssh://git@gitlab.cern.ch:7999/lhcb-dpa/analysis-productions/test-repo.git",
      "http_url": "https://gitlab.cern.ch/lhcb-dpa/analysis-productions/test-repo.git"
    },
    "target": {
      "id": 148168,
      "name": "test-repo",
      "description": "Repository used by LbAPI's CI",
      "web_url": "https://gitlab.cern.ch/lhcb-dpa/analysis-productions/test-repo",
      "avatar_url": null,
      "git_ssh_url": "ssh://git@gitlab.cern.ch:7999/lhcb-dpa/analysis-productions/test-repo.git",
      "git_http_url": "https://gitlab.cern.ch/lhcb-dpa/analysis-productions/test-repo.git",
      "namespace": "Analysis Productions",
      "visibility_level": 20,
      "path_with_namespace": "lhcb-dpa/analysis-productions/test-repo",
      "default_branch": "main",
      "ci_config_path": "",
      "homepage": "https://gitlab.cern.ch/lhcb-dpa/analysis-productions/test-repo",
      "url": "ssh://git@gitlab.cern.ch:7999/lhcb-dpa/analysis-productions/test-repo.git",
      "ssh_url": "ssh://git@gitlab.cern.ch:7999/lhcb-dpa/analysis-productions/test-repo.git",
      "http_url": "https://gitlab.cern.ch/lhcb-dpa/analysis-productions/test-repo.git"
    },
    "last_commit": {
      "id": "746d0ee78140a7cdd2ef67cb12e291eed4fdc3e2",
      "message": "retrigger",
      "title": "retrigger",
      "timestamp": "2022-12-08T16:06:58+01:00",
      "url": "https://gitlab.cern.ch/lhcb-dpa/analysis-productions/test-repo/-/commit/746d0ee78140a7cdd2ef67cb12e291eed4fdc3e2",
      "author": {
        "name": "Ryunosuke O'Neil",
        "email": "[REDACTED]"
      }
    },
    "work_in_progress": true,
    "total_time_spent": 0,
    "time_change": 0,
    "human_total_time_spent": null,
    "human_time_change": null,
    "human_time_estimate": null,
    "assignee_ids": [

    ],
    "reviewer_ids": [

    ],
    "labels": [

    ],
    "state": "opened",
    "blocking_discussions_resolved": true,
    "first_contribution": false,
    "action": "update",
    "oldrev": "3a5a1bfc1c4b93078c6a51fc8659d2cf568e47e8"
  },
  "labels": [

  ],
  "changes": {
    "updated_at": {
      "previous": "2022-12-08 15:38:18 +0100",
      "current": "2022-12-08 16:06:59 +0100"
    }
  },
  "repository": {
    "name": "test-repo",
    "url": "ssh://git@gitlab.cern.ch:7999/lhcb-dpa/analysis-productions/test-repo.git",
    "description": "Repository used by LbAPI's CI",
    "homepage": "https://gitlab.cern.ch/lhcb-dpa/analysis-productions/test-repo"
  }
}
