{
    "object_kind": "merge_request",
    "event_type": "merge_request",
    "user": {
        "id": 199,
        "name": "Chris Burr",
        "username": "cburr",
        "avatar_url": "https://gitlab.cern.ch/uploads/-/system/user/avatar/199/avatar.png",
        "email": "[REDACTED]"
    },
    "project": {
        "id": 148168,
        "name": "test-repo",
        "description": "Repository used by LbAPI's CI",
        "web_url": "https://gitlab.cern.ch/lhcb-dpa/analysis-productions/test-repo",
        "avatar_url": null,
        "git_ssh_url": "ssh://git@gitlab.cern.ch:7999/lhcb-dpa/analysis-productions/test-repo.git",
        "git_http_url": "https://gitlab.cern.ch/lhcb-dpa/analysis-productions/test-repo.git",
        "namespace": "Analysis Productions",
        "visibility_level": 20,
        "path_with_namespace": "lhcb-dpa/analysis-productions/test-repo",
        "default_branch": "main",
        "ci_config_path": "",
        "homepage": "https://gitlab.cern.ch/lhcb-dpa/analysis-productions/test-repo",
        "url": "ssh://git@gitlab.cern.ch:7999/lhcb-dpa/analysis-productions/test-repo.git",
        "ssh_url": "ssh://git@gitlab.cern.ch:7999/lhcb-dpa/analysis-productions/test-repo.git",
        "http_url": "https://gitlab.cern.ch/lhcb-dpa/analysis-productions/test-repo.git"
    },
    "object_attributes": {
        "assignee_id": null,
        "author_id": 199,
        "created_at": "2022-12-09 15:08:46 +0100",
        "description": "",
        "head_pipeline_id": 4873359,
        "id": 512867,
        "iid": 3,
        "last_edited_at": null,
        "last_edited_by_id": null,
        "merge_commit_sha": null,
        "merge_error": null,
        "merge_params": {
            "force_remove_source_branch": "1"
        },
        "merge_status": "unchecked",
        "merge_user_id": null,
        "merge_when_pipeline_succeeds": false,
        "milestone_id": null,
        "source_branch": "mc-request-sim09",
        "source_project_id": 148168,
        "state_id": 1,
        "target_branch": "main",
        "target_project_id": 148168,
        "time_estimate": 0,
        "title": "Draft: Sim09 test",
        "updated_at": "2022-12-09 15:23:39 +0100",
        "updated_by_id": null,
        "url": "https://gitlab.cern.ch/lhcb-dpa/analysis-productions/test-repo/-/merge_requests/3",
        "source": {
            "id": 148168,
            "name": "test-repo",
            "description": "Repository used by LbAPI's CI",
            "web_url": "https://gitlab.cern.ch/lhcb-dpa/analysis-productions/test-repo",
            "avatar_url": null,
            "git_ssh_url": "ssh://git@gitlab.cern.ch:7999/lhcb-dpa/analysis-productions/test-repo.git",
            "git_http_url": "https://gitlab.cern.ch/lhcb-dpa/analysis-productions/test-repo.git",
            "namespace": "Analysis Productions",
            "visibility_level": 20,
            "path_with_namespace": "lhcb-dpa/analysis-productions/test-repo",
            "default_branch": "main",
            "ci_config_path": "",
            "homepage": "https://gitlab.cern.ch/lhcb-dpa/analysis-productions/test-repo",
            "url": "ssh://git@gitlab.cern.ch:7999/lhcb-dpa/analysis-productions/test-repo.git",
            "ssh_url": "ssh://git@gitlab.cern.ch:7999/lhcb-dpa/analysis-productions/test-repo.git",
            "http_url": "https://gitlab.cern.ch/lhcb-dpa/analysis-productions/test-repo.git"
        },
        "target": {
            "id": 148168,
            "name": "test-repo",
            "description": "Repository used by LbAPI's CI",
            "web_url": "https://gitlab.cern.ch/lhcb-dpa/analysis-productions/test-repo",
            "avatar_url": null,
            "git_ssh_url": "ssh://git@gitlab.cern.ch:7999/lhcb-dpa/analysis-productions/test-repo.git",
            "git_http_url": "https://gitlab.cern.ch/lhcb-dpa/analysis-productions/test-repo.git",
            "namespace": "Analysis Productions",
            "visibility_level": 20,
            "path_with_namespace": "lhcb-dpa/analysis-productions/test-repo",
            "default_branch": "main",
            "ci_config_path": "",
            "homepage": "https://gitlab.cern.ch/lhcb-dpa/analysis-productions/test-repo",
            "url": "ssh://git@gitlab.cern.ch:7999/lhcb-dpa/analysis-productions/test-repo.git",
            "ssh_url": "ssh://git@gitlab.cern.ch:7999/lhcb-dpa/analysis-productions/test-repo.git",
            "http_url": "https://gitlab.cern.ch/lhcb-dpa/analysis-productions/test-repo.git"
        },
        "last_commit": {
            "id": "b55e1a94565a9dcec2e6529fc33f3ef1e768b726",
            "message": "Fix sim version",
            "title": "Fix sim version",
            "timestamp": "2022-12-09T15:23:38+01:00",
            "url": "https://gitlab.cern.ch/lhcb-dpa/analysis-productions/test-repo/-/commit/b55e1a94565a9dcec2e6529fc33f3ef1e768b726",
            "author": {
                "name": "Chris Burr",
                "email": "[REDACTED]"
            }
        },
        "work_in_progress": true,
        "total_time_spent": 0,
        "time_change": 0,
        "human_total_time_spent": null,
        "human_time_change": null,
        "human_time_estimate": null,
        "assignee_ids": [],
        "reviewer_ids": [],
        "labels": [],
        "state": "opened",
        "blocking_discussions_resolved": true,
        "first_contribution": false,
        "action": "update",
        "oldrev": "07e6e8a7f5016b05d4140bb1617ddfb1a9f077b5"
    },
    "labels": [],
    "changes": {
        "updated_at": {
            "previous": "2022-12-09 15:08:46 +0100",
            "current": "2022-12-09 15:23:39 +0100"
        }
    },
    "repository": {
        "name": "test-repo",
        "url": "ssh://git@gitlab.cern.ch:7999/lhcb-dpa/analysis-productions/test-repo.git",
        "description": "Repository used by LbAPI's CI",
        "homepage": "https://gitlab.cern.ch/lhcb-dpa/analysis-productions/test-repo"
    }
}
