Merge branch 'gbltests' of ssh://gitlab.cern.ch:7999/lhuth/corryvreckan into gbltests

13 jobs for gbltests in 5 minutes and 14 seconds (queued for 1 second)
Name Stage Failure
failed
cmp:cc7-docker Compilation
                               ^~~~~~~~
/builds/lhuth/corryvreckan/src/modules/Tracking4D/Tracking4D.cpp:283:31: note: suggested alternative: 'track'
tracks->push_back(GBLtrack);
^~~~~~~~
track
make[2]: *** [src/modules/Tracking4D/CMakeFiles/CorryvreckanModuleTracking4D.dir/build.make:77: src/modules/Tracking4D/CMakeFiles/CorryvreckanModuleTracking4D.dir/Tracking4D.cpp.o] Error 1
make[1]: *** [CMakeFiles/Makefile2:2089: src/modules/Tracking4D/CMakeFiles/CorryvreckanModuleTracking4D.dir/all] Error 2
make: *** [Makefile:163: all] Error 2
ERROR: Job failed: exit code 1
failed
cmp:slc6-gcc Compilation
                               ^~~~~~~~
track
[116/127] Building CXX object src/modules/TreeWriterDUT/CMakeFiles/CorryvreckanModuleTreeWriterDUT.dir/__/__/core/module/dynamic_module_impl.cpp.o
[117/127] Building CXX object src/modules/TextWriter/CMakeFiles/CorryvreckanModuleTextWriter.dir/TextWriter.cpp.o
[118/127] Building CXX object src/modules/TreeWriterDUT/CMakeFiles/CorryvreckanModuleTreeWriterDUT.dir/TreeWriterDUT.cpp.o
[119/127] Building CXX object src/modules/TrackingSpatial/CMakeFiles/CorryvreckanModuleTrackingSpatial.dir/TrackingSpatial.cpp.o
[120/127] Building CXX object src/modules/OnlineMonitor/CMakeFiles/CorryvreckanModuleOnlineMonitor.dir/OnlineMonitor.cpp.o
ninja: build stopped: subcommand failed.
ERROR: Job failed: exit code 1
failed
cmp:cc7-llvm Compilation
2 errors generated.
[115/127] Building CXX object src/modules/TrackingSpatial/CMakeFiles/CorryvreckanModuleTrackingSpatial.dir/__/__/core/module/dynamic_module_impl.cpp.o
[116/127] Building CXX object src/modules/TextWriter/CMakeFiles/CorryvreckanModuleTextWriter.dir/TextWriter.cpp.o
[117/127] Building CXX object src/modules/TreeWriterDUT/CMakeFiles/CorryvreckanModuleTreeWriterDUT.dir/__/__/core/module/dynamic_module_impl.cpp.o
[118/127] Building CXX object src/modules/TreeWriterDUT/CMakeFiles/CorryvreckanModuleTreeWriterDUT.dir/TreeWriterDUT.cpp.o
[119/127] Building CXX object src/modules/TrackingSpatial/CMakeFiles/CorryvreckanModuleTrackingSpatial.dir/TrackingSpatial.cpp.o
[120/127] Building CXX object src/modules/OnlineMonitor/CMakeFiles/CorryvreckanModuleOnlineMonitor.dir/OnlineMonitor.cpp.o
ninja: build stopped: subcommand failed.
ERROR: Job failed: exit code 1
failed
cmp:slc6-llvm Compilation
[114/127] Building CXX object src/modules/TrackingSpatial/CMakeFiles/CorryvreckanModuleTrackingSpatial.dir/__/__/core/module/dynamic_module_impl.cpp.o
[115/127] Building CXX object src/modules/TextWriter/CMakeFiles/CorryvreckanModuleTextWriter.dir/TextWriter.cpp.o
[116/127] Linking CXX shared library src/modules/TestAlgorithm/libCorryvreckanModuleTestAlgorithm.so
[117/127] Building CXX object src/modules/TreeWriterDUT/CMakeFiles/CorryvreckanModuleTreeWriterDUT.dir/__/__/core/module/dynamic_module_impl.cpp.o
[118/127] Building CXX object src/modules/TreeWriterDUT/CMakeFiles/CorryvreckanModuleTreeWriterDUT.dir/TreeWriterDUT.cpp.o
[119/127] Building CXX object src/modules/TrackingSpatial/CMakeFiles/CorryvreckanModuleTrackingSpatial.dir/TrackingSpatial.cpp.o
[120/127] Building CXX object src/modules/OnlineMonitor/CMakeFiles/CorryvreckanModuleOnlineMonitor.dir/OnlineMonitor.cpp.o
ninja: build stopped: subcommand failed.
ERROR: Job failed: exit code 1
failed
cmp:mac1014-clang Compilation
                              ^
2 errors generated.
[115/127] Building CXX object src/modules/TextWriter/CMakeFiles/CorryvreckanModuleTextWriter.dir/TextWriter.cpp.o
[116/127] Building CXX object src/modules/TrackingSpatial/CMakeFiles/CorryvreckanModuleTrackingSpatial.dir/__/__/core/module/dynamic_module_impl.cpp.o
[117/127] Building CXX object src/modules/TreeWriterDUT/CMakeFiles/CorryvreckanModuleTreeWriterDUT.dir/__/__/core/module/dynamic_module_impl.cpp.o
[118/127] Building CXX object src/modules/TrackingSpatial/CMakeFiles/CorryvreckanModuleTrackingSpatial.dir/TrackingSpatial.cpp.o
[119/127] Building CXX object src/modules/OnlineMonitor/CMakeFiles/CorryvreckanModuleOnlineMonitor.dir/OnlineMonitor.cpp.o
ninja: build stopped: subcommand failed.
ERROR: Job failed: exit status 1
failed
cmp:cc7-gcc Compilation
                               track
[117/127] Building CXX object src/modules/TrackingSpatial/CMakeFiles/CorryvreckanModuleTrackingSpatial.dir/__/__/core/module/dynamic_module_impl.cpp.o
[118/127] Building CXX object src/modules/TreeWriterDUT/CMakeFiles/CorryvreckanModuleTreeWriterDUT.dir/__/__/core/module/dynamic_module_impl.cpp.o
[119/127] Building CXX object src/modules/OnlineMonitor/CMakeFiles/CorryvreckanModuleOnlineMonitor.dir/OnlineMonitor.cpp.o
[120/127] Building CXX object src/modules/TreeWriterDUT/CMakeFiles/CorryvreckanModuleTreeWriterDUT.dir/TreeWriterDUT.cpp.o
[121/127] Building CXX object src/modules/TrackingSpatial/CMakeFiles/CorryvreckanModuleTrackingSpatial.dir/TrackingSpatial.cpp.o
ninja: build stopped: subcommand failed.
Authenticating with credentials from /root/.docker/config.json
ERROR: Job failed: exit code 1