# This is a list of upstream packages to filter. Use this as a last resort
# in case upstream adds a package that breaks something horribly and you don't
# want to stop advancing the symlinks. Ideally, this file should be empty.
# This will simply remove the listed RPMs, no dependencies are touched,
# so make sure the remaining ones are still installable. Add these packages to
# packages_tested.lst to explicitly test them during the validation step.
# You probably also want to add them to DANGEROUS_RPMS, so you can check new
# versions to see if they solve the issue.

# Comments start with a #, and they may be inline
# Blank lines are ignored
