






                                         Menu navigation help

                               [UpArrow] [DownArrow] - moves between items.
                               [Enter]               - selects item.
                               [Esc]                 - returns to menu.
                               [F1]                  - shows help.





                               contact: linux.support@cern.ch
                               see also: http://@AIMS_SERVER@/aims/help

