I found no \bibdata command---while reading file hepix-paper.aux
Warning--I didn't find a database entry for "taddei.shellchoice"
Warning--I didn't find a database entry for "www.shells"
Warning--I didn't find a database entry for "www.umtfX11"
(There was 1 error message)
