%!PS-Adobe-2.0 EPSF-2.0
%%Creator: gnuplot
%%DocumentFonts: Times-Roman
%%BoundingBox: 50 50 590 428
%%EndComments
/gnudict 40 dict def
gnudict begin
/Color false def
/Solid false def
/gnulinewidth 5.000 def
/vshift -100 def
/dl {10 mul} def
/hpt 31.5 def
/vpt 31.5 def
/M {moveto} bind def
/L {lineto} bind def
/R {rmoveto} bind def
/V {rlineto} bind def
/vpt2 vpt 2 mul def
/hpt2 hpt 2 mul def
/Lshow { currentpoint stroke M
  0 vshift R show } def
/Rshow { currentpoint stroke M
  dup stringwidth pop neg vshift R show } def
/Cshow { currentpoint stroke M
  dup stringwidth pop -2 div vshift R show } def
/DL { Color {setrgbcolor Solid {pop []} if 0 setdash }
 {pop pop pop Solid {pop []} if 0 setdash} ifelse } def
/BL { stroke gnulinewidth 2 mul setlinewidth } def
/AL { stroke gnulinewidth 2 div setlinewidth } def
/PL { stroke gnulinewidth setlinewidth } def
/LTb { BL [] 0 0 0 DL } def
/LTa { AL [1 dl 2 dl] 0 setdash 0 0 0 setrgbcolor } def
/LT0 { PL [] 0 1 0 DL } def
/LT1 { PL [4 dl 2 dl] 0 0 1 DL } def
/LT2 { PL [2 dl 3 dl] 1 0 0 DL } def
/LT3 { PL [1 dl 1.5 dl] 1 0 1 DL } def
/LT4 { PL [5 dl 2 dl 1 dl 2 dl] 0 1 1 DL } def
/LT5 { PL [4 dl 3 dl 1 dl 3 dl] 1 1 0 DL } def
/LT6 { PL [2 dl 2 dl 2 dl 4 dl] 0 0 0 DL } def
/LT7 { PL [2 dl 2 dl 2 dl 2 dl 2 dl 4 dl] 1 0.3 0 DL } def
/LT8 { PL [2 dl 2 dl 2 dl 2 dl 2 dl 2 dl 2 dl 4 dl] 0.5 0.5 0.5 DL } def
/P { stroke [] 0 setdash
  currentlinewidth 2 div sub M
  0 currentlinewidth V stroke } def
/D { stroke [] 0 setdash 2 copy vpt add M
  hpt neg vpt neg V hpt vpt neg V
  hpt vpt V hpt neg vpt V closepath stroke
  P } def
/A { stroke [] 0 setdash vpt sub M 0 vpt2 V
  currentpoint stroke M
  hpt neg vpt neg R hpt2 0 V stroke
  } def
/B { stroke [] 0 setdash 2 copy exch hpt sub exch vpt add M
  0 vpt2 neg V hpt2 0 V 0 vpt2 V
  hpt2 neg 0 V closepath stroke
  P } def
/C { stroke [] 0 setdash exch hpt sub exch vpt add M
  hpt2 vpt2 neg V currentpoint stroke M
  hpt2 neg 0 R hpt2 vpt2 V stroke } def
/T { stroke [] 0 setdash 2 copy vpt 1.12 mul add M
  hpt neg vpt -1.62 mul V
  hpt 2 mul 0 V
  hpt neg vpt 1.62 mul V closepath stroke
  P  } def
/S { 2 copy A C} def
end
%%EndProlog
gnudict begin
gsave
50 50 translate
0.050 0.050 scale
0 setgray
/Times-Roman findfont 300 scalefont setfont
newpath
LTa
1440 451 M
8937 0 V
-8937 0 R
0 6958 V
LTb
LTa
1440 6713 M
8937 0 V
LTb
1440 6713 M
63 0 V
8874 0 R
-63 0 V
-9054 0 R
(HEP_profile) Rshow
LTa
1440 7409 M
8937 0 V
LTb
1440 7409 M
63 0 V
8874 0 R
-63 0 V
-9054 0 R
(/etc/profile) Rshow
LTa
1440 2538 M
8937 0 V
LTb
1440 2538 M
63 0 V
8874 0 R
-63 0 V
-9054 0 R
(login.sh) Rshow
LTa
1440 5322 M
8937 0 V
LTb
1440 5322 M
63 0 V
8874 0 R
-63 0 V
-9054 0 R
(sys.conf.sh) Rshow
LTa
1440 1843 M
8937 0 V
LTb
1440 1843 M
63 0 V
8874 0 R
-63 0 V
-9054 0 R
(.bash_profile) Rshow
LTa
1440 4626 M
8937 0 V
LTb
1440 4626 M
63 0 V
8874 0 R
-63 0 V
-9054 0 R
(env.sh) Rshow
LTa
1440 6017 M
8937 0 V
LTb
1440 6017 M
63 0 V
8874 0 R
-63 0 V
-9054 0 R
(HEP_zshenv) Rshow
LTa
1440 3234 M
8937 0 V
LTb
1440 3234 M
63 0 V
8874 0 R
-63 0 V
-9054 0 R
(bashrc) Rshow
LTa
1440 3930 M
8937 0 V
LTb
1440 3930 M
63 0 V
8874 0 R
-63 0 V
-9054 0 R
(HEP_bashrc) Rshow
LTa
1440 1147 M
8937 0 V
LTb
1440 1147 M
63 0 V
8874 0 R
-63 0 V
-9054 0 R
(central_login.sh) Rshow
LTa
1440 451 M
0 6958 V
LTb
1440 451 M
0 63 V
0 6895 R
0 -63 V
0 -7195 R
(0) Cshow
LTa
2381 451 M
0 6958 V
LTb
2381 451 M
0 63 V
0 6895 R
0 -63 V
0 -7195 R
(2) Cshow
LTa
3321 451 M
0 6958 V
LTb
3321 451 M
0 63 V
0 6895 R
0 -63 V
0 -7195 R
(4) Cshow
LTa
4262 451 M
0 6958 V
LTb
4262 451 M
0 63 V
0 6895 R
0 -63 V
0 -7195 R
(6) Cshow
LTa
5203 451 M
0 6958 V
LTb
5203 451 M
0 63 V
0 6895 R
0 -63 V
0 -7195 R
(8) Cshow
LTa
6144 451 M
0 6958 V
LTb
6144 451 M
0 63 V
0 6895 R
0 -63 V
0 -7195 R
(10) Cshow
LTa
7084 451 M
0 6958 V
LTb
7084 451 M
0 63 V
0 6895 R
0 -63 V
0 -7195 R
(12) Cshow
LTa
8025 451 M
0 6958 V
LTb
8025 451 M
0 63 V
0 6895 R
0 -63 V
0 -7195 R
(14) Cshow
LTa
8966 451 M
0 6958 V
LTb
8966 451 M
0 63 V
0 6895 R
0 -63 V
0 -7195 R
(16) Cshow
LTa
9907 451 M
0 6958 V
LTb
9907 451 M
0 63 V
0 6895 R
0 -63 V
0 -7195 R
(18) Cshow
1440 451 M
8937 0 V
0 6958 V
-8937 0 V
0 -6958 V
LT0
9414 7046 M
("analyse.dat") Rshow
9594 7046 M
540 0 V
1440 7409 M
470 -696 V
471 -696 V
470 -695 V
470 0 V
471 -696 V
470 0 V
471 -696 V
470 -696 V
470 0 V
471 696 V
470 2087 V
7084 2538 L
471 0 V
470 4175 V
471 696 V
8966 1843 L
470 -696 V
471 0 V
470 696 V
9774 7046 D
1440 7409 D
1910 6713 D
2381 6017 D
2851 5322 D
3321 5322 D
3792 4626 D
4262 4626 D
4733 3930 D
5203 3234 D
5673 3234 D
6144 3930 D
6614 6017 D
7084 2538 D
7555 2538 D
8025 6713 D
8496 7409 D
8966 1843 D
9436 1147 D
9907 1147 D
10377 1843 D
stroke
grestore
end
showpage
%%Trailer
