\relax 
\@writefile{los}{\protect \l@slide {1}{\ignorespaces General view on the components}{1}}
\@writefile{los}{\protect \l@slide {2}{\ignorespaces Environment HEP files}{2}}
\@writefile{los}{\protect \l@slide {3}{\ignorespaces Environment HEP files}{3}}
\@writefile{los}{\protect \l@slide {4}{\ignorespaces HEPiX Aliases}{4}}
\@writefile{los}{\protect \l@slide {5}{\ignorespaces HEPiX Environment variables}{5}}
\@writefile{los}{\protect \l@slide {6}{\ignorespaces XDM}{6}}
\@writefile{los}{\protect \l@slide {7}{\ignorespaces XDMCP /1}{7}}
\@writefile{los}{\protect \l@slide {8}{\ignorespaces XDMCP /2}{8}}
\@writefile{los}{\protect \l@slide {9}{\ignorespaces Keyboard support /1}{9}}
\@writefile{los}{\protect \l@slide {10}{\ignorespaces Keyboard support /2}{10}}
