{
  "name": "puppet-cvmfs",
  "version": "10.1.0",
  "summary": "Manages CVMFS clients",
  "author": "Vox Pupuli",
  "project_page": "https://github.com/voxpupuli/puppet-cvmfs",
  "source": "https://github.com/voxpupuli/puppet-cvmfs.git",
  "issues_url": "https://github.com/voxpupuli/puppet-cvmfs/issues",
  "tags": [
    "cvmfs"
  ],
  "license": "Apache-2.0",
  "dependencies": [
    {
      "version_requirement": ">=7.0.0 < 10.0.0",
      "name": "puppetlabs/apt"
    },
    {
      "version_requirement": ">= 1.0.0 < 10.0.0",
      "name": "puppetlabs/concat"
    },
    {
      "version_requirement": ">= 6.1.0 < 10.0.0",
      "name": "puppetlabs/stdlib"
    }
  ],
  "operatingsystem_support": [
    {
      "operatingsystem": "Debian",
      "operatingsystemrelease": [
        "10",
        "11"
      ]
    },
    {
      "operatingsystem": "Ubuntu",
      "operatingsystemrelease": [
        "18.04",
        "20.04",
        "22.04"
      ]
    },
    {
      "operatingsystem": "RedHat",
      "operatingsystemrelease": [
        "7",
        "8",
        "9"
      ]
    },
    {
      "operatingsystem": "AlmaLinux",
      "operatingsystemrelease": [
        "8",
        "9"
      ]
    },
    {
      "operatingsystem": "Rocky",
      "operatingsystemrelease": [
        "8",
        "9"
      ]
    },
    {
      "operatingsystem": "CentOS",
      "operatingsystemrelease": [
        "7",
        "8",
        "9"
      ]
    },
    {
      "operatingsystem": "Scientific",
      "operatingsystemrelease": [
        "7"
      ]
    }
  ],
  "requirements": [
    {
      "name": "puppet",
      "version_requirement": ">= 7.0.0 < 9.0.0"
    }
  ]
}
