{
  "CHANGELOG.md": "60ad17fc952d2aff196b6ecd5822ec14",
  "Gemfile": "36359c0a416ad61269c0af421aeb4d63",
  "HISTORY.md": "5de859b21c356e62787781d6c112f72d",
  "LICENSE": "3b4400c20f0a67afa21cbb537391cf1e",
  "README.md": "6c82135d5466e01ef48c9aee53d14326",
  "REFERENCE.md": "452449648d7c95aecd2cdc7a8ce0e552",
  "Rakefile": "b8f05e37a630a753bb2c5d6119d13109",
  "Vagrantfile": "0bde7824c15a66983b3329080d2bc464",
  "examples/test.pp": "de81916bd9405a1e1773f395d06078bf",
  "functions/safe_filename.pp": "ec92e6bc22066e73655fd6460679d06f",
  "lib/facter/firewalld_version.rb": "fe337db0381d753b77c2c11127f7ac2f",
  "lib/puppet/provider/firewalld.rb": "2be3101eef0b93adba3674ee9a7b108e",
  "lib/puppet/provider/firewalld_direct_chain/firewall_cmd.rb": "11d6bfa02be782f96a0143c687bdd8b1",
  "lib/puppet/provider/firewalld_direct_passthrough/firewall_cmd.rb": "cdc9b3467493867f3ddc1e4852d58c5d",
  "lib/puppet/provider/firewalld_direct_purge/firewall_cmd.rb": "a12e714b7b75e1641322f28defd9a2f5",
  "lib/puppet/provider/firewalld_direct_rule/firewall_cmd.rb": "7eb03217894db660cbb24ccb34fa7b70",
  "lib/puppet/provider/firewalld_ipset/firewall_cmd.rb": "9586492ca938535fe05bf7a54b62fbe6",
  "lib/puppet/provider/firewalld_port/firewall_cmd.rb": "b7542f86ec03ec4e9f6b663eb466eb8d",
  "lib/puppet/provider/firewalld_rich_rule/firewall_cmd.rb": "3eb3f01d3f68ccbdd9fbeaa455018acc",
  "lib/puppet/provider/firewalld_service/firewall_cmd.rb": "7359bc222879061bb043ad2aeef189cf",
  "lib/puppet/provider/firewalld_zone/firewall_cmd.rb": "068685ad9687e7863b7ab027420dfa5c",
  "lib/puppet/type/firewalld_direct_chain.rb": "2c8236f2a08d7587f0033bd770cfbea5",
  "lib/puppet/type/firewalld_direct_passthrough.rb": "645f7122c78833f0d1274583366f79d7",
  "lib/puppet/type/firewalld_direct_purge.rb": "c5109d79841f1b9e557163f757f97a6c",
  "lib/puppet/type/firewalld_direct_rule.rb": "8340fd05236b1236ddddf6d11307506b",
  "lib/puppet/type/firewalld_ipset.rb": "c6340f58a59783637c552d9df713ce11",
  "lib/puppet/type/firewalld_port.rb": "0e54c7655ef6625372a71da09b4b0586",
  "lib/puppet/type/firewalld_rich_rule.rb": "eb901083b10656c3f89ab05a7e0f454c",
  "lib/puppet/type/firewalld_service.rb": "e8f16ec5466e1de5131c74a94b25d388",
  "lib/puppet/type/firewalld_zone.rb": "788784a09d57695ed29bc46d4a093f64",
  "manifests/custom_service.pp": "9c99b1293bf63b78be189f691a8835d8",
  "manifests/init.pp": "96916d6c7a661e443e7c95f3b37c506b",
  "manifests/reload/complete.pp": "175b07d1e860d6e9bfc8830008d5cd47",
  "manifests/reload.pp": "d4e25dce20bcabe11e8fc52920cffec6",
  "metadata.json": "1c810a8e11fc5083619d0f4e909f87d4",
  "rakelib/simp.rake": "bb17edc7919f29ee6f2a2ec091ebc284",
  "spec/acceptance/nodesets/default.yml": "c446e323b8c5eb6a953dc6bedcc32cf9",
  "spec/acceptance/suites/default/00_default_spec.rb": "0c8d6763c12c56b0f963be4e41ba0688",
  "spec/classes/init_spec.rb": "bcf0b9d84861c1593847a72917d56929",
  "spec/classes/reload/complete_spec.rb": "1a273dcb077e2c69e7fd4daeade56252",
  "spec/classes/reload_spec.rb": "0c9bc0c1040b20c0f2bb22cdd83ab244",
  "spec/defines/custom_service_spec.rb": "700ba55c74810c87d52602c84cbec572",
  "spec/fixtures/hiera/hiera.yaml": "60aa78994a1a43b8858506c0d020611a",
  "spec/fixtures/hieradata/common.yaml": "eb4d68e9fcf8003dd6fecf1e605d8769",
  "spec/fixtures/services/custom_service.xml": "a2fc52df9bdf3a50d566954af6d80f99",
  "spec/fixtures/services/custom_service_port_range.xml": "675350e66cb0429386678de7be99baef",
  "spec/functions/safe_filename_spec.rb": "21fcb2ec52545d04204b451592c6378f",
  "spec/spec_helper.rb": "3cf5dbf940365f13ce6c51881cd1bd68",
  "spec/spec_helper_acceptance.rb": "653758026c0f8e56f6363094b703ed50",
  "spec/unit/facter/firewalld_version_spec.rb": "b5d77cbf14184f43b8378c5929970a0a",
  "spec/unit/puppet/provider/firewalld_ipset_spec.rb": "fcb02286533d3518b52f99ed387f1e2d",
  "spec/unit/puppet/provider/firewalld_rich_rule_spec.rb": "a6baad56c4066fe73d568177a5ef61fc",
  "spec/unit/puppet/provider/firewalld_zone_spec.rb": "2bfb84d2b5bc09448ec63cb326ebc410",
  "spec/unit/puppet/type/firewalld_direct_chain_spec.rb": "16f5ab768c53c6fcd9554ee61be0c923",
  "spec/unit/puppet/type/firewalld_direct_passthrough_spec.rb": "59edb3c159387cf7714590a430d0b508",
  "spec/unit/puppet/type/firewalld_direct_rule_spec.rb": "d613dcf7633e61b06e3a60e7839ff496",
  "spec/unit/puppet/type/firewalld_ipset_spec.rb": "7c867015448b39dfaabab22afd41d649",
  "spec/unit/puppet/type/firewalld_port_spec.rb": "f2cddbd18ec502e53729b3c18c0b5ab6",
  "spec/unit/puppet/type/firewalld_rich_rule_spec.rb": "b70bdd095970b778908dd8ac6b96a113",
  "spec/unit/puppet/type/firewalld_service_spec.rb": "bd7503e673b5e237c2c940dd291767b9",
  "spec/unit/puppet/type/firewalld_zone_spec.rb": "dffa34b65c15fe346fd14bc5356bdd5d",
  "templates/service.xml.epp": "8afd4e9a71cb44ab4ea6999612d5546b"
}