<?xml version="1.0" encoding="UTF-8"?>
<!DOCTYPE svg PUBLIC "-//W3C//DTD SVG 1.1//EN" "http://www.w3.org/Graphics/SVG/1.1/DTD/svg11.dtd">
<svg xmlns="http://www.w3.org/2000/svg" xmlns:xlink="http://www.w3.org/1999/xlink" version="1.1" width="245px" height="200px" viewBox="-0.5 -0.5 245 200"><defs/><g><rect x="80" y="0" width="90" height="122" rx="13.5" ry="13.5" fill-opacity="0.6" fill="#f5f5f5" stroke="#666666" stroke-opacity="0.6" pointer-events="all"/><g transform="translate(-0.5 -0.5)"><switch><foreignObject style="overflow: visible; text-align: left;" pointer-events="none" width="100%" height="100%" requiredFeatures="http://www.w3.org/TR/SVG11/feature#Extensibility"><div xmlns="http://www.w3.org/1999/xhtml" style="display: flex; align-items: unsafe flex-start; justify-content: unsafe center; width: 88px; height: 1px; padding-top: 7px; margin-left: 81px;"><div style="box-sizing: border-box; font-size: 0px; text-align: center;" data-drawio-colors="color: #333333; "><div style="display: inline-block; font-size: 12px; font-family: Helvetica; color: rgb(51, 51, 51); line-height: 1.2; pointer-events: all; white-space: normal; overflow-wrap: normal;">cam-express</div></div></div></foreignObject><text x="125" y="19" fill="#333333" font-family="Helvetica" font-size="12px" text-anchor="middle">cam-express</text></switch></g><rect x="59" y="131" width="132" height="68" rx="10.2" ry="10.2" fill-opacity="0.6" fill="rgb(255, 255, 255)" stroke="rgb(0, 0, 0)" stroke-opacity="0.6" stroke-dasharray="3 3" pointer-events="all"/><path d="M 55 30 Q 70.02 30 70.02 28.51 Q 70.02 27.02 170 27" fill="none" stroke="#6c8ebf" stroke-opacity="0.9" stroke-miterlimit="10" pointer-events="stroke"/><path d="M 169.82 27.08 L 180 27.04 Q 190 27 195 18.5 L 197.5 14.25 Q 200 10 210 10 L 234.88 10" fill="none" stroke="#6c8ebf" stroke-opacity="0.9" stroke-miterlimit="10" pointer-events="stroke"/><path d="M 238.88 10 L 234.88 12 L 234.88 8 Z" fill-opacity="0.9" fill="#6c8ebf" stroke="#6c8ebf" stroke-opacity="0.9" stroke-miterlimit="10" pointer-events="all"/><path d="M 74 143 L 99.88 143" fill="none" stroke="#b85450" stroke-opacity="0.9" stroke-miterlimit="10" pointer-events="stroke"/><path d="M 102.88 143 L 99.88 144.5 L 99.88 141.5 Z" fill-opacity="0.9" fill="#b85450" stroke="#b85450" stroke-opacity="0.9" stroke-miterlimit="10" pointer-events="all"/><g transform="translate(-0.5 -0.5)"><switch><foreignObject style="overflow: visible; text-align: left;" pointer-events="none" width="100%" height="100%" requiredFeatures="http://www.w3.org/TR/SVG11/feature#Extensibility"><div xmlns="http://www.w3.org/1999/xhtml" style="display: flex; align-items: unsafe center; justify-content: unsafe center; width: 1px; height: 1px; padding-top: 141px; margin-left: 141px;"><div style="box-sizing: border-box; font-size: 0px; text-align: center;" data-drawio-colors="color: rgb(0, 0, 0); "><div style="display: inline-block; font-size: 11px; font-family: Helvetica; color: rgb(0, 0, 0); line-height: 1.2; pointer-events: all; white-space: nowrap;"><font style="font-size: 7px">JPEG via WebSocket</font></div></div></div></foreignObject><text x="141" y="145" fill="rgb(0, 0, 0)" font-family="Helvetica" font-size="11px" text-anchor="middle">JPEG via WebSocket</text></switch></g><path d="M 74 156 L 99.88 156" fill="none" stroke="#6c8ebf" stroke-opacity="0.9" stroke-miterlimit="10" pointer-events="stroke"/><path d="M 102.88 156 L 99.88 157.5 L 99.88 154.5 Z" fill-opacity="0.9" fill="#6c8ebf" stroke="#6c8ebf" stroke-opacity="0.9" stroke-miterlimit="10" pointer-events="all"/><g transform="translate(-0.5 -0.5)"><switch><foreignObject style="overflow: visible; text-align: left;" pointer-events="none" width="100%" height="100%" requiredFeatures="http://www.w3.org/TR/SVG11/feature#Extensibility"><div xmlns="http://www.w3.org/1999/xhtml" style="display: flex; align-items: unsafe center; justify-content: unsafe center; width: 1px; height: 1px; padding-top: 154px; margin-left: 135px;"><div style="box-sizing: border-box; font-size: 0px; text-align: center;" data-drawio-colors="color: rgb(0, 0, 0); "><div style="display: inline-block; font-size: 11px; font-family: Helvetica; color: rgb(0, 0, 0); line-height: 1.2; pointer-events: all; white-space: nowrap;"><font style="font-size: 7px">MJPEG via HTTP</font></div></div></div></foreignObject><text x="135" y="158" fill="rgb(0, 0, 0)" font-family="Helvetica" font-size="11px" text-anchor="middle">MJPEG via HTTP</text></switch></g><path d="M 1 22.91 L 1 43 L 3.76 43 C 5.29 43 6.53 41.75 6.53 40.21 L 6.53 34.63 L 20.34 34.63 L 25.87 26.25 L 42.45 37.42 L 46.21 31.84 L 41.34 34.07 L 12.05 14.36 L 10.84 16.1 L 23.22 24.47 L 18.68 31.28 L 6.53 31.28 L 6.53 25.7 C 6.53 24.15 5.29 22.91 3.76 22.91 Z M 11.33 10.51 L 41.51 31.05 L 52.4 26.25 L 19.24 3.93 C 18.65 3.48 17.91 3.29 17.19 3.4 C 16.46 3.5 15.81 3.89 15.37 4.48 Z M 51.01 29.6 L 45.71 37.86 L 48.97 40.04 L 54.33 31.84 Z" fill="#cccccc" stroke="#6881b3" stroke-width="1.11" stroke-miterlimit="10" transform="translate(27.66,0)scale(-1,1)translate(-27.66,0)" pointer-events="none"/><path d="M 1 52.91 L 1 73 L 3.76 73 C 5.29 73 6.53 71.75 6.53 70.21 L 6.53 64.63 L 20.34 64.63 L 25.87 56.25 L 42.45 67.42 L 46.21 61.84 L 41.34 64.07 L 12.05 44.36 L 10.84 46.1 L 23.22 54.47 L 18.68 61.28 L 6.53 61.28 L 6.53 55.7 C 6.53 54.15 5.29 52.91 3.76 52.91 Z M 11.33 40.51 L 41.51 61.05 L 52.4 56.25 L 19.24 33.93 C 18.65 33.48 17.91 33.29 17.19 33.4 C 16.46 33.5 15.81 33.89 15.37 34.48 Z M 51.01 59.6 L 45.71 67.86 L 48.97 70.04 L 54.33 61.84 Z" fill="#cccccc" stroke="#6881b3" stroke-width="1.11" stroke-miterlimit="10" transform="translate(27.66,0)scale(-1,1)translate(-27.66,0)" pointer-events="none"/><path d="M 1 82.91 L 1 103 L 3.76 103 C 5.29 103 6.53 101.75 6.53 100.21 L 6.53 94.63 L 20.34 94.63 L 25.87 86.25 L 42.45 97.42 L 46.21 91.84 L 41.34 94.07 L 12.05 74.36 L 10.84 76.1 L 23.22 84.47 L 18.68 91.28 L 6.53 91.28 L 6.53 85.7 C 6.53 84.15 5.29 82.91 3.76 82.91 Z M 11.33 70.51 L 41.51 91.05 L 52.4 86.25 L 19.24 63.93 C 18.65 63.48 17.91 63.29 17.19 63.4 C 16.46 63.5 15.81 63.89 15.37 64.48 Z M 51.01 89.6 L 45.71 97.86 L 48.97 100.04 L 54.33 91.84 Z" fill="#cccccc" stroke="#6881b3" stroke-width="1.11" stroke-miterlimit="10" transform="translate(27.66,0)scale(-1,1)translate(-27.66,0)" pointer-events="none"/><path d="M 55 30 Q 70.02 30 70.02 32.51 Q 70.02 35.02 150 35" fill="none" stroke="#6c8ebf" stroke-opacity="0.9" stroke-miterlimit="10" pointer-events="none"/><rect x="150" y="30" width="20" height="10" fill="#fff2cc" stroke="#d6b656" pointer-events="none"/><path d="M 170 26.96 L 190 26.99 Q 200 27 205 23.5 L 207.5 21.75 Q 210 20 220 20 L 234.88 20" fill="none" stroke="#6c8ebf" stroke-opacity="0.9" stroke-miterlimit="10" pointer-events="none"/><path d="M 238.88 20 L 234.88 22 L 234.88 18 Z" fill-opacity="0.9" fill="#6c8ebf" stroke="#6c8ebf" stroke-opacity="0.9" stroke-miterlimit="10" pointer-events="none"/><path d="M 170 35 L 175 35 Q 180 35 190 35 L 195 35 Q 200 35 210 35 L 234.88 35" fill="none" stroke="#b85450" stroke-opacity="0.9" stroke-miterlimit="10" pointer-events="none"/><path d="M 238.88 35 L 234.88 37 L 234.88 33 Z" fill-opacity="0.9" fill="#b85450" stroke="#b85450" stroke-opacity="0.9" stroke-miterlimit="10" pointer-events="none"/><path d="M 55 60 Q 70.02 60 70.02 58.51 Q 70.02 57.02 170 57" fill="none" stroke="#6c8ebf" stroke-opacity="0.9" stroke-miterlimit="10" pointer-events="none"/><path d="M 55 60 Q 70.02 60 70.02 62.51 Q 70.02 65.02 150 65" fill="none" stroke="#6c8ebf" stroke-opacity="0.9" stroke-miterlimit="10" pointer-events="none"/><rect x="150" y="60" width="20" height="10" fill="#fff2cc" stroke="#d6b656" pointer-events="none"/><path d="M 170 57 L 234.88 57" fill="none" stroke="#6c8ebf" stroke-opacity="0.9" stroke-miterlimit="10" pointer-events="none"/><path d="M 238.88 57 L 234.88 59 L 234.88 55 Z" fill-opacity="0.9" fill="#6c8ebf" stroke="#6c8ebf" stroke-opacity="0.9" stroke-miterlimit="10" pointer-events="none"/><path d="M 170 65 L 234.88 65" fill="none" stroke="#b85450" stroke-opacity="0.9" stroke-miterlimit="10" pointer-events="none"/><path d="M 238.88 65 L 234.88 67 L 234.88 63 Z" fill-opacity="0.9" fill="#b85450" stroke="#b85450" stroke-opacity="0.9" stroke-miterlimit="10" pointer-events="none"/><rect x="80" y="180" width="20" height="10" fill="#fff2cc" stroke="#d6b656" pointer-events="none"/><g transform="translate(-0.5 -0.5)"><switch><foreignObject style="overflow: visible; text-align: left;" pointer-events="none" width="100%" height="100%" requiredFeatures="http://www.w3.org/TR/SVG11/feature#Extensibility"><div xmlns="http://www.w3.org/1999/xhtml" style="display: flex; align-items: unsafe center; justify-content: unsafe center; width: 68px; height: 1px; padding-top: 184px; margin-left: 103px;"><div style="box-sizing: border-box; font-size: 0px; text-align: center;" data-drawio-colors="color: rgb(0, 0, 0); "><div style="display: inline-block; font-size: 12px; font-family: Helvetica; color: rgb(0, 0, 0); line-height: 1.2; pointer-events: none; white-space: normal; overflow-wrap: normal;"><span style="font-size: 7px">MJPEG Consumer</span></div></div></div></foreignObject><text x="137" y="188" fill="rgb(0, 0, 0)" font-family="Helvetica" font-size="12px" text-anchor="middle">MJPEG Consu...</text></switch></g><path d="M 55 91 Q 55 91 150 91" fill="none" stroke="#82b366" stroke-opacity="0.9" stroke-miterlimit="10" pointer-events="none"/><rect x="150" y="86" width="20" height="10" fill="#fff2cc" stroke="#d6b656" pointer-events="none"/><path d="M 170 90 L 234.88 90" fill="none" stroke="#b85450" stroke-opacity="0.9" stroke-miterlimit="10" pointer-events="none"/><path d="M 238.88 90 L 234.88 92 L 234.88 88 Z" fill-opacity="0.9" fill="#b85450" stroke="#b85450" stroke-opacity="0.9" stroke-miterlimit="10" pointer-events="none"/><path d="M 170 89.92 L 175 89.96 Q 180 90 185 90 L 187.5 90 Q 190 90 195 84.5 L 197.5 81.75 Q 200 79 210 79 L 234.88 79" fill="none" stroke="#b85450" stroke-opacity="0.9" stroke-miterlimit="10" pointer-events="none"/><path d="M 238.88 79 L 234.88 81 L 234.88 77 Z" fill-opacity="0.9" fill="#b85450" stroke="#b85450" stroke-opacity="0.9" stroke-miterlimit="10" pointer-events="none"/><path d="M 170 90 L 175 90 Q 180 90 185 90 L 187.5 90 Q 190 90 195 95.5 L 197.5 98.25 Q 200 101 210 101 L 234.88 101" fill="none" stroke="#b85450" stroke-opacity="0.9" stroke-miterlimit="10" pointer-events="none"/><path d="M 238.88 101 L 234.88 103 L 234.88 99 Z" fill-opacity="0.9" fill="#b85450" stroke="#b85450" stroke-opacity="0.9" stroke-miterlimit="10" pointer-events="none"/><path d="M 170 35 L 180 35 Q 190 35 198.94 39.47 L 204.47 42.24 Q 210 45 220 45 L 234.88 45" fill="none" stroke="#b85450" stroke-opacity="0.9" stroke-miterlimit="10" pointer-events="none"/><path d="M 238.88 45 L 234.88 47 L 234.88 43 Z" fill-opacity="0.9" fill="#b85450" stroke="#b85450" stroke-opacity="0.9" stroke-miterlimit="10" pointer-events="none"/><path d="M 74 170 L 99.88 170" fill="none" stroke="#82b366" stroke-opacity="0.9" stroke-miterlimit="10" pointer-events="none"/><path d="M 102.88 170 L 99.88 171.5 L 99.88 168.5 Z" fill-opacity="0.9" fill="#82b366" stroke="#82b366" stroke-opacity="0.9" stroke-miterlimit="10" pointer-events="none"/><g transform="translate(-0.5 -0.5)"><switch><foreignObject style="overflow: visible; text-align: left;" pointer-events="none" width="100%" height="100%" requiredFeatures="http://www.w3.org/TR/SVG11/feature#Extensibility"><div xmlns="http://www.w3.org/1999/xhtml" style="display: flex; align-items: unsafe center; justify-content: unsafe center; width: 1px; height: 1px; padding-top: 168px; margin-left: 143px;"><div style="box-sizing: border-box; font-size: 0px; text-align: center;" data-drawio-colors="color: rgb(0, 0, 0); "><div style="display: inline-block; font-size: 11px; font-family: Helvetica; color: rgb(0, 0, 0); line-height: 1.2; pointer-events: none; white-space: nowrap;"><font style="font-size: 7px">JPEG via HTTP Polling<br /></font></div></div></div></foreignObject><text x="143" y="172" fill="rgb(0, 0, 0)" font-family="Helvetica" font-size="11px" text-anchor="middle">JPEG via HTTP Polling
</text></switch></g></g><switch><g requiredFeatures="http://www.w3.org/TR/SVG11/feature#Extensibility"/><a transform="translate(0,-5)" xlink:href="https://www.diagrams.net/doc/faq/svg-export-text-problems" target="_blank"><text text-anchor="middle" font-size="10px" x="50%" y="100%">Text is not SVG - cannot display</text></a></switch></svg>