@startuml GlobalApiFramerate
!theme vibrant
left to right direction
title MJPEG Streaming and HTTP Polling with API defined framerate

object Camera {
    * X-MULTIPART stream
    * HTTP REST jpeg
}

namespace CamExpress {
    
    object broadcast {
        Dispatch events
    }
    object CamService {
        Events handling
    }
    
    namespace MJPEG {
        object MJPEGConsumer {
            Stream parsing      
        }
        object frameSkip {
            constant frame rate
        }
    }
    
    namespace Polling {
        object HTTPConsumer {
            Polling handler     
        }
        object httpPolling {
            constant frame rate
        }
    }
}

object Client1 {
}
object Client2 {
}
object Client3 {
}

Camera <-- httpPolling : **HTTP GET**
Camera <--> MJPEGConsumer : **HTTP MJPEG**

httpPolling <-> HTTPConsumer : **pass frame**

CamService -> broadcast : **@events**

MJPEGConsumer -> CamService : **@errors**
frameSkip --> CamService : **@frame**
MJPEGConsumer -> frameSkip : **limit rate**


HTTPConsumer --> CamService : **@frame/@errors**

broadcast <--> Client1 : **WebSocket**
broadcast <--> Client2 : **WebSocket**
broadcast <--> Client3 : **WebSocket**

@enduml