<?xml version="1.0" encoding="UTF-8" standalone="no"?>
<svg xmlns:dc="http://purl.org/dc/elements/1.1/" xmlns:cc="http://creativecommons.org/ns#"
   xmlns:rdf="http://www.w3.org/1999/02/22-rdf-syntax-ns#" xmlns:svg="http://www.w3.org/2000/svg"
   xmlns="http://www.w3.org/2000/svg" xmlns:xlink="http://www.w3.org/1999/xlink"
   xmlns:sodipodi="http://sodipodi.sourceforge.net/DTD/sodipodi-0.dtd"
   xmlns:inkscape="http://www.inkscape.org/namespaces/inkscape" width="210mm" height="297mm" viewBox="0 0 210 297"
   version="1.1" id="svg1049" inkscape:version="1.0.2-2 (e86c870879, 2021-01-15)"
   >
   <style>
      @font-face {
         font-family: 'Source Sans Pro';
         font-style: normal;
         font-weight: 700;
         src: url("https://framework.web.cern.ch/framework/3.0/fonts/sourcesanspro/bold.woff2") format("woff2"), url("https://framework.web.cern.ch/framework/3.0/fonts/sourcesanspro/bold.woff") format("woff"), url("https://framework.web.cern.ch/framework/3.0/fonts/sourcesanspro/bold.ttf") format("truetype"), url("https://framework.web.cern.ch/framework/3.0/fonts/sourcesanspro/bold.svg#sourcesans-bold") format("svg"), url("https://fonts.cdnfonts.com/s/12183/SourceSansPro-Bold.woff") format("woff");
      }

      .title-text {
         font-style: normal;
         font-variant: normal;
         font-weight: bold;
         font-stretch: normal;
         font-size: 11px;
         line-height: 1.25;
         font-family: 'Source Sans Pro';
         -inkscape-font-specification: 'Source Sans Pro, Bold';
         font-variant-ligatures: normal;
         font-variant-caps: normal;
         font-variant-numeric: normal;
         font-variant-east-asian: normal;
         fill: rgb(0, 51, 160);
         fill-opacity: 1;
         stroke: none;
         stroke-width: 0.26459"

      }

      .subtitle-text {
         font-style: normal;
         font-variant: normal;
         font-weight: bold;
         font-stretch: normal;
         font-size: 11.2892px;
         font-family: 'Source Sans Pro';
         font-variant-ligatures: normal;
         font-variant-caps: normal;
         font-variant-numeric: normal;
         font-variant-east-asian: normal;
         fill: #fefefe;
         fill-opacity: 1;
         stroke-width: 0.26459;
      }

      .odd>rect {
         fill: #0d62b6;
         fill-opacity: 1
      }

      .even>rect {
         opacity: 0.5;
         fill: #0d62b6;
         fill-opacity: 1
      }

      #arrowLink {
         fill: rgb(0, 51, 160);
         fill-opacity: 1
      }
   </style>
   <defs id="defsImageRectCLEAR">
      <clipPath clipPathUnits="objectBoundingBox" id="imageRectCLEAR">
         <rect
            style="fill:#fdffff;fill-opacity:1;stroke:none;stroke-width:2.82223;stroke-dasharray:8.46667, 2.82223;stroke-opacity:0.482992;filter:url(#filter59325)"
            id="rectImageRectCLEAR" width="1" height="1" x="0" y="0" rx="0.05" ry=" 0.12875" />
      </clipPath>
   </defs>
   <sodipodi:namedview id="base" pagecolor="#ffffff" bordercolor="#666666" borderopacity="1.0"
      inkscape:pageopacity="0.0" inkscape:pageshadow="2" inkscape:zoom="0.85394567" inkscape:cx="174.92433"
      inkscape:cy="502.72017" inkscape:document-units="mm" inkscape:current-layer="layer1"
      inkscape:document-rotation="0" showgrid="false" inkscape:window-width="1920" inkscape:window-height="1137"
      inkscape:window-x="-8" inkscape:window-y="-8" inkscape:window-maximized="1" />
   <metadata id="metadata1046">
      <rdf:RDF>
         <cc:Work rdf:about="">
            <dc:format>image/svg+xml</dc:format>
            <dc:type rdf:resource="http://purl.org/dc/dcmitype/StillImage" />
            <dc:title></dc:title>
         </cc:Work>
      </rdf:RDF>
   </metadata>
   <g inkscape:label="Layer 1" inkscape:groupmode="layer" id="layer1">
      <g transform="translate(0,10.877045)">
         <!-- <rect width='100%' height='100%' /> -->
         <image width="206" height="80" id="imageCLEAR" x="2" y="2" clip-path="url(#imageRectCLEAR)"
            xlink:href="./slideImages/CLEAR.jpg" preserveAspectRatio="xMidYMid slice" />

         <text class='title-text' x="50%" y="92.5" id="mainTitle" dominant-baseline="central" text-anchor="middle">Beam Intercepting Devices (BIDs)</text>
         <a class='odd' id="row1Link" xlink:href="https://edms.cern.ch/project/CERN-0000239677" target="_blank">
            <rect id="row1Box" width="206" height="20" x="2" y="103" ry="2.5" />
            <!-- to add new rectangles: edit rect:y == previous_rect:y+rect:height and text:y == rect:y+rec:height/2 -->

            <text xml:space="default" class='subtitle-text' x="50%" y="113" id="row1TextBox" dominant-baseline="central"
               text-anchor="middle">CLEAR Movable devices</text>
         </a>
         <a visibility="hidden" class='even' id="row2Link" xlink:href="https://edms.cern.ch/project/CERN-0000196587"
            target="_blank">
            <rect id="row2Box" width="206" x="2" y="123" ry="2.5" height="20" />

            <text class='subtitle-text' x="50%" y="133" id="row2TextBox" dominant-baseline="central"
               text-anchor="middle">AD Target Trolley Motion Control</text>
         </a>
         <a visibility="hidden" class='odd' id="row3Link" xlink:href="https://edms.cern.ch/project/CERN-0000196587"
            target="_blank">
            <rect id="row3Box" width="206" height="20" x="2" y="143" ry="2.5" />

            <text class='subtitle-text' x="50%" y="153" id="row3TextBox" dominant-baseline="central"
               text-anchor="middle">AD Target XY Table Control</text>
         </a>
         <a visibility="hidden" class='even' id="row4Link" xlink:href="https://edms.cern.ch/project/CERN-0000196467"
            target="_blank">
            <rect id="row4Box" width="206" height="20" x="2" y="163" ry="2.5" />

            <text class='subtitle-text' x="50%" y="173" id="row4TextBox" dominant-baseline="central"
               text-anchor="middle">Linac4 RFQ2 Spare 45keV Beam Stopper</text>
         </a>
         <a visibility="hidden" class='odd' id="row5Link" target="_blank"
            xlink:href="https://edms.cern.ch/project/CERN-0000196271">
            <rect id="row5Box" width="206" height="20" x="2" y="183" ry="2.5" />

            <text class='subtitle-text' x="50%" y="193" id="row5TextBox" dominant-baseline="central"
               text-anchor="middle">LHC TDE Monitoring</text>
         </a>
         <a visibility="hidden" class='even' id="row6Link" xlink:href="https://edms.cern.ch/project/CERN-0000221203"
            target="_blank">
            <rect id="row6Box" width="206" height="20" x="2" y="203" ry="2.5" />

            <text class='subtitle-text' x="50%" y="213" id="row6TextBox" dominant-baseline="central"
               text-anchor="middle">NA TAX controls</text>
         </a>
         <a visibility="hidden" class='odd' id="row7Link" xlink:href="https://edms.cern.ch/project/CERN-0000196406"
            target="_blank">
            <rect id="row7Box" width="206" height="20" x="2" y="223" ry="2.5" />

            <text class='subtitle-text' x="50%" y="233" dominant-baseline="central" id="row7TextBox"
               text-anchor="middle">
               NA XTAX cooling monitoring</text>
         </a>
         <!-- <rect id="row8Box" width="106" height="20" x="2" y="253" ry="2.5" /> -->
         <a class='even' id="arrowLink" xlink:href="#acceleratorComplex">

            <!--! Font Awesome Pro 6.1.1 by @fontawesome - https://fontawesome.com License - https://fontawesome.com/license (Commercial License) Copyright 2022 Fonticons, Inc. -->
            <g>
               <rect id="rectArrow" x="92" y="255" width="13" height="15" fill="white" />
               <path
                  d="m 87.413019,263.74591 c 0,6.35197 5.148032,11.5 11.500002,11.5 6.351969,0 11.499999,-5.14803 11.499999,-11.5 0,-6.35197 -5.14803,-11.5 -11.499999,-11.5 -6.35197,0 -11.500002,5.14803 -11.500002,11.5 z m 11.055272,-5.69611 c 0.26958,0.11225 0.44473,0.37287 0.44473,0.66486 v 2.87499 h 4.312489 c 0.79379,0 1.43751,0.64375 1.43751,1.43751 v 1.4375 c 0,0.79376 -0.64372,1.43751 -1.43751,1.43751 h -4.312489 v 2.87499 c 0,0.2906 -0.1749,0.55301 -0.44359,0.66396 -0.26873,0.11168 -0.57771,0.0499 -0.78344,-0.15591 l -5.03128,-5.03125 c -0.28063,-0.28063 -0.28063,-0.73581 0,-1.01613 l 5.03128,-5.03125 c 0.20721,-0.20636 0.51278,-0.26901 0.7823,-0.15675 z"
                  id="pathArrow" style="stroke-width:0.0449218" />
            </g>
         </a>
      </g>
   </g>

</svg>