module gitlab.cern.ch/paas-tools/okd4-deployment/egroup-sync

go 1.13

require (
	github.com/golang/glog v0.0.0-20160126235308-23def4e6c14b
	github.com/spf13/pflag v1.0.5
	k8s.io/api v0.19.0
	k8s.io/apimachinery v0.19.0
	k8s.io/client-go v0.19.0
)
