{
  "test":[
    "RD53A_PULL-UP_RESISTOR",
    "IREFTRIM_FE",
    "ORIENTATION"
  ],
  "html":{
    "RD53A_PULL-UP_RESISTOR": "pullupresult.html",
    "IREFTRIM_FE": "irefresult.html",
    "ORIENTATION": "orienresult.html"
  }
}
