{
  "settings": {
    "index.mapping.total_fields.limit": 500,
    "index.query.default_field": [
      "_data.*"
    ],
    "analysis": {
      "char_filter": {
        "strip_dot_pattern": {
          "type": "pattern_replace",
          "pattern": "\\.",
          "replacement": " "
        }
      },
      "analyzer": {
        "url_analyzer": {
          "tokenizer": "standard",
          "char_filter": [
            "strip_dot_pattern"
          ],
          "filter": [
            "lowercase",
            "asciifolding"
          ]
        }
      },
      "normalizer": {
        "url_normalizer": {
          "type": "custom",
          "char_filter": [
            "strip_dot_pattern"
          ],
          "filter": [
            "lowercase",
            "asciifolding"
          ]
        }
      }
    }
  },
  "mappings": {
    "dynamic": "strict",
    "properties": {
      "_access": {
        "type": "object",
        "properties": {
          "owner": {
            "type": "keyword"
          },
          "read": {
            "type": "keyword"
          },
          "update": {
            "type": "keyword"
          },
          "delete": {
            "type": "keyword"
          }
        }
      },
      "_data": {
        "type": "object",
        "properties": {
          "mtext": {
            "type": "text"
          },
          "url": {
            "type": "text",
            "analyzer": "url_analyzer",
            "fields": {
              "exact_match": {
                "normalizer": "url_normalizer",
                "type": "keyword"
              }
            }
          }
        }
      },
      "asrtype": {
        "type": "keyword"
      },
      "ttpmediaid": {
        "type": "keyword"
      },
      "language": {
        "type": "keyword"
      },
      "begin_hour": {
        "type": "keyword"
      },
      "begin_min": {
        "type": "keyword"
      },
      "begin_sec": {
        "type": "keyword"
      },
      "su_account": {
        "type": "keyword"
      },
      "eventdate": {
        "type": "date"
      },
      "_updated": {
        "type": "date"
      },
      "_created": {
        "type": "date"
      },
      "control_number": {
        "type": "keyword"
      },
      "$schema": {
        "enabled": false
      }
    }
  }
}
