%TF.GenerationSoftware,KiCad,Pcbnew,(5.1.6-0)*%
%TF.CreationDate,2020-10-23T16:21:28-07:00*%
%TF.ProjectId,rd53b_quad_hybrid,72643533-625f-4717-9561-645f68796272,1.5*%
%TF.SameCoordinates,Original*%
%TF.FileFunction,Soldermask,Top*%
%TF.FilePolarity,Negative*%
%FSLAX46Y46*%
G04 Gerber Fmt 4.6, Leading zero omitted, Abs format (unit mm)*
G04 Created by KiCad (PCBNEW (5.1.6-0)) date 2020-10-23 16:21:28*
%MOMM*%
%LPD*%
G01*
G04 APERTURE LIST*
%ADD10R,0.402000X0.102000*%
%ADD11C,0.100000*%
%ADD12R,0.202000X2.502000*%
%ADD13R,0.602000X0.502000*%
%ADD14R,0.602000X0.102000*%
%ADD15R,1.002000X0.102000*%
%ADD16R,0.202000X2.302000*%
%ADD17R,0.202000X1.702000*%
%ADD18R,0.302000X0.352000*%
%ADD19R,0.502000X0.602000*%
%ADD20R,1.002000X1.602000*%
%ADD21R,0.432000X0.282000*%
%ADD22R,0.602000X0.402000*%
%ADD23C,3.202000*%
%ADD24R,0.402000X0.602000*%
%ADD25R,0.282000X0.432000*%
%ADD26R,0.302000X0.702000*%
%ADD27R,0.302000X0.502000*%
%ADD28R,0.352000X1.002000*%
%ADD29R,0.562000X2.757000*%
%ADD30C,1.653000*%
%ADD31C,0.254000*%
G04 APERTURE END LIST*
%TO.C,U3*%
G36*
G01*
X128974000Y-71350500D02*
X128974000Y-71249500D01*
G75*
G02*
X129024500Y-71199000I50500J0D01*
G01*
X129175500Y-71199000D01*
G75*
G02*
X129226000Y-71249500I0J-50500D01*
G01*
X129226000Y-71350500D01*
G75*
G02*
X129175500Y-71401000I-50500J0D01*
G01*
X129024500Y-71401000D01*
G75*
G02*
X128974000Y-71350500I0J50500D01*
G01*
G37*
G36*
G01*
X129576000Y-71499500D02*
X129576000Y-71600500D01*
G75*
G02*
X129525500Y-71651000I-50500J0D01*
G01*
X129374500Y-71651000D01*
G75*
G02*
X129324000Y-71600500I0J50500D01*
G01*
X129324000Y-71499500D01*
G75*
G02*
X129374500Y-71449000I50500J0D01*
G01*
X129525500Y-71449000D01*
G75*
G02*
X129576000Y-71499500I0J-50500D01*
G01*
G37*
D10*
X127850000Y-77800000D03*
X127850000Y-78000000D03*
D11*
G36*
X127349019Y-65249805D02*
G01*
X127349076Y-65249617D01*
X127349169Y-65249444D01*
X127349293Y-65249293D01*
X127349444Y-65249169D01*
X127349617Y-65249076D01*
X127349805Y-65249019D01*
X127350000Y-65249000D01*
X128149000Y-65249000D01*
X128149000Y-63351000D01*
X127350000Y-63351000D01*
X127349805Y-63350981D01*
X127349617Y-63350924D01*
X127349444Y-63350831D01*
X127349293Y-63350707D01*
X127349169Y-63350556D01*
X127349076Y-63350383D01*
X127349019Y-63350195D01*
X127349000Y-63350000D01*
X127349000Y-63250000D01*
X127349019Y-63249805D01*
X127349076Y-63249617D01*
X127349169Y-63249444D01*
X127349293Y-63249293D01*
X127349444Y-63249169D01*
X127349617Y-63249076D01*
X127349805Y-63249019D01*
X127350000Y-63249000D01*
X128149000Y-63249000D01*
X128149000Y-63050000D01*
X128149019Y-63049805D01*
X128149076Y-63049617D01*
X128149169Y-63049444D01*
X128149293Y-63049293D01*
X128149444Y-63049169D01*
X128149617Y-63049076D01*
X128149805Y-63049019D01*
X128150000Y-63049000D01*
X128350000Y-63049000D01*
X128350195Y-63049019D01*
X128350383Y-63049076D01*
X128350556Y-63049169D01*
X128350707Y-63049293D01*
X128350831Y-63049444D01*
X128350924Y-63049617D01*
X128350981Y-63049805D01*
X128351000Y-63050000D01*
X128351000Y-65750000D01*
X128350981Y-65750195D01*
X128350924Y-65750383D01*
X128350831Y-65750556D01*
X128350707Y-65750707D01*
X128350556Y-65750831D01*
X128350383Y-65750924D01*
X128350195Y-65750981D01*
X128350000Y-65751000D01*
X128150000Y-65751000D01*
X128149805Y-65750981D01*
X128149617Y-65750924D01*
X128149444Y-65750831D01*
X128149293Y-65750707D01*
X128149169Y-65750556D01*
X128149076Y-65750383D01*
X128149019Y-65750195D01*
X128149000Y-65750000D01*
X128149000Y-65351000D01*
X127350000Y-65351000D01*
X127349805Y-65350981D01*
X127349617Y-65350924D01*
X127349444Y-65350831D01*
X127349293Y-65350707D01*
X127349169Y-65350556D01*
X127349076Y-65350383D01*
X127349019Y-65350195D01*
X127349000Y-65350000D01*
X127349000Y-65250000D01*
X127349019Y-65249805D01*
G37*
G36*
X127349019Y-69949805D02*
G01*
X127349076Y-69949617D01*
X127349169Y-69949444D01*
X127349293Y-69949293D01*
X127349444Y-69949169D01*
X127349617Y-69949076D01*
X127349805Y-69949019D01*
X127350000Y-69949000D01*
X128149000Y-69949000D01*
X128149000Y-68051000D01*
X127350000Y-68051000D01*
X127349805Y-68050981D01*
X127349617Y-68050924D01*
X127349444Y-68050831D01*
X127349293Y-68050707D01*
X127349169Y-68050556D01*
X127349076Y-68050383D01*
X127349019Y-68050195D01*
X127349000Y-68050000D01*
X127349000Y-67950000D01*
X127349019Y-67949805D01*
X127349076Y-67949617D01*
X127349169Y-67949444D01*
X127349293Y-67949293D01*
X127349444Y-67949169D01*
X127349617Y-67949076D01*
X127349805Y-67949019D01*
X127350000Y-67949000D01*
X128350000Y-67949000D01*
X128350195Y-67949019D01*
X128350383Y-67949076D01*
X128350556Y-67949169D01*
X128350707Y-67949293D01*
X128350831Y-67949444D01*
X128350924Y-67949617D01*
X128350981Y-67949805D01*
X128351000Y-67950000D01*
X128351000Y-72750000D01*
X128350981Y-72750195D01*
X128350924Y-72750383D01*
X128350831Y-72750556D01*
X128350707Y-72750707D01*
X128350556Y-72750831D01*
X128350383Y-72750924D01*
X128350195Y-72750981D01*
X128350000Y-72751000D01*
X128150000Y-72751000D01*
X128149805Y-72750981D01*
X128149617Y-72750924D01*
X128149444Y-72750831D01*
X128149293Y-72750707D01*
X128149169Y-72750556D01*
X128149076Y-72750383D01*
X128149019Y-72750195D01*
X128149000Y-72750000D01*
X128149000Y-70051000D01*
X127350000Y-70051000D01*
X127349805Y-70050981D01*
X127349617Y-70050924D01*
X127349444Y-70050831D01*
X127349293Y-70050707D01*
X127349169Y-70050556D01*
X127349076Y-70050383D01*
X127349019Y-70050195D01*
X127349000Y-70050000D01*
X127349000Y-69950000D01*
X127349019Y-69949805D01*
G37*
G36*
X127349019Y-75749805D02*
G01*
X127349076Y-75749617D01*
X127349169Y-75749444D01*
X127349293Y-75749293D01*
X127349444Y-75749169D01*
X127349617Y-75749076D01*
X127349805Y-75749019D01*
X127350000Y-75749000D01*
X128149000Y-75749000D01*
X128149000Y-73851000D01*
X127350000Y-73851000D01*
X127349805Y-73850981D01*
X127349617Y-73850924D01*
X127349444Y-73850831D01*
X127349293Y-73850707D01*
X127349169Y-73850556D01*
X127349076Y-73850383D01*
X127349019Y-73850195D01*
X127349000Y-73850000D01*
X127349000Y-73750000D01*
X127349019Y-73749805D01*
X127349076Y-73749617D01*
X127349169Y-73749444D01*
X127349293Y-73749293D01*
X127349444Y-73749169D01*
X127349617Y-73749076D01*
X127349805Y-73749019D01*
X127350000Y-73749000D01*
X128149000Y-73749000D01*
X128149000Y-73550000D01*
X128149019Y-73549805D01*
X128149076Y-73549617D01*
X128149169Y-73549444D01*
X128149293Y-73549293D01*
X128149444Y-73549169D01*
X128149617Y-73549076D01*
X128149805Y-73549019D01*
X128150000Y-73549000D01*
X128350000Y-73549000D01*
X128350195Y-73549019D01*
X128350383Y-73549076D01*
X128350556Y-73549169D01*
X128350707Y-73549293D01*
X128350831Y-73549444D01*
X128350924Y-73549617D01*
X128350981Y-73549805D01*
X128351000Y-73550000D01*
X128351000Y-76250000D01*
X128350981Y-76250195D01*
X128350924Y-76250383D01*
X128350831Y-76250556D01*
X128350707Y-76250707D01*
X128350556Y-76250831D01*
X128350383Y-76250924D01*
X128350195Y-76250981D01*
X128350000Y-76251000D01*
X128150000Y-76251000D01*
X128149805Y-76250981D01*
X128149617Y-76250924D01*
X128149444Y-76250831D01*
X128149293Y-76250707D01*
X128149169Y-76250556D01*
X128149076Y-76250383D01*
X128149019Y-76250195D01*
X128149000Y-76250000D01*
X128149000Y-75851000D01*
X127350000Y-75851000D01*
X127349805Y-75850981D01*
X127349617Y-75850924D01*
X127349444Y-75850831D01*
X127349293Y-75850707D01*
X127349169Y-75850556D01*
X127349076Y-75850383D01*
X127349019Y-75850195D01*
X127349000Y-75850000D01*
X127349000Y-75750000D01*
X127349019Y-75749805D01*
G37*
D10*
X127550000Y-65850000D03*
X127550000Y-66100000D03*
D11*
G36*
X127349019Y-80449805D02*
G01*
X127349076Y-80449617D01*
X127349169Y-80449444D01*
X127349293Y-80449293D01*
X127349444Y-80449169D01*
X127349617Y-80449076D01*
X127349805Y-80449019D01*
X127350000Y-80449000D01*
X128149000Y-80449000D01*
X128149000Y-78551000D01*
X127350000Y-78551000D01*
X127349805Y-78550981D01*
X127349617Y-78550924D01*
X127349444Y-78550831D01*
X127349293Y-78550707D01*
X127349169Y-78550556D01*
X127349076Y-78550383D01*
X127349019Y-78550195D01*
X127349000Y-78550000D01*
X127349000Y-78450000D01*
X127349019Y-78449805D01*
X127349076Y-78449617D01*
X127349169Y-78449444D01*
X127349293Y-78449293D01*
X127349444Y-78449169D01*
X127349617Y-78449076D01*
X127349805Y-78449019D01*
X127350000Y-78449000D01*
X128149000Y-78449000D01*
X128149000Y-77250000D01*
X128149019Y-77249805D01*
X128149076Y-77249617D01*
X128149169Y-77249444D01*
X128149293Y-77249293D01*
X128149444Y-77249169D01*
X128149617Y-77249076D01*
X128149805Y-77249019D01*
X128150000Y-77249000D01*
X128350000Y-77249000D01*
X128350195Y-77249019D01*
X128350383Y-77249076D01*
X128350556Y-77249169D01*
X128350707Y-77249293D01*
X128350831Y-77249444D01*
X128350924Y-77249617D01*
X128350981Y-77249805D01*
X128351000Y-77250000D01*
X128351000Y-81150000D01*
X128350981Y-81150195D01*
X128350924Y-81150383D01*
X128350831Y-81150556D01*
X128350707Y-81150707D01*
X128350556Y-81150831D01*
X128350383Y-81150924D01*
X128350195Y-81150981D01*
X128350000Y-81151000D01*
X128150000Y-81151000D01*
X128149805Y-81150981D01*
X128149617Y-81150924D01*
X128149444Y-81150831D01*
X128149293Y-81150707D01*
X128149169Y-81150556D01*
X128149076Y-81150383D01*
X128149019Y-81150195D01*
X128149000Y-81150000D01*
X128149000Y-80551000D01*
X127350000Y-80551000D01*
X127349805Y-80550981D01*
X127349617Y-80550924D01*
X127349444Y-80550831D01*
X127349293Y-80550707D01*
X127349169Y-80550556D01*
X127349076Y-80550383D01*
X127349019Y-80550195D01*
X127349000Y-80550000D01*
X127349000Y-80450000D01*
X127349019Y-80449805D01*
G37*
D12*
X127950000Y-71500000D03*
D13*
X127650000Y-64300000D03*
X127650000Y-63700000D03*
X127650000Y-64900000D03*
X127650000Y-69000000D03*
X127650000Y-68400000D03*
X127650000Y-69600000D03*
X127650000Y-74200000D03*
X127650000Y-74800000D03*
X127650000Y-75400000D03*
X127650000Y-79500000D03*
X127650000Y-78900000D03*
X127650000Y-80100000D03*
D14*
X127650000Y-63100000D03*
D15*
X127850000Y-67200000D03*
X127850000Y-67400000D03*
X127850000Y-67600000D03*
X127850000Y-67800000D03*
D10*
X127550000Y-70550000D03*
X127550000Y-70800000D03*
X127550000Y-71050000D03*
X127550000Y-71300000D03*
X127550000Y-71750000D03*
X127550000Y-72000000D03*
X127550000Y-72250000D03*
X127550000Y-72500000D03*
X127550000Y-72900000D03*
X127550000Y-73150000D03*
D14*
X127650000Y-76000000D03*
X127650000Y-76200000D03*
X127650000Y-76400000D03*
X127650000Y-76600000D03*
X127650000Y-76800000D03*
X127650000Y-77000000D03*
X127650000Y-77200000D03*
X127650000Y-77400000D03*
X127650000Y-77600000D03*
X127650000Y-80700000D03*
X127650000Y-80900000D03*
X127650000Y-81100000D03*
D15*
X127850000Y-81300000D03*
X127850000Y-81500000D03*
X127850000Y-81700000D03*
%TD*%
D10*
%TO.C,U5*%
X92650000Y-53750000D03*
X92650000Y-53500000D03*
X92650000Y-53250000D03*
X92650000Y-53000000D03*
X92350000Y-46500000D03*
X92350000Y-46300000D03*
D11*
G36*
X92850981Y-59050195D02*
G01*
X92850924Y-59050383D01*
X92850831Y-59050556D01*
X92850707Y-59050707D01*
X92850556Y-59050831D01*
X92850383Y-59050924D01*
X92850195Y-59050981D01*
X92850000Y-59051000D01*
X92051000Y-59051000D01*
X92051000Y-60949000D01*
X92850000Y-60949000D01*
X92850195Y-60949019D01*
X92850383Y-60949076D01*
X92850556Y-60949169D01*
X92850707Y-60949293D01*
X92850831Y-60949444D01*
X92850924Y-60949617D01*
X92850981Y-60949805D01*
X92851000Y-60950000D01*
X92851000Y-61050000D01*
X92850981Y-61050195D01*
X92850924Y-61050383D01*
X92850831Y-61050556D01*
X92850707Y-61050707D01*
X92850556Y-61050831D01*
X92850383Y-61050924D01*
X92850195Y-61050981D01*
X92850000Y-61051000D01*
X92051000Y-61051000D01*
X92051000Y-61250000D01*
X92050981Y-61250195D01*
X92050924Y-61250383D01*
X92050831Y-61250556D01*
X92050707Y-61250707D01*
X92050556Y-61250831D01*
X92050383Y-61250924D01*
X92050195Y-61250981D01*
X92050000Y-61251000D01*
X91850000Y-61251000D01*
X91849805Y-61250981D01*
X91849617Y-61250924D01*
X91849444Y-61250831D01*
X91849293Y-61250707D01*
X91849169Y-61250556D01*
X91849076Y-61250383D01*
X91849019Y-61250195D01*
X91849000Y-61250000D01*
X91849000Y-58550000D01*
X91849019Y-58549805D01*
X91849076Y-58549617D01*
X91849169Y-58549444D01*
X91849293Y-58549293D01*
X91849444Y-58549169D01*
X91849617Y-58549076D01*
X91849805Y-58549019D01*
X91850000Y-58549000D01*
X92050000Y-58549000D01*
X92050195Y-58549019D01*
X92050383Y-58549076D01*
X92050556Y-58549169D01*
X92050707Y-58549293D01*
X92050831Y-58549444D01*
X92050924Y-58549617D01*
X92050981Y-58549805D01*
X92051000Y-58550000D01*
X92051000Y-58949000D01*
X92850000Y-58949000D01*
X92850195Y-58949019D01*
X92850383Y-58949076D01*
X92850556Y-58949169D01*
X92850707Y-58949293D01*
X92850831Y-58949444D01*
X92850924Y-58949617D01*
X92850981Y-58949805D01*
X92851000Y-58950000D01*
X92851000Y-59050000D01*
X92850981Y-59050195D01*
G37*
G36*
X92850981Y-54350195D02*
G01*
X92850924Y-54350383D01*
X92850831Y-54350556D01*
X92850707Y-54350707D01*
X92850556Y-54350831D01*
X92850383Y-54350924D01*
X92850195Y-54350981D01*
X92850000Y-54351000D01*
X92051000Y-54351000D01*
X92051000Y-56249000D01*
X92850000Y-56249000D01*
X92850195Y-56249019D01*
X92850383Y-56249076D01*
X92850556Y-56249169D01*
X92850707Y-56249293D01*
X92850831Y-56249444D01*
X92850924Y-56249617D01*
X92850981Y-56249805D01*
X92851000Y-56250000D01*
X92851000Y-56350000D01*
X92850981Y-56350195D01*
X92850924Y-56350383D01*
X92850831Y-56350556D01*
X92850707Y-56350707D01*
X92850556Y-56350831D01*
X92850383Y-56350924D01*
X92850195Y-56350981D01*
X92850000Y-56351000D01*
X91850000Y-56351000D01*
X91849805Y-56350981D01*
X91849617Y-56350924D01*
X91849444Y-56350831D01*
X91849293Y-56350707D01*
X91849169Y-56350556D01*
X91849076Y-56350383D01*
X91849019Y-56350195D01*
X91849000Y-56350000D01*
X91849000Y-51550000D01*
X91849019Y-51549805D01*
X91849076Y-51549617D01*
X91849169Y-51549444D01*
X91849293Y-51549293D01*
X91849444Y-51549169D01*
X91849617Y-51549076D01*
X91849805Y-51549019D01*
X91850000Y-51549000D01*
X92050000Y-51549000D01*
X92050195Y-51549019D01*
X92050383Y-51549076D01*
X92050556Y-51549169D01*
X92050707Y-51549293D01*
X92050831Y-51549444D01*
X92050924Y-51549617D01*
X92050981Y-51549805D01*
X92051000Y-51550000D01*
X92051000Y-54249000D01*
X92850000Y-54249000D01*
X92850195Y-54249019D01*
X92850383Y-54249076D01*
X92850556Y-54249169D01*
X92850707Y-54249293D01*
X92850831Y-54249444D01*
X92850924Y-54249617D01*
X92850981Y-54249805D01*
X92851000Y-54250000D01*
X92851000Y-54350000D01*
X92850981Y-54350195D01*
G37*
G36*
X92850981Y-48550195D02*
G01*
X92850924Y-48550383D01*
X92850831Y-48550556D01*
X92850707Y-48550707D01*
X92850556Y-48550831D01*
X92850383Y-48550924D01*
X92850195Y-48550981D01*
X92850000Y-48551000D01*
X92051000Y-48551000D01*
X92051000Y-50449000D01*
X92850000Y-50449000D01*
X92850195Y-50449019D01*
X92850383Y-50449076D01*
X92850556Y-50449169D01*
X92850707Y-50449293D01*
X92850831Y-50449444D01*
X92850924Y-50449617D01*
X92850981Y-50449805D01*
X92851000Y-50450000D01*
X92851000Y-50550000D01*
X92850981Y-50550195D01*
X92850924Y-50550383D01*
X92850831Y-50550556D01*
X92850707Y-50550707D01*
X92850556Y-50550831D01*
X92850383Y-50550924D01*
X92850195Y-50550981D01*
X92850000Y-50551000D01*
X92051000Y-50551000D01*
X92051000Y-50750000D01*
X92050981Y-50750195D01*
X92050924Y-50750383D01*
X92050831Y-50750556D01*
X92050707Y-50750707D01*
X92050556Y-50750831D01*
X92050383Y-50750924D01*
X92050195Y-50750981D01*
X92050000Y-50751000D01*
X91850000Y-50751000D01*
X91849805Y-50750981D01*
X91849617Y-50750924D01*
X91849444Y-50750831D01*
X91849293Y-50750707D01*
X91849169Y-50750556D01*
X91849076Y-50750383D01*
X91849019Y-50750195D01*
X91849000Y-50750000D01*
X91849000Y-48050000D01*
X91849019Y-48049805D01*
X91849076Y-48049617D01*
X91849169Y-48049444D01*
X91849293Y-48049293D01*
X91849444Y-48049169D01*
X91849617Y-48049076D01*
X91849805Y-48049019D01*
X91850000Y-48049000D01*
X92050000Y-48049000D01*
X92050195Y-48049019D01*
X92050383Y-48049076D01*
X92050556Y-48049169D01*
X92050707Y-48049293D01*
X92050831Y-48049444D01*
X92050924Y-48049617D01*
X92050981Y-48049805D01*
X92051000Y-48050000D01*
X92051000Y-48449000D01*
X92850000Y-48449000D01*
X92850195Y-48449019D01*
X92850383Y-48449076D01*
X92850556Y-48449169D01*
X92850707Y-48449293D01*
X92850831Y-48449444D01*
X92850924Y-48449617D01*
X92850981Y-48449805D01*
X92851000Y-48450000D01*
X92851000Y-48550000D01*
X92850981Y-48550195D01*
G37*
D10*
X92650000Y-58450000D03*
X92650000Y-58200000D03*
D11*
G36*
X92850981Y-43850195D02*
G01*
X92850924Y-43850383D01*
X92850831Y-43850556D01*
X92850707Y-43850707D01*
X92850556Y-43850831D01*
X92850383Y-43850924D01*
X92850195Y-43850981D01*
X92850000Y-43851000D01*
X92051000Y-43851000D01*
X92051000Y-45749000D01*
X92850000Y-45749000D01*
X92850195Y-45749019D01*
X92850383Y-45749076D01*
X92850556Y-45749169D01*
X92850707Y-45749293D01*
X92850831Y-45749444D01*
X92850924Y-45749617D01*
X92850981Y-45749805D01*
X92851000Y-45750000D01*
X92851000Y-45850000D01*
X92850981Y-45850195D01*
X92850924Y-45850383D01*
X92850831Y-45850556D01*
X92850707Y-45850707D01*
X92850556Y-45850831D01*
X92850383Y-45850924D01*
X92850195Y-45850981D01*
X92850000Y-45851000D01*
X92051000Y-45851000D01*
X92051000Y-47050000D01*
X92050981Y-47050195D01*
X92050924Y-47050383D01*
X92050831Y-47050556D01*
X92050707Y-47050707D01*
X92050556Y-47050831D01*
X92050383Y-47050924D01*
X92050195Y-47050981D01*
X92050000Y-47051000D01*
X91850000Y-47051000D01*
X91849805Y-47050981D01*
X91849617Y-47050924D01*
X91849444Y-47050831D01*
X91849293Y-47050707D01*
X91849169Y-47050556D01*
X91849076Y-47050383D01*
X91849019Y-47050195D01*
X91849000Y-47050000D01*
X91849000Y-43150000D01*
X91849019Y-43149805D01*
X91849076Y-43149617D01*
X91849169Y-43149444D01*
X91849293Y-43149293D01*
X91849444Y-43149169D01*
X91849617Y-43149076D01*
X91849805Y-43149019D01*
X91850000Y-43149000D01*
X92050000Y-43149000D01*
X92050195Y-43149019D01*
X92050383Y-43149076D01*
X92050556Y-43149169D01*
X92050707Y-43149293D01*
X92050831Y-43149444D01*
X92050924Y-43149617D01*
X92050981Y-43149805D01*
X92051000Y-43150000D01*
X92051000Y-43749000D01*
X92850000Y-43749000D01*
X92850195Y-43749019D01*
X92850383Y-43749076D01*
X92850556Y-43749169D01*
X92850707Y-43749293D01*
X92850831Y-43749444D01*
X92850924Y-43749617D01*
X92850981Y-43749805D01*
X92851000Y-43750000D01*
X92851000Y-43850000D01*
X92850981Y-43850195D01*
G37*
D16*
X92250000Y-52700000D03*
D13*
X92550000Y-60000000D03*
X92550000Y-60600000D03*
X92550000Y-59400000D03*
X92550000Y-55300000D03*
X92550000Y-55900000D03*
X92550000Y-54700000D03*
X92550000Y-50100000D03*
X92550000Y-49500000D03*
X92550000Y-48900000D03*
X92550000Y-44800000D03*
X92550000Y-45400000D03*
X92550000Y-44200000D03*
D14*
X92550000Y-61200000D03*
D15*
X92350000Y-57100000D03*
X92350000Y-56900000D03*
X92350000Y-56700000D03*
X92350000Y-56500000D03*
D10*
X92650000Y-52550000D03*
X92650000Y-52300000D03*
X92650000Y-52050000D03*
X92650000Y-51800000D03*
G36*
G01*
X92825500Y-51451000D02*
X92474500Y-51451000D01*
G75*
G02*
X92449000Y-51425500I0J25500D01*
G01*
X92449000Y-51374500D01*
G75*
G02*
X92474500Y-51349000I25500J0D01*
G01*
X92825500Y-51349000D01*
G75*
G02*
X92851000Y-51374500I0J-25500D01*
G01*
X92851000Y-51425500D01*
G75*
G02*
X92825500Y-51451000I-25500J0D01*
G01*
G37*
G36*
G01*
X92825500Y-51201000D02*
X92474500Y-51201000D01*
G75*
G02*
X92449000Y-51175500I0J25500D01*
G01*
X92449000Y-51124500D01*
G75*
G02*
X92474500Y-51099000I25500J0D01*
G01*
X92825500Y-51099000D01*
G75*
G02*
X92851000Y-51124500I0J-25500D01*
G01*
X92851000Y-51175500D01*
G75*
G02*
X92825500Y-51201000I-25500J0D01*
G01*
G37*
D14*
X92550000Y-48300000D03*
X92550000Y-48100000D03*
X92550000Y-47900000D03*
X92550000Y-47700000D03*
X92550000Y-47500000D03*
X92550000Y-47300000D03*
X92550000Y-47100000D03*
X92550000Y-46900000D03*
X92550000Y-46700000D03*
X92550000Y-43600000D03*
X92550000Y-43400000D03*
X92550000Y-43200000D03*
D15*
X92350000Y-43000000D03*
X92350000Y-42800000D03*
X92350000Y-42600000D03*
%TD*%
%TO.C,U2*%
G36*
G01*
X91176000Y-72899500D02*
X91176000Y-73000500D01*
G75*
G02*
X91125500Y-73051000I-50500J0D01*
G01*
X90974500Y-73051000D01*
G75*
G02*
X90924000Y-73000500I0J50500D01*
G01*
X90924000Y-72899500D01*
G75*
G02*
X90974500Y-72849000I50500J0D01*
G01*
X91125500Y-72849000D01*
G75*
G02*
X91176000Y-72899500I0J-50500D01*
G01*
G37*
D10*
X92350000Y-66750000D03*
X92350000Y-66550000D03*
D11*
G36*
X92850981Y-79000195D02*
G01*
X92850924Y-79000383D01*
X92850831Y-79000556D01*
X92850707Y-79000707D01*
X92850556Y-79000831D01*
X92850383Y-79000924D01*
X92850195Y-79000981D01*
X92850000Y-79001000D01*
X92051000Y-79001000D01*
X92051000Y-80899000D01*
X92850000Y-80899000D01*
X92850195Y-80899019D01*
X92850383Y-80899076D01*
X92850556Y-80899169D01*
X92850707Y-80899293D01*
X92850831Y-80899444D01*
X92850924Y-80899617D01*
X92850981Y-80899805D01*
X92851000Y-80900000D01*
X92851000Y-81000000D01*
X92850981Y-81000195D01*
X92850924Y-81000383D01*
X92850831Y-81000556D01*
X92850707Y-81000707D01*
X92850556Y-81000831D01*
X92850383Y-81000924D01*
X92850195Y-81000981D01*
X92850000Y-81001000D01*
X92051000Y-81001000D01*
X92051000Y-81200000D01*
X92050981Y-81200195D01*
X92050924Y-81200383D01*
X92050831Y-81200556D01*
X92050707Y-81200707D01*
X92050556Y-81200831D01*
X92050383Y-81200924D01*
X92050195Y-81200981D01*
X92050000Y-81201000D01*
X91850000Y-81201000D01*
X91849805Y-81200981D01*
X91849617Y-81200924D01*
X91849444Y-81200831D01*
X91849293Y-81200707D01*
X91849169Y-81200556D01*
X91849076Y-81200383D01*
X91849019Y-81200195D01*
X91849000Y-81200000D01*
X91849000Y-78500000D01*
X91849019Y-78499805D01*
X91849076Y-78499617D01*
X91849169Y-78499444D01*
X91849293Y-78499293D01*
X91849444Y-78499169D01*
X91849617Y-78499076D01*
X91849805Y-78499019D01*
X91850000Y-78499000D01*
X92050000Y-78499000D01*
X92050195Y-78499019D01*
X92050383Y-78499076D01*
X92050556Y-78499169D01*
X92050707Y-78499293D01*
X92050831Y-78499444D01*
X92050924Y-78499617D01*
X92050981Y-78499805D01*
X92051000Y-78500000D01*
X92051000Y-78899000D01*
X92850000Y-78899000D01*
X92850195Y-78899019D01*
X92850383Y-78899076D01*
X92850556Y-78899169D01*
X92850707Y-78899293D01*
X92850831Y-78899444D01*
X92850924Y-78899617D01*
X92850981Y-78899805D01*
X92851000Y-78900000D01*
X92851000Y-79000000D01*
X92850981Y-79000195D01*
G37*
G36*
X92850981Y-74100195D02*
G01*
X92850924Y-74100383D01*
X92850831Y-74100556D01*
X92850707Y-74100707D01*
X92850556Y-74100831D01*
X92850383Y-74100924D01*
X92850195Y-74100981D01*
X92850000Y-74101000D01*
X92051000Y-74101000D01*
X92051000Y-75999000D01*
X92850000Y-75999000D01*
X92850195Y-75999019D01*
X92850383Y-75999076D01*
X92850556Y-75999169D01*
X92850707Y-75999293D01*
X92850831Y-75999444D01*
X92850924Y-75999617D01*
X92850981Y-75999805D01*
X92851000Y-76000000D01*
X92851000Y-76100000D01*
X92850981Y-76100195D01*
X92850924Y-76100383D01*
X92850831Y-76100556D01*
X92850707Y-76100707D01*
X92850556Y-76100831D01*
X92850383Y-76100924D01*
X92850195Y-76100981D01*
X92850000Y-76101000D01*
X91850000Y-76101000D01*
X91849805Y-76100981D01*
X91849617Y-76100924D01*
X91849444Y-76100831D01*
X91849293Y-76100707D01*
X91849169Y-76100556D01*
X91849076Y-76100383D01*
X91849019Y-76100195D01*
X91849000Y-76100000D01*
X91849000Y-71900000D01*
X91849019Y-71899805D01*
X91849076Y-71899617D01*
X91849169Y-71899444D01*
X91849293Y-71899293D01*
X91849444Y-71899169D01*
X91849617Y-71899076D01*
X91849805Y-71899019D01*
X91850000Y-71899000D01*
X92050000Y-71899000D01*
X92050195Y-71899019D01*
X92050383Y-71899076D01*
X92050556Y-71899169D01*
X92050707Y-71899293D01*
X92050831Y-71899444D01*
X92050924Y-71899617D01*
X92050981Y-71899805D01*
X92051000Y-71900000D01*
X92051000Y-73999000D01*
X92850000Y-73999000D01*
X92850195Y-73999019D01*
X92850383Y-73999076D01*
X92850556Y-73999169D01*
X92850707Y-73999293D01*
X92850831Y-73999444D01*
X92850924Y-73999617D01*
X92850981Y-73999805D01*
X92851000Y-74000000D01*
X92851000Y-74100000D01*
X92850981Y-74100195D01*
G37*
G36*
X92850981Y-68800195D02*
G01*
X92850924Y-68800383D01*
X92850831Y-68800556D01*
X92850707Y-68800707D01*
X92850556Y-68800831D01*
X92850383Y-68800924D01*
X92850195Y-68800981D01*
X92850000Y-68801000D01*
X92051000Y-68801000D01*
X92051000Y-70699000D01*
X92850000Y-70699000D01*
X92850195Y-70699019D01*
X92850383Y-70699076D01*
X92850556Y-70699169D01*
X92850707Y-70699293D01*
X92850831Y-70699444D01*
X92850924Y-70699617D01*
X92850981Y-70699805D01*
X92851000Y-70700000D01*
X92851000Y-70800000D01*
X92850981Y-70800195D01*
X92850924Y-70800383D01*
X92850831Y-70800556D01*
X92850707Y-70800707D01*
X92850556Y-70800831D01*
X92850383Y-70800924D01*
X92850195Y-70800981D01*
X92850000Y-70801000D01*
X92051000Y-70801000D01*
X92051000Y-71000000D01*
X92050981Y-71000195D01*
X92050924Y-71000383D01*
X92050831Y-71000556D01*
X92050707Y-71000707D01*
X92050556Y-71000831D01*
X92050383Y-71000924D01*
X92050195Y-71000981D01*
X92050000Y-71001000D01*
X91850000Y-71001000D01*
X91849805Y-71000981D01*
X91849617Y-71000924D01*
X91849444Y-71000831D01*
X91849293Y-71000707D01*
X91849169Y-71000556D01*
X91849076Y-71000383D01*
X91849019Y-71000195D01*
X91849000Y-71000000D01*
X91849000Y-68300000D01*
X91849019Y-68299805D01*
X91849076Y-68299617D01*
X91849169Y-68299444D01*
X91849293Y-68299293D01*
X91849444Y-68299169D01*
X91849617Y-68299076D01*
X91849805Y-68299019D01*
X91850000Y-68299000D01*
X92050000Y-68299000D01*
X92050195Y-68299019D01*
X92050383Y-68299076D01*
X92050556Y-68299169D01*
X92050707Y-68299293D01*
X92050831Y-68299444D01*
X92050924Y-68299617D01*
X92050981Y-68299805D01*
X92051000Y-68300000D01*
X92051000Y-68699000D01*
X92850000Y-68699000D01*
X92850195Y-68699019D01*
X92850383Y-68699076D01*
X92850556Y-68699169D01*
X92850707Y-68699293D01*
X92850831Y-68699444D01*
X92850924Y-68699617D01*
X92850981Y-68699805D01*
X92851000Y-68700000D01*
X92851000Y-68800000D01*
X92850981Y-68800195D01*
G37*
G36*
X92850981Y-64100195D02*
G01*
X92850924Y-64100383D01*
X92850831Y-64100556D01*
X92850707Y-64100707D01*
X92850556Y-64100831D01*
X92850383Y-64100924D01*
X92850195Y-64100981D01*
X92850000Y-64101000D01*
X92051000Y-64101000D01*
X92051000Y-65999000D01*
X92850000Y-65999000D01*
X92850195Y-65999019D01*
X92850383Y-65999076D01*
X92850556Y-65999169D01*
X92850707Y-65999293D01*
X92850831Y-65999444D01*
X92850924Y-65999617D01*
X92850981Y-65999805D01*
X92851000Y-66000000D01*
X92851000Y-66100000D01*
X92850981Y-66100195D01*
X92850924Y-66100383D01*
X92850831Y-66100556D01*
X92850707Y-66100707D01*
X92850556Y-66100831D01*
X92850383Y-66100924D01*
X92850195Y-66100981D01*
X92850000Y-66101000D01*
X92051000Y-66101000D01*
X92051000Y-67300000D01*
X92050981Y-67300195D01*
X92050924Y-67300383D01*
X92050831Y-67300556D01*
X92050707Y-67300707D01*
X92050556Y-67300831D01*
X92050383Y-67300924D01*
X92050195Y-67300981D01*
X92050000Y-67301000D01*
X91850000Y-67301000D01*
X91849805Y-67300981D01*
X91849617Y-67300924D01*
X91849444Y-67300831D01*
X91849293Y-67300707D01*
X91849169Y-67300556D01*
X91849076Y-67300383D01*
X91849019Y-67300195D01*
X91849000Y-67300000D01*
X91849000Y-63400000D01*
X91849019Y-63399805D01*
X91849076Y-63399617D01*
X91849169Y-63399444D01*
X91849293Y-63399293D01*
X91849444Y-63399169D01*
X91849617Y-63399076D01*
X91849805Y-63399019D01*
X91850000Y-63399000D01*
X92050000Y-63399000D01*
X92050195Y-63399019D01*
X92050383Y-63399076D01*
X92050556Y-63399169D01*
X92050707Y-63399293D01*
X92050831Y-63399444D01*
X92050924Y-63399617D01*
X92050981Y-63399805D01*
X92051000Y-63400000D01*
X92051000Y-63999000D01*
X92850000Y-63999000D01*
X92850195Y-63999019D01*
X92850383Y-63999076D01*
X92850556Y-63999169D01*
X92850707Y-63999293D01*
X92850831Y-63999444D01*
X92850924Y-63999617D01*
X92850981Y-63999805D01*
X92851000Y-64000000D01*
X92851000Y-64100000D01*
X92850981Y-64100195D01*
G37*
D17*
X92250000Y-72750000D03*
D13*
X92550000Y-79950000D03*
X92550000Y-80550000D03*
X92550000Y-79350000D03*
X92550000Y-75050000D03*
X92550000Y-75650000D03*
X92550000Y-74450000D03*
X92550000Y-70350000D03*
X92550000Y-69750000D03*
X92550000Y-69150000D03*
X92550000Y-65050000D03*
X92550000Y-65650000D03*
X92550000Y-64450000D03*
D10*
X92650000Y-77600000D03*
X92650000Y-77850000D03*
X92650000Y-77350000D03*
X92650000Y-77100000D03*
D14*
X92550000Y-81150000D03*
D15*
X92350000Y-76850000D03*
X92350000Y-76650000D03*
X92350000Y-76450000D03*
X92350000Y-76250000D03*
G36*
G01*
X90876000Y-73099500D02*
X90876000Y-73200500D01*
G75*
G02*
X90825500Y-73251000I-50500J0D01*
G01*
X90674500Y-73251000D01*
G75*
G02*
X90624000Y-73200500I0J50500D01*
G01*
X90624000Y-73099500D01*
G75*
G02*
X90674500Y-73049000I50500J0D01*
G01*
X90825500Y-73049000D01*
G75*
G02*
X90876000Y-73099500I0J-50500D01*
G01*
G37*
D10*
X92650000Y-72900000D03*
X92650000Y-72650000D03*
X92650000Y-72400000D03*
X92650000Y-72150000D03*
X92650000Y-71750000D03*
X92650000Y-71500000D03*
D14*
X92550000Y-68550000D03*
X92550000Y-68350000D03*
X92550000Y-68150000D03*
X92550000Y-67950000D03*
X92550000Y-67750000D03*
X92550000Y-67550000D03*
X92550000Y-67350000D03*
X92550000Y-67150000D03*
X92550000Y-66950000D03*
X92550000Y-63850000D03*
X92550000Y-63650000D03*
X92550000Y-63450000D03*
D15*
X92350000Y-63250000D03*
X92350000Y-63050000D03*
X92350000Y-62850000D03*
%TD*%
D18*
%TO.C,C103*%
X94180000Y-61650000D03*
X93620000Y-61650000D03*
%TD*%
%TO.C,C93*%
X104480000Y-42800000D03*
X103920000Y-42800000D03*
%TD*%
%TO.C,C84*%
X121520000Y-42800000D03*
X122080000Y-42800000D03*
%TD*%
%TO.C,C74*%
X126120000Y-61700000D03*
X126680000Y-61700000D03*
%TD*%
%TO.C,C65*%
X126120000Y-62650000D03*
X126680000Y-62650000D03*
%TD*%
%TO.C,C55*%
X116320000Y-81500000D03*
X116880000Y-81500000D03*
%TD*%
%TO.C,C46*%
X95180000Y-81500000D03*
X94620000Y-81500000D03*
%TD*%
%TO.C,C36*%
X94180000Y-62600000D03*
X93620000Y-62600000D03*
%TD*%
D19*
%TO.C,C107*%
X114700000Y-60450000D03*
X114700000Y-61550000D03*
%TD*%
D13*
%TO.C,C102*%
X100250000Y-57500000D03*
X101350000Y-57500000D03*
%TD*%
%TO.C,C95*%
X97650000Y-46000000D03*
X98750000Y-46000000D03*
%TD*%
%TO.C,C88*%
X100250000Y-43300000D03*
X101350000Y-43300000D03*
%TD*%
%TO.C,C83*%
X119050000Y-47700000D03*
X117950000Y-47700000D03*
%TD*%
%TO.C,C76*%
X119950000Y-57900000D03*
X118850000Y-57900000D03*
%TD*%
%TO.C,C69*%
X122550000Y-63500000D03*
X121450000Y-63500000D03*
%TD*%
%TO.C,C64*%
X122550000Y-68100000D03*
X121450000Y-68100000D03*
%TD*%
%TO.C,C57*%
X122550000Y-78300000D03*
X121450000Y-78300000D03*
%TD*%
%TO.C,C50*%
X119950000Y-81000000D03*
X118850000Y-81000000D03*
%TD*%
%TO.C,C45*%
X96950000Y-75200000D03*
X98050000Y-75200000D03*
%TD*%
%TO.C,C38*%
X97650000Y-65700000D03*
X98750000Y-65700000D03*
%TD*%
%TO.C,C31*%
X97650000Y-60100000D03*
X98750000Y-60100000D03*
%TD*%
%TO.C,C30*%
X124750000Y-52100000D03*
X125850000Y-52100000D03*
%TD*%
%TO.C,C29*%
X124750000Y-52900000D03*
X125850000Y-52900000D03*
%TD*%
%TO.C,C28*%
X124750000Y-72400000D03*
X125850000Y-72400000D03*
%TD*%
%TO.C,C27*%
X124750000Y-73200000D03*
X125850000Y-73200000D03*
%TD*%
%TO.C,C26*%
X95450000Y-72200000D03*
X94350000Y-72200000D03*
%TD*%
%TO.C,C25*%
X95450000Y-71400000D03*
X94350000Y-71400000D03*
%TD*%
%TO.C,C24*%
X95450000Y-51900000D03*
X94350000Y-51900000D03*
%TD*%
%TO.C,C23*%
X95450000Y-51100000D03*
X94350000Y-51100000D03*
%TD*%
%TO.C,C22*%
X118050000Y-56200000D03*
X116950000Y-56200000D03*
%TD*%
%TO.C,C21*%
X119950000Y-76600000D03*
X118850000Y-76600000D03*
%TD*%
%TO.C,C20*%
X100250000Y-67700000D03*
X101350000Y-67700000D03*
%TD*%
%TO.C,C19*%
X100250000Y-47900000D03*
X101350000Y-47900000D03*
%TD*%
D19*
%TO.C,C9*%
X105400000Y-60450000D03*
X105400000Y-61550000D03*
%TD*%
D20*
%TO.C,C18*%
X102300000Y-80700000D03*
X99300000Y-80700000D03*
%TD*%
D15*
%TO.C,U4*%
X127850000Y-61450000D03*
X127850000Y-61250000D03*
X127850000Y-61050000D03*
D14*
X127650000Y-60850000D03*
X127650000Y-60650000D03*
X127650000Y-60450000D03*
X127650000Y-57350000D03*
X127650000Y-57150000D03*
X127650000Y-56950000D03*
X127650000Y-56750000D03*
X127650000Y-56550000D03*
X127650000Y-56350000D03*
X127650000Y-56150000D03*
X127650000Y-55950000D03*
X127650000Y-55750000D03*
D10*
X127550000Y-52900000D03*
X127550000Y-52650000D03*
X127550000Y-52250000D03*
X127550000Y-52000000D03*
X127550000Y-51750000D03*
X127550000Y-51500000D03*
D15*
X127850000Y-48050000D03*
X127850000Y-47850000D03*
X127850000Y-47650000D03*
X127850000Y-47450000D03*
D14*
X127650000Y-42850000D03*
D10*
X127550000Y-47200000D03*
X127550000Y-46950000D03*
X127550000Y-46450000D03*
X127550000Y-46700000D03*
X127550000Y-45950000D03*
X127550000Y-46200000D03*
D13*
X127650000Y-59850000D03*
X127650000Y-58650000D03*
X127650000Y-59250000D03*
X127650000Y-55150000D03*
X127650000Y-54550000D03*
X127650000Y-53950000D03*
X127650000Y-49850000D03*
X127650000Y-48650000D03*
X127650000Y-49250000D03*
X127650000Y-44650000D03*
X127650000Y-43450000D03*
X127650000Y-44050000D03*
D17*
X127950000Y-51650000D03*
D11*
G36*
X127349019Y-60199805D02*
G01*
X127349076Y-60199617D01*
X127349169Y-60199444D01*
X127349293Y-60199293D01*
X127349444Y-60199169D01*
X127349617Y-60199076D01*
X127349805Y-60199019D01*
X127350000Y-60199000D01*
X128149000Y-60199000D01*
X128149000Y-58301000D01*
X127350000Y-58301000D01*
X127349805Y-58300981D01*
X127349617Y-58300924D01*
X127349444Y-58300831D01*
X127349293Y-58300707D01*
X127349169Y-58300556D01*
X127349076Y-58300383D01*
X127349019Y-58300195D01*
X127349000Y-58300000D01*
X127349000Y-58200000D01*
X127349019Y-58199805D01*
X127349076Y-58199617D01*
X127349169Y-58199444D01*
X127349293Y-58199293D01*
X127349444Y-58199169D01*
X127349617Y-58199076D01*
X127349805Y-58199019D01*
X127350000Y-58199000D01*
X128149000Y-58199000D01*
X128149000Y-57000000D01*
X128149019Y-56999805D01*
X128149076Y-56999617D01*
X128149169Y-56999444D01*
X128149293Y-56999293D01*
X128149444Y-56999169D01*
X128149617Y-56999076D01*
X128149805Y-56999019D01*
X128150000Y-56999000D01*
X128350000Y-56999000D01*
X128350195Y-56999019D01*
X128350383Y-56999076D01*
X128350556Y-56999169D01*
X128350707Y-56999293D01*
X128350831Y-56999444D01*
X128350924Y-56999617D01*
X128350981Y-56999805D01*
X128351000Y-57000000D01*
X128351000Y-60900000D01*
X128350981Y-60900195D01*
X128350924Y-60900383D01*
X128350831Y-60900556D01*
X128350707Y-60900707D01*
X128350556Y-60900831D01*
X128350383Y-60900924D01*
X128350195Y-60900981D01*
X128350000Y-60901000D01*
X128150000Y-60901000D01*
X128149805Y-60900981D01*
X128149617Y-60900924D01*
X128149444Y-60900831D01*
X128149293Y-60900707D01*
X128149169Y-60900556D01*
X128149076Y-60900383D01*
X128149019Y-60900195D01*
X128149000Y-60900000D01*
X128149000Y-60301000D01*
X127350000Y-60301000D01*
X127349805Y-60300981D01*
X127349617Y-60300924D01*
X127349444Y-60300831D01*
X127349293Y-60300707D01*
X127349169Y-60300556D01*
X127349076Y-60300383D01*
X127349019Y-60300195D01*
X127349000Y-60300000D01*
X127349000Y-60200000D01*
X127349019Y-60199805D01*
G37*
G36*
X127349019Y-55499805D02*
G01*
X127349076Y-55499617D01*
X127349169Y-55499444D01*
X127349293Y-55499293D01*
X127349444Y-55499169D01*
X127349617Y-55499076D01*
X127349805Y-55499019D01*
X127350000Y-55499000D01*
X128149000Y-55499000D01*
X128149000Y-53601000D01*
X127350000Y-53601000D01*
X127349805Y-53600981D01*
X127349617Y-53600924D01*
X127349444Y-53600831D01*
X127349293Y-53600707D01*
X127349169Y-53600556D01*
X127349076Y-53600383D01*
X127349019Y-53600195D01*
X127349000Y-53600000D01*
X127349000Y-53500000D01*
X127349019Y-53499805D01*
X127349076Y-53499617D01*
X127349169Y-53499444D01*
X127349293Y-53499293D01*
X127349444Y-53499169D01*
X127349617Y-53499076D01*
X127349805Y-53499019D01*
X127350000Y-53499000D01*
X128149000Y-53499000D01*
X128149000Y-53300000D01*
X128149019Y-53299805D01*
X128149076Y-53299617D01*
X128149169Y-53299444D01*
X128149293Y-53299293D01*
X128149444Y-53299169D01*
X128149617Y-53299076D01*
X128149805Y-53299019D01*
X128150000Y-53299000D01*
X128350000Y-53299000D01*
X128350195Y-53299019D01*
X128350383Y-53299076D01*
X128350556Y-53299169D01*
X128350707Y-53299293D01*
X128350831Y-53299444D01*
X128350924Y-53299617D01*
X128350981Y-53299805D01*
X128351000Y-53300000D01*
X128351000Y-56000000D01*
X128350981Y-56000195D01*
X128350924Y-56000383D01*
X128350831Y-56000556D01*
X128350707Y-56000707D01*
X128350556Y-56000831D01*
X128350383Y-56000924D01*
X128350195Y-56000981D01*
X128350000Y-56001000D01*
X128150000Y-56001000D01*
X128149805Y-56000981D01*
X128149617Y-56000924D01*
X128149444Y-56000831D01*
X128149293Y-56000707D01*
X128149169Y-56000556D01*
X128149076Y-56000383D01*
X128149019Y-56000195D01*
X128149000Y-56000000D01*
X128149000Y-55601000D01*
X127350000Y-55601000D01*
X127349805Y-55600981D01*
X127349617Y-55600924D01*
X127349444Y-55600831D01*
X127349293Y-55600707D01*
X127349169Y-55600556D01*
X127349076Y-55600383D01*
X127349019Y-55600195D01*
X127349000Y-55600000D01*
X127349000Y-55500000D01*
X127349019Y-55499805D01*
G37*
G36*
X127349019Y-50199805D02*
G01*
X127349076Y-50199617D01*
X127349169Y-50199444D01*
X127349293Y-50199293D01*
X127349444Y-50199169D01*
X127349617Y-50199076D01*
X127349805Y-50199019D01*
X127350000Y-50199000D01*
X128149000Y-50199000D01*
X128149000Y-48301000D01*
X127350000Y-48301000D01*
X127349805Y-48300981D01*
X127349617Y-48300924D01*
X127349444Y-48300831D01*
X127349293Y-48300707D01*
X127349169Y-48300556D01*
X127349076Y-48300383D01*
X127349019Y-48300195D01*
X127349000Y-48300000D01*
X127349000Y-48200000D01*
X127349019Y-48199805D01*
X127349076Y-48199617D01*
X127349169Y-48199444D01*
X127349293Y-48199293D01*
X127349444Y-48199169D01*
X127349617Y-48199076D01*
X127349805Y-48199019D01*
X127350000Y-48199000D01*
X128350000Y-48199000D01*
X128350195Y-48199019D01*
X128350383Y-48199076D01*
X128350556Y-48199169D01*
X128350707Y-48199293D01*
X128350831Y-48199444D01*
X128350924Y-48199617D01*
X128350981Y-48199805D01*
X128351000Y-48200000D01*
X128351000Y-52500000D01*
X128350981Y-52500195D01*
X128350924Y-52500383D01*
X128350831Y-52500556D01*
X128350707Y-52500707D01*
X128350556Y-52500831D01*
X128350383Y-52500924D01*
X128350195Y-52500981D01*
X128350000Y-52501000D01*
X128150000Y-52501000D01*
X128149805Y-52500981D01*
X128149617Y-52500924D01*
X128149444Y-52500831D01*
X128149293Y-52500707D01*
X128149169Y-52500556D01*
X128149076Y-52500383D01*
X128149019Y-52500195D01*
X128149000Y-52500000D01*
X128149000Y-50301000D01*
X127350000Y-50301000D01*
X127349805Y-50300981D01*
X127349617Y-50300924D01*
X127349444Y-50300831D01*
X127349293Y-50300707D01*
X127349169Y-50300556D01*
X127349076Y-50300383D01*
X127349019Y-50300195D01*
X127349000Y-50300000D01*
X127349000Y-50200000D01*
X127349019Y-50199805D01*
G37*
G36*
X127349019Y-44999805D02*
G01*
X127349076Y-44999617D01*
X127349169Y-44999444D01*
X127349293Y-44999293D01*
X127349444Y-44999169D01*
X127349617Y-44999076D01*
X127349805Y-44999019D01*
X127350000Y-44999000D01*
X128149000Y-44999000D01*
X128149000Y-43101000D01*
X127350000Y-43101000D01*
X127349805Y-43100981D01*
X127349617Y-43100924D01*
X127349444Y-43100831D01*
X127349293Y-43100707D01*
X127349169Y-43100556D01*
X127349076Y-43100383D01*
X127349019Y-43100195D01*
X127349000Y-43100000D01*
X127349000Y-43000000D01*
X127349019Y-42999805D01*
X127349076Y-42999617D01*
X127349169Y-42999444D01*
X127349293Y-42999293D01*
X127349444Y-42999169D01*
X127349617Y-42999076D01*
X127349805Y-42999019D01*
X127350000Y-42999000D01*
X128149000Y-42999000D01*
X128149000Y-42800000D01*
X128149019Y-42799805D01*
X128149076Y-42799617D01*
X128149169Y-42799444D01*
X128149293Y-42799293D01*
X128149444Y-42799169D01*
X128149617Y-42799076D01*
X128149805Y-42799019D01*
X128150000Y-42799000D01*
X128350000Y-42799000D01*
X128350195Y-42799019D01*
X128350383Y-42799076D01*
X128350556Y-42799169D01*
X128350707Y-42799293D01*
X128350831Y-42799444D01*
X128350924Y-42799617D01*
X128350981Y-42799805D01*
X128351000Y-42800000D01*
X128351000Y-45500000D01*
X128350981Y-45500195D01*
X128350924Y-45500383D01*
X128350831Y-45500556D01*
X128350707Y-45500707D01*
X128350556Y-45500831D01*
X128350383Y-45500924D01*
X128350195Y-45500981D01*
X128350000Y-45501000D01*
X128150000Y-45501000D01*
X128149805Y-45500981D01*
X128149617Y-45500924D01*
X128149444Y-45500831D01*
X128149293Y-45500707D01*
X128149169Y-45500556D01*
X128149076Y-45500383D01*
X128149019Y-45500195D01*
X128149000Y-45500000D01*
X128149000Y-45101000D01*
X127350000Y-45101000D01*
X127349805Y-45100981D01*
X127349617Y-45100924D01*
X127349444Y-45100831D01*
X127349293Y-45100707D01*
X127349169Y-45100556D01*
X127349076Y-45100383D01*
X127349019Y-45100195D01*
X127349000Y-45100000D01*
X127349000Y-45000000D01*
X127349019Y-44999805D01*
G37*
D10*
X127850000Y-57750000D03*
X127850000Y-57550000D03*
X127550000Y-45700000D03*
X127550000Y-45450000D03*
%TD*%
D19*
%TO.C,C7*%
X113600000Y-56750000D03*
X113600000Y-55650000D03*
%TD*%
D13*
%TO.C,C32*%
X98750000Y-61900000D03*
X97650000Y-61900000D03*
%TD*%
D21*
%TO.C,R4*%
X96800000Y-51760000D03*
X96800000Y-51240000D03*
%TD*%
D22*
%TO.C,TH1*%
X104600000Y-76750000D03*
X104600000Y-75850000D03*
%TD*%
D23*
%TO.C,REF\u002A\u002A*%
X83100000Y-88800000D03*
%TD*%
%TO.C,REF\u002A\u002A*%
X137100000Y-88800000D03*
%TD*%
%TO.C,REF\u002A\u002A*%
X137100000Y-35400000D03*
%TD*%
%TO.C,REF\u002A\u002A*%
X83100000Y-35400000D03*
%TD*%
D24*
%TO.C,R21*%
X97750000Y-64900000D03*
X98650000Y-64900000D03*
%TD*%
D21*
%TO.C,TH5*%
X104200000Y-44460000D03*
X104200000Y-43940000D03*
%TD*%
D25*
%TO.C,TH4*%
X124440000Y-61600000D03*
X124960000Y-61600000D03*
%TD*%
D21*
%TO.C,TH3*%
X118000000Y-80740000D03*
X118000000Y-81260000D03*
%TD*%
D25*
%TO.C,TH2*%
X99640000Y-62800000D03*
X100160000Y-62800000D03*
%TD*%
D24*
%TO.C,R52*%
X97750000Y-57900000D03*
X98650000Y-57900000D03*
%TD*%
%TO.C,R51*%
X97750000Y-57000000D03*
X98650000Y-57000000D03*
%TD*%
%TO.C,R50*%
X100350000Y-56600000D03*
X101250000Y-56600000D03*
%TD*%
%TO.C,R49*%
X100350000Y-47000000D03*
X101250000Y-47000000D03*
%TD*%
%TO.C,R48*%
X97750000Y-45200000D03*
X98650000Y-45200000D03*
%TD*%
%TO.C,R47*%
X97750000Y-46900000D03*
X98650000Y-46900000D03*
%TD*%
%TO.C,R46*%
X97750000Y-44300000D03*
X98650000Y-44300000D03*
%TD*%
%TO.C,R45*%
X101250000Y-46000000D03*
X100350000Y-46000000D03*
%TD*%
%TO.C,R44*%
X101250000Y-44200000D03*
X100350000Y-44200000D03*
%TD*%
%TO.C,R43*%
X121250000Y-46400000D03*
X120350000Y-46400000D03*
%TD*%
%TO.C,R42*%
X121250000Y-47300000D03*
X120350000Y-47300000D03*
%TD*%
%TO.C,R41*%
X118950000Y-46800000D03*
X118050000Y-46800000D03*
%TD*%
%TO.C,R40*%
X119850000Y-57100000D03*
X118950000Y-57100000D03*
%TD*%
%TO.C,R39*%
X119850000Y-58700000D03*
X118950000Y-58700000D03*
%TD*%
%TO.C,R38*%
X122450000Y-58000000D03*
X121550000Y-58000000D03*
%TD*%
%TO.C,R37*%
X119850000Y-59600000D03*
X118950000Y-59600000D03*
%TD*%
%TO.C,R36*%
X121550000Y-60900000D03*
X122450000Y-60900000D03*
%TD*%
%TO.C,R35*%
X121550000Y-62600000D03*
X122450000Y-62600000D03*
%TD*%
%TO.C,R34*%
X122450000Y-65400000D03*
X121550000Y-65400000D03*
%TD*%
%TO.C,R33*%
X122450000Y-66300000D03*
X121550000Y-66300000D03*
%TD*%
%TO.C,R32*%
X122450000Y-67300000D03*
X121550000Y-67300000D03*
%TD*%
%TO.C,R31*%
X119850000Y-77500000D03*
X118950000Y-77500000D03*
%TD*%
%TO.C,R30*%
X122450000Y-79100000D03*
X121550000Y-79100000D03*
%TD*%
%TO.C,R29*%
X122450000Y-77500000D03*
X121550000Y-77500000D03*
%TD*%
%TO.C,R28*%
X122450000Y-80000000D03*
X121550000Y-80000000D03*
%TD*%
%TO.C,R27*%
X118950000Y-78500000D03*
X119850000Y-78500000D03*
%TD*%
%TO.C,R26*%
X118950000Y-80200000D03*
X119850000Y-80200000D03*
%TD*%
%TO.C,R25*%
X97750000Y-77900000D03*
X98650000Y-77900000D03*
%TD*%
%TO.C,R24*%
X97750000Y-77000000D03*
X98650000Y-77000000D03*
%TD*%
%TO.C,R23*%
X97050000Y-76000000D03*
X97950000Y-76000000D03*
%TD*%
%TO.C,R22*%
X100350000Y-66800000D03*
X101250000Y-66800000D03*
%TD*%
%TO.C,R20*%
X97750000Y-66500000D03*
X98650000Y-66500000D03*
%TD*%
%TO.C,R19*%
X97750000Y-64000000D03*
X98650000Y-64000000D03*
%TD*%
%TO.C,R18*%
X98650000Y-62800000D03*
X97750000Y-62800000D03*
%TD*%
%TO.C,R17*%
X98650000Y-60900000D03*
X97750000Y-60900000D03*
%TD*%
%TO.C,R16*%
X121550000Y-76600000D03*
X122450000Y-76600000D03*
%TD*%
%TO.C,R15*%
X121550000Y-57100000D03*
X122450000Y-57100000D03*
%TD*%
D21*
%TO.C,R14*%
X120850000Y-44890000D03*
X120850000Y-45410000D03*
%TD*%
D24*
%TO.C,R13*%
X121550000Y-75700000D03*
X122450000Y-75700000D03*
%TD*%
%TO.C,R12*%
X121550000Y-56200000D03*
X122450000Y-56200000D03*
%TD*%
D21*
%TO.C,R11*%
X122450000Y-45840000D03*
X122450000Y-46360000D03*
%TD*%
%TO.C,R10*%
X120850000Y-44310000D03*
X120850000Y-43790000D03*
%TD*%
%TO.C,R9*%
X122450000Y-46940000D03*
X122450000Y-47460000D03*
%TD*%
D24*
%TO.C,R8*%
X98650000Y-68300000D03*
X97750000Y-68300000D03*
%TD*%
%TO.C,R7*%
X98650000Y-48700000D03*
X97750000Y-48700000D03*
%TD*%
%TO.C,R6*%
X98650000Y-67400000D03*
X97750000Y-67400000D03*
%TD*%
%TO.C,R5*%
X98650000Y-47800000D03*
X97750000Y-47800000D03*
%TD*%
D21*
%TO.C,R3*%
X95600000Y-77640000D03*
X95600000Y-78160000D03*
%TD*%
%TO.C,R2*%
X94200000Y-77140000D03*
X94200000Y-77660000D03*
%TD*%
D24*
%TO.C,R1*%
X103650000Y-80700000D03*
X104550000Y-80700000D03*
%TD*%
D13*
%TO.C,C106*%
X95450000Y-59200000D03*
X94350000Y-59200000D03*
%TD*%
%TO.C,C105*%
X94350000Y-60000000D03*
X95450000Y-60000000D03*
%TD*%
%TO.C,C104*%
X95450000Y-60800000D03*
X94350000Y-60800000D03*
%TD*%
%TO.C,C101*%
X95450000Y-56100000D03*
X94350000Y-56100000D03*
%TD*%
%TO.C,C100*%
X94350000Y-55300000D03*
X95450000Y-55300000D03*
%TD*%
%TO.C,C99*%
X95450000Y-54500000D03*
X94350000Y-54500000D03*
%TD*%
%TO.C,C98*%
X95450000Y-50300000D03*
X94350000Y-50300000D03*
%TD*%
%TO.C,C97*%
X94350000Y-49500000D03*
X95450000Y-49500000D03*
%TD*%
%TO.C,C96*%
X95450000Y-48700000D03*
X94350000Y-48700000D03*
%TD*%
%TO.C,C94*%
X94350000Y-46400000D03*
X95450000Y-46400000D03*
%TD*%
%TO.C,C92*%
X95450000Y-45600000D03*
X94350000Y-45600000D03*
%TD*%
%TO.C,C91*%
X94350000Y-44800000D03*
X95450000Y-44800000D03*
%TD*%
%TO.C,C90*%
X95450000Y-44000000D03*
X94350000Y-44000000D03*
%TD*%
%TO.C,C89*%
X101350000Y-45100000D03*
X100250000Y-45100000D03*
%TD*%
%TO.C,C87*%
X125850000Y-44800000D03*
X124750000Y-44800000D03*
%TD*%
%TO.C,C86*%
X124750000Y-44000000D03*
X125850000Y-44000000D03*
%TD*%
%TO.C,C85*%
X125850000Y-43200000D03*
X124750000Y-43200000D03*
%TD*%
%TO.C,C82*%
X124750000Y-48500000D03*
X125850000Y-48500000D03*
%TD*%
%TO.C,C81*%
X125850000Y-49300000D03*
X124750000Y-49300000D03*
%TD*%
%TO.C,C80*%
X124750000Y-50100000D03*
X125850000Y-50100000D03*
%TD*%
%TO.C,C79*%
X124750000Y-53700000D03*
X125850000Y-53700000D03*
%TD*%
%TO.C,C78*%
X125850000Y-54500000D03*
X124750000Y-54500000D03*
%TD*%
%TO.C,C77*%
X124750000Y-55300000D03*
X125850000Y-55300000D03*
%TD*%
%TO.C,C75*%
X125850000Y-57600000D03*
X124750000Y-57600000D03*
%TD*%
%TO.C,C73*%
X124750000Y-58400000D03*
X125850000Y-58400000D03*
%TD*%
%TO.C,C72*%
X125850000Y-59200000D03*
X124750000Y-59200000D03*
%TD*%
%TO.C,C71*%
X124750000Y-60000000D03*
X125850000Y-60000000D03*
%TD*%
%TO.C,C70*%
X121450000Y-61700000D03*
X122550000Y-61700000D03*
%TD*%
%TO.C,C68*%
X124750000Y-65100000D03*
X125850000Y-65100000D03*
%TD*%
%TO.C,C67*%
X125850000Y-64300000D03*
X124750000Y-64300000D03*
%TD*%
%TO.C,C66*%
X124750000Y-63500000D03*
X125850000Y-63500000D03*
%TD*%
%TO.C,C63*%
X124750000Y-68200000D03*
X125850000Y-68200000D03*
%TD*%
%TO.C,C62*%
X125850000Y-69000000D03*
X124750000Y-69000000D03*
%TD*%
%TO.C,C61*%
X124750000Y-69800000D03*
X125850000Y-69800000D03*
%TD*%
%TO.C,C60*%
X124750000Y-74000000D03*
X125850000Y-74000000D03*
%TD*%
%TO.C,C59*%
X125850000Y-74800000D03*
X124750000Y-74800000D03*
%TD*%
%TO.C,C58*%
X124750000Y-75600000D03*
X125850000Y-75600000D03*
%TD*%
%TO.C,C56*%
X125850000Y-77900000D03*
X124750000Y-77900000D03*
%TD*%
%TO.C,C54*%
X124750000Y-78700000D03*
X125850000Y-78700000D03*
%TD*%
%TO.C,C53*%
X125850000Y-79500000D03*
X124750000Y-79500000D03*
%TD*%
%TO.C,C52*%
X124750000Y-80300000D03*
X125850000Y-80300000D03*
%TD*%
%TO.C,C51*%
X118850000Y-79300000D03*
X119950000Y-79300000D03*
%TD*%
%TO.C,C49*%
X95450000Y-79100000D03*
X94350000Y-79100000D03*
%TD*%
%TO.C,C48*%
X94350000Y-79900000D03*
X95450000Y-79900000D03*
%TD*%
%TO.C,C47*%
X95450000Y-80700000D03*
X94350000Y-80700000D03*
%TD*%
%TO.C,C44*%
X95450000Y-75800000D03*
X94350000Y-75800000D03*
%TD*%
%TO.C,C43*%
X94350000Y-75000000D03*
X95450000Y-75000000D03*
%TD*%
%TO.C,C42*%
X95450000Y-74200000D03*
X94350000Y-74200000D03*
%TD*%
%TO.C,C41*%
X95450000Y-70600000D03*
X94350000Y-70600000D03*
%TD*%
%TO.C,C40*%
X94350000Y-69800000D03*
X95450000Y-69800000D03*
%TD*%
%TO.C,C39*%
X95450000Y-69000000D03*
X94350000Y-69000000D03*
%TD*%
%TO.C,C37*%
X94350000Y-66700000D03*
X95450000Y-66700000D03*
%TD*%
%TO.C,C35*%
X95450000Y-65900000D03*
X94350000Y-65900000D03*
%TD*%
%TO.C,C34*%
X94350000Y-65100000D03*
X95450000Y-65100000D03*
%TD*%
%TO.C,C33*%
X95450000Y-64300000D03*
X94350000Y-64300000D03*
%TD*%
D19*
%TO.C,C17*%
X111375000Y-58750000D03*
X111375000Y-57650000D03*
%TD*%
%TO.C,C16*%
X114425000Y-56750000D03*
X114425000Y-55650000D03*
%TD*%
D13*
%TO.C,C15*%
X110550000Y-70900000D03*
X111650000Y-70900000D03*
%TD*%
%TO.C,C14*%
X113950000Y-69000000D03*
X115050000Y-69000000D03*
%TD*%
%TO.C,C13*%
X105250000Y-71000000D03*
X104150000Y-71000000D03*
%TD*%
%TO.C,C12*%
X103050000Y-68500000D03*
X104150000Y-68500000D03*
%TD*%
D19*
%TO.C,C11*%
X106500000Y-56750000D03*
X106500000Y-55650000D03*
%TD*%
%TO.C,C10*%
X108025000Y-58750000D03*
X108025000Y-57650000D03*
%TD*%
%TO.C,C8*%
X112175000Y-58750000D03*
X112175000Y-57650000D03*
%TD*%
D13*
%TO.C,C6*%
X111050000Y-70100000D03*
X112150000Y-70100000D03*
%TD*%
%TO.C,C5*%
X113950000Y-69800000D03*
X115050000Y-69800000D03*
%TD*%
%TO.C,C4*%
X105250000Y-70200000D03*
X104150000Y-70200000D03*
%TD*%
%TO.C,C3*%
X103050000Y-69300000D03*
X104150000Y-69300000D03*
%TD*%
D19*
%TO.C,C2*%
X105700000Y-56750000D03*
X105700000Y-55650000D03*
%TD*%
%TO.C,C1*%
X108825000Y-58750000D03*
X108825000Y-57650000D03*
%TD*%
D26*
%TO.C,J_conn1*%
X106200000Y-64250000D03*
X106800000Y-64250000D03*
D27*
X106500000Y-67350000D03*
X107100000Y-67350000D03*
D28*
X103400000Y-64500000D03*
X116800000Y-64500000D03*
D26*
X108600000Y-64250000D03*
X109200000Y-64250000D03*
X109800000Y-64250000D03*
X110400000Y-64250000D03*
X111000000Y-64250000D03*
X111600000Y-64250000D03*
X115800000Y-64250000D03*
X115200000Y-64250000D03*
X114600000Y-64250000D03*
X114000000Y-64250000D03*
X113400000Y-64250000D03*
X112800000Y-64250000D03*
X112200000Y-64250000D03*
D27*
X115500000Y-67350000D03*
X114900000Y-67350000D03*
X114300000Y-67350000D03*
X113700000Y-67350000D03*
X113100000Y-67350000D03*
X108900000Y-67350000D03*
X109500000Y-67350000D03*
X110100000Y-67350000D03*
X110700000Y-67350000D03*
X111300000Y-67350000D03*
X111900000Y-67350000D03*
X112500000Y-67350000D03*
X108300000Y-67350000D03*
D26*
X108000000Y-64250000D03*
D27*
X107700000Y-67350000D03*
D26*
X107400000Y-64250000D03*
D27*
X105900000Y-67350000D03*
X105300000Y-67350000D03*
X104700000Y-67350000D03*
D26*
X105600000Y-64250000D03*
X105000000Y-64250000D03*
X104400000Y-64250000D03*
%TD*%
D29*
%TO.C,J1*%
X113600000Y-75442500D03*
X112600000Y-75442500D03*
X111600000Y-75442500D03*
X110600000Y-75442500D03*
X109600000Y-75442500D03*
X108600000Y-75442500D03*
X107600000Y-75442500D03*
X106600000Y-75442500D03*
X113600000Y-78657500D03*
X112600000Y-78657500D03*
X111600000Y-78657500D03*
X110600000Y-78657500D03*
X109600000Y-78657500D03*
X108600000Y-78657500D03*
X107600000Y-78657500D03*
X106600000Y-78657500D03*
%TD*%
D30*
%TO.C,U1*%
X102300000Y-78000000D03*
%TD*%
D11*
G36*
X99950000Y-74950000D02*
G01*
X98850000Y-74950000D01*
X98850000Y-73850000D01*
X99950000Y-73850000D01*
X99950000Y-74950000D01*
G37*
X99950000Y-74950000D02*
X98850000Y-74950000D01*
X98850000Y-73850000D01*
X99950000Y-73850000D01*
X99950000Y-74950000D01*
G36*
X117550000Y-46750000D02*
G01*
X116450000Y-46750000D01*
X116450000Y-45650000D01*
X117550000Y-45650000D01*
X117550000Y-46750000D01*
G37*
X117550000Y-46750000D02*
X116450000Y-46750000D01*
X116450000Y-45650000D01*
X117550000Y-45650000D01*
X117550000Y-46750000D01*
G36*
X118050000Y-43550000D02*
G01*
X116950000Y-43550000D01*
X116950000Y-42550000D01*
X118050000Y-42550000D01*
X118050000Y-43550000D01*
G37*
X118050000Y-43550000D02*
X116950000Y-43550000D01*
X116950000Y-42550000D01*
X118050000Y-42550000D01*
X118050000Y-43550000D01*
G36*
X119950000Y-43550000D02*
G01*
X118850000Y-43550000D01*
X118850000Y-42550000D01*
X119950000Y-42550000D01*
X119950000Y-43550000D01*
G37*
X119950000Y-43550000D02*
X118850000Y-43550000D01*
X118850000Y-42550000D01*
X119950000Y-42550000D01*
X119950000Y-43550000D01*
G36*
X119550000Y-54350000D02*
G01*
X118450000Y-54350000D01*
X118450000Y-53250000D01*
X119550000Y-53250000D01*
X119550000Y-54350000D01*
G37*
X119550000Y-54350000D02*
X118450000Y-54350000D01*
X118450000Y-53250000D01*
X119550000Y-53250000D01*
X119550000Y-54350000D01*
G36*
X98150000Y-81650005D02*
G01*
X97150000Y-81650005D01*
X97150000Y-80550005D01*
X98150000Y-80550005D01*
X98150000Y-81650005D01*
G37*
X98150000Y-81650005D02*
X97150000Y-81650005D01*
X97150000Y-80550005D01*
X98150000Y-80550005D01*
X98150000Y-81650005D01*
G36*
X102650000Y-54350000D02*
G01*
X101550000Y-54350000D01*
X101550000Y-53250000D01*
X102650000Y-53250000D01*
X102650000Y-54350000D01*
G37*
X102650000Y-54350000D02*
X101550000Y-54350000D01*
X101550000Y-53250000D01*
X102650000Y-53250000D01*
X102650000Y-54350000D01*
G36*
X119550000Y-63350000D02*
G01*
X118450000Y-63350000D01*
X118450000Y-62250000D01*
X119550000Y-62250000D01*
X119550000Y-63350000D01*
G37*
X119550000Y-63350000D02*
X118450000Y-63350000D01*
X118450000Y-62250000D01*
X119550000Y-62250000D01*
X119550000Y-63350000D01*
G36*
X119550000Y-65650000D02*
G01*
X118450000Y-65650000D01*
X118450000Y-64550000D01*
X119550000Y-64550000D01*
X119550000Y-65650000D01*
G37*
X119550000Y-65650000D02*
X118450000Y-65650000D01*
X118450000Y-64550000D01*
X119550000Y-64550000D01*
X119550000Y-65650000D01*
G36*
X101150000Y-60250000D02*
G01*
X100050000Y-60250000D01*
X100050000Y-59150000D01*
X101150000Y-59150000D01*
X101150000Y-60250000D01*
G37*
X101150000Y-60250000D02*
X100050000Y-60250000D01*
X100050000Y-59150000D01*
X101150000Y-59150000D01*
X101150000Y-60250000D01*
G36*
X102650000Y-61950000D02*
G01*
X101550000Y-61950000D01*
X101550000Y-60850000D01*
X102650000Y-60850000D01*
X102650000Y-61950000D01*
G37*
X102650000Y-61950000D02*
X101550000Y-61950000D01*
X101550000Y-60850000D01*
X102650000Y-60850000D01*
X102650000Y-61950000D01*
G36*
X100150000Y-71950000D02*
G01*
X99050000Y-71950000D01*
X99050000Y-70850000D01*
X100150000Y-70850000D01*
X100150000Y-71950000D01*
G37*
X100150000Y-71950000D02*
X99050000Y-71950000D01*
X99050000Y-70850000D01*
X100150000Y-70850000D01*
X100150000Y-71950000D01*
G36*
X119650000Y-71150000D02*
G01*
X118550000Y-71150000D01*
X118550000Y-70050000D01*
X119650000Y-70050000D01*
X119650000Y-71150000D01*
G37*
X119650000Y-71150000D02*
X118550000Y-71150000D01*
X118550000Y-70050000D01*
X119650000Y-70050000D01*
X119650000Y-71150000D01*
G36*
X92850000Y-61250000D02*
G01*
X91850000Y-61250000D01*
X91850000Y-42550000D01*
X92850000Y-42550000D01*
X92850000Y-61250000D01*
G37*
X92850000Y-61250000D02*
X91850000Y-61250000D01*
X91850000Y-42550000D01*
X92850000Y-42550000D01*
X92850000Y-61250000D01*
G36*
X92850000Y-81250000D02*
G01*
X91850000Y-81250000D01*
X91850000Y-62750000D01*
X92850000Y-62750000D01*
X92850000Y-81250000D01*
G37*
X92850000Y-81250000D02*
X91850000Y-81250000D01*
X91850000Y-62750000D01*
X92850000Y-62750000D01*
X92850000Y-81250000D01*
G36*
X128350000Y-81765146D02*
G01*
X127350000Y-81765146D01*
X127350000Y-63065146D01*
X128350000Y-63065146D01*
X128350000Y-81765146D01*
G37*
X128350000Y-81765146D02*
X127350000Y-81765146D01*
X127350000Y-63065146D01*
X128350000Y-63065146D01*
X128350000Y-81765146D01*
G36*
X128350000Y-61550000D02*
G01*
X127350000Y-61550000D01*
X127350000Y-42750000D01*
X128350000Y-42750000D01*
X128350000Y-61550000D01*
G37*
X128350000Y-61550000D02*
X127350000Y-61550000D01*
X127350000Y-42750000D01*
X128350000Y-42750000D01*
X128350000Y-61550000D01*
D31*
G36*
X91073000Y-73173000D02*
G01*
X90627000Y-73173000D01*
X90627000Y-72927000D01*
X91073000Y-72927000D01*
X91073000Y-73173000D01*
G37*
X91073000Y-73173000D02*
X90627000Y-73173000D01*
X90627000Y-72927000D01*
X91073000Y-72927000D01*
X91073000Y-73173000D01*
G36*
X129473000Y-71573000D02*
G01*
X129027000Y-71573000D01*
X129027000Y-71227000D01*
X129473000Y-71227000D01*
X129473000Y-71573000D01*
G37*
X129473000Y-71573000D02*
X129027000Y-71573000D01*
X129027000Y-71227000D01*
X129473000Y-71227000D01*
X129473000Y-71573000D01*
D11*
G36*
X83050000Y-69950000D02*
G01*
X80150000Y-69950000D01*
X80150000Y-67050000D01*
X83050000Y-67050000D01*
X83050000Y-69950000D01*
G37*
X83050000Y-69950000D02*
X80150000Y-69950000D01*
X80150000Y-67050000D01*
X83050000Y-67050000D01*
X83050000Y-69950000D01*
M02*
