%TF.GenerationSoftware,KiCad,Pcbnew,(5.1.6-0)*%
%TF.CreationDate,2020-10-23T16:21:28-07:00*%
%TF.ProjectId,rd53b_quad_hybrid,72643533-625f-4717-9561-645f68796272,1.5*%
%TF.SameCoordinates,Original*%
%TF.FileFunction,Other,User*%
%FSLAX46Y46*%
G04 Gerber Fmt 4.6, Leading zero omitted, Abs format (unit mm)*
G04 Created by KiCad (PCBNEW (5.1.6-0)) date 2020-10-23 16:21:28*
%MOMM*%
%LPD*%
G01*
G04 APERTURE LIST*
%ADD10C,0.050000*%
%ADD11C,0.150000*%
G04 APERTURE END LIST*
D10*
%TO.C,C103*%
X93320000Y-61330000D02*
X94480000Y-61330000D01*
X93320000Y-61330000D02*
X93320000Y-61980000D01*
X94480000Y-61980000D02*
X94480000Y-61330000D01*
X94480000Y-61980000D02*
X93320000Y-61980000D01*
%TO.C,C93*%
X103620000Y-42480000D02*
X104780000Y-42480000D01*
X103620000Y-42480000D02*
X103620000Y-43130000D01*
X104780000Y-43130000D02*
X104780000Y-42480000D01*
X104780000Y-43130000D02*
X103620000Y-43130000D01*
%TO.C,C84*%
X122380000Y-43120000D02*
X121220000Y-43120000D01*
X122380000Y-43120000D02*
X122380000Y-42470000D01*
X121220000Y-42470000D02*
X121220000Y-43120000D01*
X121220000Y-42470000D02*
X122380000Y-42470000D01*
%TO.C,C74*%
X126980000Y-62020000D02*
X125820000Y-62020000D01*
X126980000Y-62020000D02*
X126980000Y-61370000D01*
X125820000Y-61370000D02*
X125820000Y-62020000D01*
X125820000Y-61370000D02*
X126980000Y-61370000D01*
%TO.C,C65*%
X126980000Y-62970000D02*
X125820000Y-62970000D01*
X126980000Y-62970000D02*
X126980000Y-62320000D01*
X125820000Y-62320000D02*
X125820000Y-62970000D01*
X125820000Y-62320000D02*
X126980000Y-62320000D01*
%TO.C,C55*%
X117180000Y-81820000D02*
X116020000Y-81820000D01*
X117180000Y-81820000D02*
X117180000Y-81170000D01*
X116020000Y-81170000D02*
X116020000Y-81820000D01*
X116020000Y-81170000D02*
X117180000Y-81170000D01*
%TO.C,C46*%
X94320000Y-81180000D02*
X95480000Y-81180000D01*
X94320000Y-81180000D02*
X94320000Y-81830000D01*
X95480000Y-81830000D02*
X95480000Y-81180000D01*
X95480000Y-81830000D02*
X94320000Y-81830000D01*
%TO.C,C36*%
X93320000Y-62280000D02*
X94480000Y-62280000D01*
X93320000Y-62280000D02*
X93320000Y-62930000D01*
X94480000Y-62930000D02*
X94480000Y-62280000D01*
X94480000Y-62930000D02*
X93320000Y-62930000D01*
%TO.C,C107*%
X114300000Y-62000000D02*
X114300000Y-60000000D01*
X114300000Y-62000000D02*
X115100000Y-62000000D01*
X115100000Y-60000000D02*
X114300000Y-60000000D01*
X115100000Y-60000000D02*
X115100000Y-62000000D01*
%TO.C,C102*%
X101800000Y-57900000D02*
X99800000Y-57900000D01*
X101800000Y-57900000D02*
X101800000Y-57100000D01*
X99800000Y-57100000D02*
X99800000Y-57900000D01*
X99800000Y-57100000D02*
X101800000Y-57100000D01*
%TO.C,C95*%
X99200000Y-46400000D02*
X97200000Y-46400000D01*
X99200000Y-46400000D02*
X99200000Y-45600000D01*
X97200000Y-45600000D02*
X97200000Y-46400000D01*
X97200000Y-45600000D02*
X99200000Y-45600000D01*
%TO.C,C88*%
X101800000Y-43700000D02*
X99800000Y-43700000D01*
X101800000Y-43700000D02*
X101800000Y-42900000D01*
X99800000Y-42900000D02*
X99800000Y-43700000D01*
X99800000Y-42900000D02*
X101800000Y-42900000D01*
%TO.C,C83*%
X117500000Y-47300000D02*
X119500000Y-47300000D01*
X117500000Y-47300000D02*
X117500000Y-48100000D01*
X119500000Y-48100000D02*
X119500000Y-47300000D01*
X119500000Y-48100000D02*
X117500000Y-48100000D01*
%TO.C,C76*%
X118400000Y-57500000D02*
X120400000Y-57500000D01*
X118400000Y-57500000D02*
X118400000Y-58300000D01*
X120400000Y-58300000D02*
X120400000Y-57500000D01*
X120400000Y-58300000D02*
X118400000Y-58300000D01*
%TO.C,C69*%
X121000000Y-63100000D02*
X123000000Y-63100000D01*
X121000000Y-63100000D02*
X121000000Y-63900000D01*
X123000000Y-63900000D02*
X123000000Y-63100000D01*
X123000000Y-63900000D02*
X121000000Y-63900000D01*
%TO.C,C64*%
X121000000Y-67700000D02*
X123000000Y-67700000D01*
X121000000Y-67700000D02*
X121000000Y-68500000D01*
X123000000Y-68500000D02*
X123000000Y-67700000D01*
X123000000Y-68500000D02*
X121000000Y-68500000D01*
%TO.C,C57*%
X121000000Y-77900000D02*
X123000000Y-77900000D01*
X121000000Y-77900000D02*
X121000000Y-78700000D01*
X123000000Y-78700000D02*
X123000000Y-77900000D01*
X123000000Y-78700000D02*
X121000000Y-78700000D01*
%TO.C,C50*%
X118400000Y-80600000D02*
X120400000Y-80600000D01*
X118400000Y-80600000D02*
X118400000Y-81400000D01*
X120400000Y-81400000D02*
X120400000Y-80600000D01*
X120400000Y-81400000D02*
X118400000Y-81400000D01*
%TO.C,C45*%
X98500000Y-75600000D02*
X96500000Y-75600000D01*
X98500000Y-75600000D02*
X98500000Y-74800000D01*
X96500000Y-74800000D02*
X96500000Y-75600000D01*
X96500000Y-74800000D02*
X98500000Y-74800000D01*
%TO.C,C38*%
X99200000Y-66100000D02*
X97200000Y-66100000D01*
X99200000Y-66100000D02*
X99200000Y-65300000D01*
X97200000Y-65300000D02*
X97200000Y-66100000D01*
X97200000Y-65300000D02*
X99200000Y-65300000D01*
%TO.C,C31*%
X99200000Y-60500000D02*
X97200000Y-60500000D01*
X99200000Y-60500000D02*
X99200000Y-59700000D01*
X97200000Y-59700000D02*
X97200000Y-60500000D01*
X97200000Y-59700000D02*
X99200000Y-59700000D01*
%TO.C,C30*%
X126300000Y-52500000D02*
X124300000Y-52500000D01*
X126300000Y-52500000D02*
X126300000Y-51700000D01*
X124300000Y-51700000D02*
X124300000Y-52500000D01*
X124300000Y-51700000D02*
X126300000Y-51700000D01*
%TO.C,C29*%
X126300000Y-53300000D02*
X124300000Y-53300000D01*
X126300000Y-53300000D02*
X126300000Y-52500000D01*
X124300000Y-52500000D02*
X124300000Y-53300000D01*
X124300000Y-52500000D02*
X126300000Y-52500000D01*
%TO.C,C28*%
X126300000Y-72800000D02*
X124300000Y-72800000D01*
X126300000Y-72800000D02*
X126300000Y-72000000D01*
X124300000Y-72000000D02*
X124300000Y-72800000D01*
X124300000Y-72000000D02*
X126300000Y-72000000D01*
%TO.C,C27*%
X126300000Y-73600000D02*
X124300000Y-73600000D01*
X126300000Y-73600000D02*
X126300000Y-72800000D01*
X124300000Y-72800000D02*
X124300000Y-73600000D01*
X124300000Y-72800000D02*
X126300000Y-72800000D01*
%TO.C,C26*%
X93900000Y-71800000D02*
X95900000Y-71800000D01*
X93900000Y-71800000D02*
X93900000Y-72600000D01*
X95900000Y-72600000D02*
X95900000Y-71800000D01*
X95900000Y-72600000D02*
X93900000Y-72600000D01*
%TO.C,C25*%
X93900000Y-71000000D02*
X95900000Y-71000000D01*
X93900000Y-71000000D02*
X93900000Y-71800000D01*
X95900000Y-71800000D02*
X95900000Y-71000000D01*
X95900000Y-71800000D02*
X93900000Y-71800000D01*
%TO.C,C24*%
X93900000Y-51500000D02*
X95900000Y-51500000D01*
X93900000Y-51500000D02*
X93900000Y-52300000D01*
X95900000Y-52300000D02*
X95900000Y-51500000D01*
X95900000Y-52300000D02*
X93900000Y-52300000D01*
%TO.C,C23*%
X93900000Y-50700000D02*
X95900000Y-50700000D01*
X93900000Y-50700000D02*
X93900000Y-51500000D01*
X95900000Y-51500000D02*
X95900000Y-50700000D01*
X95900000Y-51500000D02*
X93900000Y-51500000D01*
%TO.C,C22*%
X116500000Y-55800000D02*
X118500000Y-55800000D01*
X116500000Y-55800000D02*
X116500000Y-56600000D01*
X118500000Y-56600000D02*
X118500000Y-55800000D01*
X118500000Y-56600000D02*
X116500000Y-56600000D01*
%TO.C,C21*%
X118400000Y-76200000D02*
X120400000Y-76200000D01*
X118400000Y-76200000D02*
X118400000Y-77000000D01*
X120400000Y-77000000D02*
X120400000Y-76200000D01*
X120400000Y-77000000D02*
X118400000Y-77000000D01*
%TO.C,C20*%
X101800000Y-68100000D02*
X99800000Y-68100000D01*
X101800000Y-68100000D02*
X101800000Y-67300000D01*
X99800000Y-67300000D02*
X99800000Y-68100000D01*
X99800000Y-67300000D02*
X101800000Y-67300000D01*
%TO.C,C19*%
X101800000Y-48300000D02*
X99800000Y-48300000D01*
X101800000Y-48300000D02*
X101800000Y-47500000D01*
X99800000Y-47500000D02*
X99800000Y-48300000D01*
X99800000Y-47500000D02*
X101800000Y-47500000D01*
%TO.C,C9*%
X105000000Y-62000000D02*
X105000000Y-60000000D01*
X105000000Y-62000000D02*
X105800000Y-62000000D01*
X105800000Y-60000000D02*
X105000000Y-60000000D01*
X105800000Y-60000000D02*
X105800000Y-62000000D01*
%TO.C,C18*%
X98550000Y-79650000D02*
X103050000Y-79650000D01*
X98550000Y-79650000D02*
X98550000Y-81750000D01*
X103050000Y-81750000D02*
X103050000Y-79650000D01*
X103050000Y-81750000D02*
X98550000Y-81750000D01*
%TO.C,C7*%
X113200000Y-57200000D02*
X113200000Y-55200000D01*
X113200000Y-57200000D02*
X114000000Y-57200000D01*
X114000000Y-55200000D02*
X113200000Y-55200000D01*
X114000000Y-55200000D02*
X114000000Y-57200000D01*
%TO.C,C32*%
X99200000Y-62300000D02*
X97200000Y-62300000D01*
X99200000Y-62300000D02*
X99200000Y-61500000D01*
X97200000Y-61500000D02*
X97200000Y-62300000D01*
X97200000Y-61500000D02*
X99200000Y-61500000D01*
%TO.C,R4*%
X96440000Y-52050000D02*
X96440000Y-50950000D01*
X96440000Y-52050000D02*
X97170000Y-52050000D01*
X97170000Y-50950000D02*
X96440000Y-50950000D01*
X97170000Y-50950000D02*
X97170000Y-52050000D01*
%TO.C,TH1*%
X104150000Y-77100000D02*
X104150000Y-75500000D01*
X104150000Y-77100000D02*
X105050000Y-77100000D01*
X105050000Y-75500000D02*
X104150000Y-75500000D01*
X105050000Y-75500000D02*
X105050000Y-77100000D01*
%TO.C,REF\u002A\u002A*%
X86550000Y-88800000D02*
G75*
G03*
X86550000Y-88800000I-3450000J0D01*
G01*
X140550000Y-88800000D02*
G75*
G03*
X140550000Y-88800000I-3450000J0D01*
G01*
X140550000Y-35400000D02*
G75*
G03*
X140550000Y-35400000I-3450000J0D01*
G01*
X86550000Y-35400000D02*
G75*
G03*
X86550000Y-35400000I-3450000J0D01*
G01*
%TO.C,R21*%
X97400000Y-64450000D02*
X99000000Y-64450000D01*
X97400000Y-64450000D02*
X97400000Y-65350000D01*
X99000000Y-65350000D02*
X99000000Y-64450000D01*
X99000000Y-65350000D02*
X97400000Y-65350000D01*
%TO.C,TH5*%
X103840000Y-44750000D02*
X103840000Y-43650000D01*
X103840000Y-44750000D02*
X104570000Y-44750000D01*
X104570000Y-43650000D02*
X103840000Y-43650000D01*
X104570000Y-43650000D02*
X104570000Y-44750000D01*
%TO.C,TH4*%
X124150000Y-61240000D02*
X125250000Y-61240000D01*
X124150000Y-61240000D02*
X124150000Y-61970000D01*
X125250000Y-61970000D02*
X125250000Y-61240000D01*
X125250000Y-61970000D02*
X124150000Y-61970000D01*
%TO.C,TH3*%
X118360000Y-80450000D02*
X118360000Y-81550000D01*
X118360000Y-80450000D02*
X117630000Y-80450000D01*
X117630000Y-81550000D02*
X118360000Y-81550000D01*
X117630000Y-81550000D02*
X117630000Y-80450000D01*
%TO.C,TH2*%
X99350000Y-62440000D02*
X100450000Y-62440000D01*
X99350000Y-62440000D02*
X99350000Y-63170000D01*
X100450000Y-63170000D02*
X100450000Y-62440000D01*
X100450000Y-63170000D02*
X99350000Y-63170000D01*
%TO.C,R52*%
X97400000Y-57450000D02*
X99000000Y-57450000D01*
X97400000Y-57450000D02*
X97400000Y-58350000D01*
X99000000Y-58350000D02*
X99000000Y-57450000D01*
X99000000Y-58350000D02*
X97400000Y-58350000D01*
%TO.C,R51*%
X97400000Y-56550000D02*
X99000000Y-56550000D01*
X97400000Y-56550000D02*
X97400000Y-57450000D01*
X99000000Y-57450000D02*
X99000000Y-56550000D01*
X99000000Y-57450000D02*
X97400000Y-57450000D01*
%TO.C,R50*%
X100000000Y-56150000D02*
X101600000Y-56150000D01*
X100000000Y-56150000D02*
X100000000Y-57050000D01*
X101600000Y-57050000D02*
X101600000Y-56150000D01*
X101600000Y-57050000D02*
X100000000Y-57050000D01*
%TO.C,R49*%
X100000000Y-46550000D02*
X101600000Y-46550000D01*
X100000000Y-46550000D02*
X100000000Y-47450000D01*
X101600000Y-47450000D02*
X101600000Y-46550000D01*
X101600000Y-47450000D02*
X100000000Y-47450000D01*
%TO.C,R48*%
X97400000Y-44750000D02*
X99000000Y-44750000D01*
X97400000Y-44750000D02*
X97400000Y-45650000D01*
X99000000Y-45650000D02*
X99000000Y-44750000D01*
X99000000Y-45650000D02*
X97400000Y-45650000D01*
%TO.C,R47*%
X97400000Y-46450000D02*
X99000000Y-46450000D01*
X97400000Y-46450000D02*
X97400000Y-47350000D01*
X99000000Y-47350000D02*
X99000000Y-46450000D01*
X99000000Y-47350000D02*
X97400000Y-47350000D01*
%TO.C,R46*%
X97400000Y-43850000D02*
X99000000Y-43850000D01*
X97400000Y-43850000D02*
X97400000Y-44750000D01*
X99000000Y-44750000D02*
X99000000Y-43850000D01*
X99000000Y-44750000D02*
X97400000Y-44750000D01*
%TO.C,R45*%
X101600000Y-46450000D02*
X100000000Y-46450000D01*
X101600000Y-46450000D02*
X101600000Y-45550000D01*
X100000000Y-45550000D02*
X100000000Y-46450000D01*
X100000000Y-45550000D02*
X101600000Y-45550000D01*
%TO.C,R44*%
X101600000Y-44650000D02*
X100000000Y-44650000D01*
X101600000Y-44650000D02*
X101600000Y-43750000D01*
X100000000Y-43750000D02*
X100000000Y-44650000D01*
X100000000Y-43750000D02*
X101600000Y-43750000D01*
%TO.C,R43*%
X121600000Y-46850000D02*
X120000000Y-46850000D01*
X121600000Y-46850000D02*
X121600000Y-45950000D01*
X120000000Y-45950000D02*
X120000000Y-46850000D01*
X120000000Y-45950000D02*
X121600000Y-45950000D01*
%TO.C,R42*%
X121600000Y-47750000D02*
X120000000Y-47750000D01*
X121600000Y-47750000D02*
X121600000Y-46850000D01*
X120000000Y-46850000D02*
X120000000Y-47750000D01*
X120000000Y-46850000D02*
X121600000Y-46850000D01*
%TO.C,R41*%
X119300000Y-47250000D02*
X117700000Y-47250000D01*
X119300000Y-47250000D02*
X119300000Y-46350000D01*
X117700000Y-46350000D02*
X117700000Y-47250000D01*
X117700000Y-46350000D02*
X119300000Y-46350000D01*
%TO.C,R40*%
X120200000Y-57550000D02*
X118600000Y-57550000D01*
X120200000Y-57550000D02*
X120200000Y-56650000D01*
X118600000Y-56650000D02*
X118600000Y-57550000D01*
X118600000Y-56650000D02*
X120200000Y-56650000D01*
%TO.C,R39*%
X120200000Y-59150000D02*
X118600000Y-59150000D01*
X120200000Y-59150000D02*
X120200000Y-58250000D01*
X118600000Y-58250000D02*
X118600000Y-59150000D01*
X118600000Y-58250000D02*
X120200000Y-58250000D01*
%TO.C,R38*%
X122800000Y-58450000D02*
X121200000Y-58450000D01*
X122800000Y-58450000D02*
X122800000Y-57550000D01*
X121200000Y-57550000D02*
X121200000Y-58450000D01*
X121200000Y-57550000D02*
X122800000Y-57550000D01*
%TO.C,R37*%
X120200000Y-60050000D02*
X118600000Y-60050000D01*
X120200000Y-60050000D02*
X120200000Y-59150000D01*
X118600000Y-59150000D02*
X118600000Y-60050000D01*
X118600000Y-59150000D02*
X120200000Y-59150000D01*
%TO.C,R36*%
X121200000Y-60450000D02*
X122800000Y-60450000D01*
X121200000Y-60450000D02*
X121200000Y-61350000D01*
X122800000Y-61350000D02*
X122800000Y-60450000D01*
X122800000Y-61350000D02*
X121200000Y-61350000D01*
%TO.C,R35*%
X121200000Y-62150000D02*
X122800000Y-62150000D01*
X121200000Y-62150000D02*
X121200000Y-63050000D01*
X122800000Y-63050000D02*
X122800000Y-62150000D01*
X122800000Y-63050000D02*
X121200000Y-63050000D01*
%TO.C,R34*%
X122800000Y-65850000D02*
X121200000Y-65850000D01*
X122800000Y-65850000D02*
X122800000Y-64950000D01*
X121200000Y-64950000D02*
X121200000Y-65850000D01*
X121200000Y-64950000D02*
X122800000Y-64950000D01*
%TO.C,R33*%
X122800000Y-66750000D02*
X121200000Y-66750000D01*
X122800000Y-66750000D02*
X122800000Y-65850000D01*
X121200000Y-65850000D02*
X121200000Y-66750000D01*
X121200000Y-65850000D02*
X122800000Y-65850000D01*
%TO.C,R32*%
X122800000Y-67750000D02*
X121200000Y-67750000D01*
X122800000Y-67750000D02*
X122800000Y-66850000D01*
X121200000Y-66850000D02*
X121200000Y-67750000D01*
X121200000Y-66850000D02*
X122800000Y-66850000D01*
%TO.C,R31*%
X120200000Y-77950000D02*
X118600000Y-77950000D01*
X120200000Y-77950000D02*
X120200000Y-77050000D01*
X118600000Y-77050000D02*
X118600000Y-77950000D01*
X118600000Y-77050000D02*
X120200000Y-77050000D01*
%TO.C,R30*%
X122800000Y-79550000D02*
X121200000Y-79550000D01*
X122800000Y-79550000D02*
X122800000Y-78650000D01*
X121200000Y-78650000D02*
X121200000Y-79550000D01*
X121200000Y-78650000D02*
X122800000Y-78650000D01*
%TO.C,R29*%
X122800000Y-77950000D02*
X121200000Y-77950000D01*
X122800000Y-77950000D02*
X122800000Y-77050000D01*
X121200000Y-77050000D02*
X121200000Y-77950000D01*
X121200000Y-77050000D02*
X122800000Y-77050000D01*
%TO.C,R28*%
X122800000Y-80450000D02*
X121200000Y-80450000D01*
X122800000Y-80450000D02*
X122800000Y-79550000D01*
X121200000Y-79550000D02*
X121200000Y-80450000D01*
X121200000Y-79550000D02*
X122800000Y-79550000D01*
%TO.C,R27*%
X118600000Y-78050000D02*
X120200000Y-78050000D01*
X118600000Y-78050000D02*
X118600000Y-78950000D01*
X120200000Y-78950000D02*
X120200000Y-78050000D01*
X120200000Y-78950000D02*
X118600000Y-78950000D01*
%TO.C,R26*%
X118600000Y-79750000D02*
X120200000Y-79750000D01*
X118600000Y-79750000D02*
X118600000Y-80650000D01*
X120200000Y-80650000D02*
X120200000Y-79750000D01*
X120200000Y-80650000D02*
X118600000Y-80650000D01*
%TO.C,R25*%
X97400000Y-77450000D02*
X99000000Y-77450000D01*
X97400000Y-77450000D02*
X97400000Y-78350000D01*
X99000000Y-78350000D02*
X99000000Y-77450000D01*
X99000000Y-78350000D02*
X97400000Y-78350000D01*
%TO.C,R24*%
X97400000Y-76550000D02*
X99000000Y-76550000D01*
X97400000Y-76550000D02*
X97400000Y-77450000D01*
X99000000Y-77450000D02*
X99000000Y-76550000D01*
X99000000Y-77450000D02*
X97400000Y-77450000D01*
%TO.C,R23*%
X96700000Y-75550000D02*
X98300000Y-75550000D01*
X96700000Y-75550000D02*
X96700000Y-76450000D01*
X98300000Y-76450000D02*
X98300000Y-75550000D01*
X98300000Y-76450000D02*
X96700000Y-76450000D01*
%TO.C,R22*%
X100000000Y-66350000D02*
X101600000Y-66350000D01*
X100000000Y-66350000D02*
X100000000Y-67250000D01*
X101600000Y-67250000D02*
X101600000Y-66350000D01*
X101600000Y-67250000D02*
X100000000Y-67250000D01*
%TO.C,R20*%
X97400000Y-66050000D02*
X99000000Y-66050000D01*
X97400000Y-66050000D02*
X97400000Y-66950000D01*
X99000000Y-66950000D02*
X99000000Y-66050000D01*
X99000000Y-66950000D02*
X97400000Y-66950000D01*
%TO.C,R19*%
X97400000Y-63550000D02*
X99000000Y-63550000D01*
X97400000Y-63550000D02*
X97400000Y-64450000D01*
X99000000Y-64450000D02*
X99000000Y-63550000D01*
X99000000Y-64450000D02*
X97400000Y-64450000D01*
%TO.C,R18*%
X99000000Y-63250000D02*
X97400000Y-63250000D01*
X99000000Y-63250000D02*
X99000000Y-62350000D01*
X97400000Y-62350000D02*
X97400000Y-63250000D01*
X97400000Y-62350000D02*
X99000000Y-62350000D01*
%TO.C,R17*%
X99000000Y-61350000D02*
X97400000Y-61350000D01*
X99000000Y-61350000D02*
X99000000Y-60450000D01*
X97400000Y-60450000D02*
X97400000Y-61350000D01*
X97400000Y-60450000D02*
X99000000Y-60450000D01*
%TO.C,R16*%
X121200000Y-76150000D02*
X122800000Y-76150000D01*
X121200000Y-76150000D02*
X121200000Y-77050000D01*
X122800000Y-77050000D02*
X122800000Y-76150000D01*
X122800000Y-77050000D02*
X121200000Y-77050000D01*
%TO.C,R15*%
X121200000Y-56650000D02*
X122800000Y-56650000D01*
X121200000Y-56650000D02*
X121200000Y-57550000D01*
X122800000Y-57550000D02*
X122800000Y-56650000D01*
X122800000Y-57550000D02*
X121200000Y-57550000D01*
%TO.C,R14*%
X121220000Y-44600000D02*
X121220000Y-45700000D01*
X121220000Y-44600000D02*
X120490000Y-44600000D01*
X120490000Y-45700000D02*
X121220000Y-45700000D01*
X120490000Y-45700000D02*
X120490000Y-44600000D01*
%TO.C,R13*%
X121200000Y-75250000D02*
X122800000Y-75250000D01*
X121200000Y-75250000D02*
X121200000Y-76150000D01*
X122800000Y-76150000D02*
X122800000Y-75250000D01*
X122800000Y-76150000D02*
X121200000Y-76150000D01*
%TO.C,R12*%
X121200000Y-55750000D02*
X122800000Y-55750000D01*
X121200000Y-55750000D02*
X121200000Y-56650000D01*
X122800000Y-56650000D02*
X122800000Y-55750000D01*
X122800000Y-56650000D02*
X121200000Y-56650000D01*
%TO.C,R11*%
X122820000Y-45550000D02*
X122820000Y-46650000D01*
X122820000Y-45550000D02*
X122090000Y-45550000D01*
X122090000Y-46650000D02*
X122820000Y-46650000D01*
X122090000Y-46650000D02*
X122090000Y-45550000D01*
%TO.C,R10*%
X120480000Y-44600000D02*
X120480000Y-43500000D01*
X120480000Y-44600000D02*
X121210000Y-44600000D01*
X121210000Y-43500000D02*
X120480000Y-43500000D01*
X121210000Y-43500000D02*
X121210000Y-44600000D01*
%TO.C,R9*%
X122820000Y-46650000D02*
X122820000Y-47750000D01*
X122820000Y-46650000D02*
X122090000Y-46650000D01*
X122090000Y-47750000D02*
X122820000Y-47750000D01*
X122090000Y-47750000D02*
X122090000Y-46650000D01*
%TO.C,R8*%
X99000000Y-68750000D02*
X97400000Y-68750000D01*
X99000000Y-68750000D02*
X99000000Y-67850000D01*
X97400000Y-67850000D02*
X97400000Y-68750000D01*
X97400000Y-67850000D02*
X99000000Y-67850000D01*
%TO.C,R7*%
X99000000Y-49150000D02*
X97400000Y-49150000D01*
X99000000Y-49150000D02*
X99000000Y-48250000D01*
X97400000Y-48250000D02*
X97400000Y-49150000D01*
X97400000Y-48250000D02*
X99000000Y-48250000D01*
%TO.C,R6*%
X99000000Y-67850000D02*
X97400000Y-67850000D01*
X99000000Y-67850000D02*
X99000000Y-66950000D01*
X97400000Y-66950000D02*
X97400000Y-67850000D01*
X97400000Y-66950000D02*
X99000000Y-66950000D01*
%TO.C,R5*%
X99000000Y-48250000D02*
X97400000Y-48250000D01*
X99000000Y-48250000D02*
X99000000Y-47350000D01*
X97400000Y-47350000D02*
X97400000Y-48250000D01*
X97400000Y-47350000D02*
X99000000Y-47350000D01*
%TO.C,R3*%
X95970000Y-77350000D02*
X95970000Y-78450000D01*
X95970000Y-77350000D02*
X95240000Y-77350000D01*
X95240000Y-78450000D02*
X95970000Y-78450000D01*
X95240000Y-78450000D02*
X95240000Y-77350000D01*
%TO.C,R2*%
X94570000Y-76850000D02*
X94570000Y-77950000D01*
X94570000Y-76850000D02*
X93840000Y-76850000D01*
X93840000Y-77950000D02*
X94570000Y-77950000D01*
X93840000Y-77950000D02*
X93840000Y-76850000D01*
%TO.C,R1*%
X103300000Y-80250000D02*
X104900000Y-80250000D01*
X103300000Y-80250000D02*
X103300000Y-81150000D01*
X104900000Y-81150000D02*
X104900000Y-80250000D01*
X104900000Y-81150000D02*
X103300000Y-81150000D01*
%TO.C,C106*%
X95900000Y-59600000D02*
X93900000Y-59600000D01*
X95900000Y-59600000D02*
X95900000Y-58800000D01*
X93900000Y-58800000D02*
X93900000Y-59600000D01*
X93900000Y-58800000D02*
X95900000Y-58800000D01*
%TO.C,C105*%
X93900000Y-59600000D02*
X95900000Y-59600000D01*
X93900000Y-59600000D02*
X93900000Y-60400000D01*
X95900000Y-60400000D02*
X95900000Y-59600000D01*
X95900000Y-60400000D02*
X93900000Y-60400000D01*
%TO.C,C104*%
X95900000Y-61200000D02*
X93900000Y-61200000D01*
X95900000Y-61200000D02*
X95900000Y-60400000D01*
X93900000Y-60400000D02*
X93900000Y-61200000D01*
X93900000Y-60400000D02*
X95900000Y-60400000D01*
%TO.C,C101*%
X95900000Y-56500000D02*
X93900000Y-56500000D01*
X95900000Y-56500000D02*
X95900000Y-55700000D01*
X93900000Y-55700000D02*
X93900000Y-56500000D01*
X93900000Y-55700000D02*
X95900000Y-55700000D01*
%TO.C,C100*%
X93900000Y-54900000D02*
X95900000Y-54900000D01*
X93900000Y-54900000D02*
X93900000Y-55700000D01*
X95900000Y-55700000D02*
X95900000Y-54900000D01*
X95900000Y-55700000D02*
X93900000Y-55700000D01*
%TO.C,C99*%
X95900000Y-54900000D02*
X93900000Y-54900000D01*
X95900000Y-54900000D02*
X95900000Y-54100000D01*
X93900000Y-54100000D02*
X93900000Y-54900000D01*
X93900000Y-54100000D02*
X95900000Y-54100000D01*
%TO.C,C98*%
X95900000Y-50700000D02*
X93900000Y-50700000D01*
X95900000Y-50700000D02*
X95900000Y-49900000D01*
X93900000Y-49900000D02*
X93900000Y-50700000D01*
X93900000Y-49900000D02*
X95900000Y-49900000D01*
%TO.C,C97*%
X93900000Y-49100000D02*
X95900000Y-49100000D01*
X93900000Y-49100000D02*
X93900000Y-49900000D01*
X95900000Y-49900000D02*
X95900000Y-49100000D01*
X95900000Y-49900000D02*
X93900000Y-49900000D01*
%TO.C,C96*%
X95900000Y-49100000D02*
X93900000Y-49100000D01*
X95900000Y-49100000D02*
X95900000Y-48300000D01*
X93900000Y-48300000D02*
X93900000Y-49100000D01*
X93900000Y-48300000D02*
X95900000Y-48300000D01*
%TO.C,C94*%
X93900000Y-46000000D02*
X95900000Y-46000000D01*
X93900000Y-46000000D02*
X93900000Y-46800000D01*
X95900000Y-46800000D02*
X95900000Y-46000000D01*
X95900000Y-46800000D02*
X93900000Y-46800000D01*
%TO.C,C92*%
X95900000Y-46000000D02*
X93900000Y-46000000D01*
X95900000Y-46000000D02*
X95900000Y-45200000D01*
X93900000Y-45200000D02*
X93900000Y-46000000D01*
X93900000Y-45200000D02*
X95900000Y-45200000D01*
%TO.C,C91*%
X93900000Y-44400000D02*
X95900000Y-44400000D01*
X93900000Y-44400000D02*
X93900000Y-45200000D01*
X95900000Y-45200000D02*
X95900000Y-44400000D01*
X95900000Y-45200000D02*
X93900000Y-45200000D01*
%TO.C,C90*%
X95900000Y-44400000D02*
X93900000Y-44400000D01*
X95900000Y-44400000D02*
X95900000Y-43600000D01*
X93900000Y-43600000D02*
X93900000Y-44400000D01*
X93900000Y-43600000D02*
X95900000Y-43600000D01*
%TO.C,C89*%
X101800000Y-45500000D02*
X99800000Y-45500000D01*
X101800000Y-45500000D02*
X101800000Y-44700000D01*
X99800000Y-44700000D02*
X99800000Y-45500000D01*
X99800000Y-44700000D02*
X101800000Y-44700000D01*
%TO.C,C87*%
X126300000Y-45200000D02*
X124300000Y-45200000D01*
X126300000Y-45200000D02*
X126300000Y-44400000D01*
X124300000Y-44400000D02*
X124300000Y-45200000D01*
X124300000Y-44400000D02*
X126300000Y-44400000D01*
%TO.C,C86*%
X124300000Y-43600000D02*
X126300000Y-43600000D01*
X124300000Y-43600000D02*
X124300000Y-44400000D01*
X126300000Y-44400000D02*
X126300000Y-43600000D01*
X126300000Y-44400000D02*
X124300000Y-44400000D01*
%TO.C,C85*%
X126300000Y-43600000D02*
X124300000Y-43600000D01*
X126300000Y-43600000D02*
X126300000Y-42800000D01*
X124300000Y-42800000D02*
X124300000Y-43600000D01*
X124300000Y-42800000D02*
X126300000Y-42800000D01*
%TO.C,C82*%
X124300000Y-48100000D02*
X126300000Y-48100000D01*
X124300000Y-48100000D02*
X124300000Y-48900000D01*
X126300000Y-48900000D02*
X126300000Y-48100000D01*
X126300000Y-48900000D02*
X124300000Y-48900000D01*
%TO.C,C81*%
X126300000Y-49700000D02*
X124300000Y-49700000D01*
X126300000Y-49700000D02*
X126300000Y-48900000D01*
X124300000Y-48900000D02*
X124300000Y-49700000D01*
X124300000Y-48900000D02*
X126300000Y-48900000D01*
%TO.C,C80*%
X124300000Y-49700000D02*
X126300000Y-49700000D01*
X124300000Y-49700000D02*
X124300000Y-50500000D01*
X126300000Y-50500000D02*
X126300000Y-49700000D01*
X126300000Y-50500000D02*
X124300000Y-50500000D01*
%TO.C,C79*%
X124300000Y-53300000D02*
X126300000Y-53300000D01*
X124300000Y-53300000D02*
X124300000Y-54100000D01*
X126300000Y-54100000D02*
X126300000Y-53300000D01*
X126300000Y-54100000D02*
X124300000Y-54100000D01*
%TO.C,C78*%
X126300000Y-54900000D02*
X124300000Y-54900000D01*
X126300000Y-54900000D02*
X126300000Y-54100000D01*
X124300000Y-54100000D02*
X124300000Y-54900000D01*
X124300000Y-54100000D02*
X126300000Y-54100000D01*
%TO.C,C77*%
X124300000Y-54900000D02*
X126300000Y-54900000D01*
X124300000Y-54900000D02*
X124300000Y-55700000D01*
X126300000Y-55700000D02*
X126300000Y-54900000D01*
X126300000Y-55700000D02*
X124300000Y-55700000D01*
%TO.C,C75*%
X126300000Y-58000000D02*
X124300000Y-58000000D01*
X126300000Y-58000000D02*
X126300000Y-57200000D01*
X124300000Y-57200000D02*
X124300000Y-58000000D01*
X124300000Y-57200000D02*
X126300000Y-57200000D01*
%TO.C,C73*%
X124300000Y-58000000D02*
X126300000Y-58000000D01*
X124300000Y-58000000D02*
X124300000Y-58800000D01*
X126300000Y-58800000D02*
X126300000Y-58000000D01*
X126300000Y-58800000D02*
X124300000Y-58800000D01*
%TO.C,C72*%
X126300000Y-59600000D02*
X124300000Y-59600000D01*
X126300000Y-59600000D02*
X126300000Y-58800000D01*
X124300000Y-58800000D02*
X124300000Y-59600000D01*
X124300000Y-58800000D02*
X126300000Y-58800000D01*
%TO.C,C71*%
X124300000Y-59600000D02*
X126300000Y-59600000D01*
X124300000Y-59600000D02*
X124300000Y-60400000D01*
X126300000Y-60400000D02*
X126300000Y-59600000D01*
X126300000Y-60400000D02*
X124300000Y-60400000D01*
%TO.C,C70*%
X121000000Y-61300000D02*
X123000000Y-61300000D01*
X121000000Y-61300000D02*
X121000000Y-62100000D01*
X123000000Y-62100000D02*
X123000000Y-61300000D01*
X123000000Y-62100000D02*
X121000000Y-62100000D01*
%TO.C,C68*%
X124300000Y-64700000D02*
X126300000Y-64700000D01*
X124300000Y-64700000D02*
X124300000Y-65500000D01*
X126300000Y-65500000D02*
X126300000Y-64700000D01*
X126300000Y-65500000D02*
X124300000Y-65500000D01*
%TO.C,C67*%
X126300000Y-64700000D02*
X124300000Y-64700000D01*
X126300000Y-64700000D02*
X126300000Y-63900000D01*
X124300000Y-63900000D02*
X124300000Y-64700000D01*
X124300000Y-63900000D02*
X126300000Y-63900000D01*
%TO.C,C66*%
X124300000Y-63100000D02*
X126300000Y-63100000D01*
X124300000Y-63100000D02*
X124300000Y-63900000D01*
X126300000Y-63900000D02*
X126300000Y-63100000D01*
X126300000Y-63900000D02*
X124300000Y-63900000D01*
%TO.C,C63*%
X124300000Y-67800000D02*
X126300000Y-67800000D01*
X124300000Y-67800000D02*
X124300000Y-68600000D01*
X126300000Y-68600000D02*
X126300000Y-67800000D01*
X126300000Y-68600000D02*
X124300000Y-68600000D01*
%TO.C,C62*%
X126300000Y-69400000D02*
X124300000Y-69400000D01*
X126300000Y-69400000D02*
X126300000Y-68600000D01*
X124300000Y-68600000D02*
X124300000Y-69400000D01*
X124300000Y-68600000D02*
X126300000Y-68600000D01*
%TO.C,C61*%
X124300000Y-69400000D02*
X126300000Y-69400000D01*
X124300000Y-69400000D02*
X124300000Y-70200000D01*
X126300000Y-70200000D02*
X126300000Y-69400000D01*
X126300000Y-70200000D02*
X124300000Y-70200000D01*
%TO.C,C60*%
X124300000Y-73600000D02*
X126300000Y-73600000D01*
X124300000Y-73600000D02*
X124300000Y-74400000D01*
X126300000Y-74400000D02*
X126300000Y-73600000D01*
X126300000Y-74400000D02*
X124300000Y-74400000D01*
%TO.C,C59*%
X126300000Y-75200000D02*
X124300000Y-75200000D01*
X126300000Y-75200000D02*
X126300000Y-74400000D01*
X124300000Y-74400000D02*
X124300000Y-75200000D01*
X124300000Y-74400000D02*
X126300000Y-74400000D01*
%TO.C,C58*%
X124300000Y-75200000D02*
X126300000Y-75200000D01*
X124300000Y-75200000D02*
X124300000Y-76000000D01*
X126300000Y-76000000D02*
X126300000Y-75200000D01*
X126300000Y-76000000D02*
X124300000Y-76000000D01*
%TO.C,C56*%
X126300000Y-78300000D02*
X124300000Y-78300000D01*
X126300000Y-78300000D02*
X126300000Y-77500000D01*
X124300000Y-77500000D02*
X124300000Y-78300000D01*
X124300000Y-77500000D02*
X126300000Y-77500000D01*
%TO.C,C54*%
X124300000Y-78300000D02*
X126300000Y-78300000D01*
X124300000Y-78300000D02*
X124300000Y-79100000D01*
X126300000Y-79100000D02*
X126300000Y-78300000D01*
X126300000Y-79100000D02*
X124300000Y-79100000D01*
%TO.C,C53*%
X126300000Y-79900000D02*
X124300000Y-79900000D01*
X126300000Y-79900000D02*
X126300000Y-79100000D01*
X124300000Y-79100000D02*
X124300000Y-79900000D01*
X124300000Y-79100000D02*
X126300000Y-79100000D01*
%TO.C,C52*%
X124300000Y-79900000D02*
X126300000Y-79900000D01*
X124300000Y-79900000D02*
X124300000Y-80700000D01*
X126300000Y-80700000D02*
X126300000Y-79900000D01*
X126300000Y-80700000D02*
X124300000Y-80700000D01*
%TO.C,C51*%
X118400000Y-78900000D02*
X120400000Y-78900000D01*
X118400000Y-78900000D02*
X118400000Y-79700000D01*
X120400000Y-79700000D02*
X120400000Y-78900000D01*
X120400000Y-79700000D02*
X118400000Y-79700000D01*
%TO.C,C49*%
X95900000Y-79500000D02*
X93900000Y-79500000D01*
X95900000Y-79500000D02*
X95900000Y-78700000D01*
X93900000Y-78700000D02*
X93900000Y-79500000D01*
X93900000Y-78700000D02*
X95900000Y-78700000D01*
%TO.C,C48*%
X93900000Y-79500000D02*
X95900000Y-79500000D01*
X93900000Y-79500000D02*
X93900000Y-80300000D01*
X95900000Y-80300000D02*
X95900000Y-79500000D01*
X95900000Y-80300000D02*
X93900000Y-80300000D01*
%TO.C,C47*%
X95900000Y-81100000D02*
X93900000Y-81100000D01*
X95900000Y-81100000D02*
X95900000Y-80300000D01*
X93900000Y-80300000D02*
X93900000Y-81100000D01*
X93900000Y-80300000D02*
X95900000Y-80300000D01*
%TO.C,C44*%
X95900000Y-76200000D02*
X93900000Y-76200000D01*
X95900000Y-76200000D02*
X95900000Y-75400000D01*
X93900000Y-75400000D02*
X93900000Y-76200000D01*
X93900000Y-75400000D02*
X95900000Y-75400000D01*
%TO.C,C43*%
X93900000Y-74600000D02*
X95900000Y-74600000D01*
X93900000Y-74600000D02*
X93900000Y-75400000D01*
X95900000Y-75400000D02*
X95900000Y-74600000D01*
X95900000Y-75400000D02*
X93900000Y-75400000D01*
%TO.C,C42*%
X95900000Y-74600000D02*
X93900000Y-74600000D01*
X95900000Y-74600000D02*
X95900000Y-73800000D01*
X93900000Y-73800000D02*
X93900000Y-74600000D01*
X93900000Y-73800000D02*
X95900000Y-73800000D01*
%TO.C,C41*%
X95900000Y-71000000D02*
X93900000Y-71000000D01*
X95900000Y-71000000D02*
X95900000Y-70200000D01*
X93900000Y-70200000D02*
X93900000Y-71000000D01*
X93900000Y-70200000D02*
X95900000Y-70200000D01*
%TO.C,C40*%
X93900000Y-69400000D02*
X95900000Y-69400000D01*
X93900000Y-69400000D02*
X93900000Y-70200000D01*
X95900000Y-70200000D02*
X95900000Y-69400000D01*
X95900000Y-70200000D02*
X93900000Y-70200000D01*
%TO.C,C39*%
X95900000Y-69400000D02*
X93900000Y-69400000D01*
X95900000Y-69400000D02*
X95900000Y-68600000D01*
X93900000Y-68600000D02*
X93900000Y-69400000D01*
X93900000Y-68600000D02*
X95900000Y-68600000D01*
%TO.C,C37*%
X93900000Y-66300000D02*
X95900000Y-66300000D01*
X93900000Y-66300000D02*
X93900000Y-67100000D01*
X95900000Y-67100000D02*
X95900000Y-66300000D01*
X95900000Y-67100000D02*
X93900000Y-67100000D01*
%TO.C,C35*%
X95900000Y-66300000D02*
X93900000Y-66300000D01*
X95900000Y-66300000D02*
X95900000Y-65500000D01*
X93900000Y-65500000D02*
X93900000Y-66300000D01*
X93900000Y-65500000D02*
X95900000Y-65500000D01*
%TO.C,C34*%
X93900000Y-64700000D02*
X95900000Y-64700000D01*
X93900000Y-64700000D02*
X93900000Y-65500000D01*
X95900000Y-65500000D02*
X95900000Y-64700000D01*
X95900000Y-65500000D02*
X93900000Y-65500000D01*
%TO.C,C33*%
X95900000Y-64700000D02*
X93900000Y-64700000D01*
X95900000Y-64700000D02*
X95900000Y-63900000D01*
X93900000Y-63900000D02*
X93900000Y-64700000D01*
X93900000Y-63900000D02*
X95900000Y-63900000D01*
%TO.C,C17*%
X110975000Y-59200000D02*
X110975000Y-57200000D01*
X110975000Y-59200000D02*
X111775000Y-59200000D01*
X111775000Y-57200000D02*
X110975000Y-57200000D01*
X111775000Y-57200000D02*
X111775000Y-59200000D01*
%TO.C,C16*%
X114025000Y-57200000D02*
X114025000Y-55200000D01*
X114025000Y-57200000D02*
X114825000Y-57200000D01*
X114825000Y-55200000D02*
X114025000Y-55200000D01*
X114825000Y-55200000D02*
X114825000Y-57200000D01*
%TO.C,C15*%
X110100000Y-70500000D02*
X112100000Y-70500000D01*
X110100000Y-70500000D02*
X110100000Y-71300000D01*
X112100000Y-71300000D02*
X112100000Y-70500000D01*
X112100000Y-71300000D02*
X110100000Y-71300000D01*
%TO.C,C14*%
X113500000Y-68600000D02*
X115500000Y-68600000D01*
X113500000Y-68600000D02*
X113500000Y-69400000D01*
X115500000Y-69400000D02*
X115500000Y-68600000D01*
X115500000Y-69400000D02*
X113500000Y-69400000D01*
%TO.C,C13*%
X105700000Y-71400000D02*
X103700000Y-71400000D01*
X105700000Y-71400000D02*
X105700000Y-70600000D01*
X103700000Y-70600000D02*
X103700000Y-71400000D01*
X103700000Y-70600000D02*
X105700000Y-70600000D01*
%TO.C,C12*%
X102600000Y-68100000D02*
X104600000Y-68100000D01*
X102600000Y-68100000D02*
X102600000Y-68900000D01*
X104600000Y-68900000D02*
X104600000Y-68100000D01*
X104600000Y-68900000D02*
X102600000Y-68900000D01*
%TO.C,C11*%
X106100000Y-57200000D02*
X106100000Y-55200000D01*
X106100000Y-57200000D02*
X106900000Y-57200000D01*
X106900000Y-55200000D02*
X106100000Y-55200000D01*
X106900000Y-55200000D02*
X106900000Y-57200000D01*
%TO.C,C10*%
X107625000Y-59200000D02*
X107625000Y-57200000D01*
X107625000Y-59200000D02*
X108425000Y-59200000D01*
X108425000Y-57200000D02*
X107625000Y-57200000D01*
X108425000Y-57200000D02*
X108425000Y-59200000D01*
%TO.C,C8*%
X111775000Y-59200000D02*
X111775000Y-57200000D01*
X111775000Y-59200000D02*
X112575000Y-59200000D01*
X112575000Y-57200000D02*
X111775000Y-57200000D01*
X112575000Y-57200000D02*
X112575000Y-59200000D01*
%TO.C,C6*%
X110600000Y-69700000D02*
X112600000Y-69700000D01*
X110600000Y-69700000D02*
X110600000Y-70500000D01*
X112600000Y-70500000D02*
X112600000Y-69700000D01*
X112600000Y-70500000D02*
X110600000Y-70500000D01*
%TO.C,C5*%
X113500000Y-69400000D02*
X115500000Y-69400000D01*
X113500000Y-69400000D02*
X113500000Y-70200000D01*
X115500000Y-70200000D02*
X115500000Y-69400000D01*
X115500000Y-70200000D02*
X113500000Y-70200000D01*
%TO.C,C4*%
X105700000Y-70600000D02*
X103700000Y-70600000D01*
X105700000Y-70600000D02*
X105700000Y-69800000D01*
X103700000Y-69800000D02*
X103700000Y-70600000D01*
X103700000Y-69800000D02*
X105700000Y-69800000D01*
%TO.C,C3*%
X102600000Y-68900000D02*
X104600000Y-68900000D01*
X102600000Y-68900000D02*
X102600000Y-69700000D01*
X104600000Y-69700000D02*
X104600000Y-68900000D01*
X104600000Y-69700000D02*
X102600000Y-69700000D01*
%TO.C,C2*%
X105300000Y-57200000D02*
X105300000Y-55200000D01*
X105300000Y-57200000D02*
X106100000Y-57200000D01*
X106100000Y-55200000D02*
X105300000Y-55200000D01*
X106100000Y-55200000D02*
X106100000Y-57200000D01*
%TO.C,C1*%
X108425000Y-59200000D02*
X108425000Y-57200000D01*
X108425000Y-59200000D02*
X109225000Y-59200000D01*
X109225000Y-57200000D02*
X108425000Y-57200000D01*
X109225000Y-57200000D02*
X109225000Y-59200000D01*
D11*
%TO.C,J_conn1*%
X103174996Y-67849500D02*
X103174996Y-67849500D01*
X103174996Y-67849500D02*
X117024998Y-67849500D01*
X117024998Y-67849500D02*
X117024998Y-63907502D01*
X117024998Y-63907502D02*
X103174996Y-63907502D01*
X103174996Y-63907502D02*
X103174996Y-67849500D01*
D10*
%TO.C,J1*%
X114350000Y-80285000D02*
X105850000Y-80285000D01*
X114350000Y-73815000D02*
X114350000Y-80285000D01*
X105850000Y-73815000D02*
X114350000Y-73815000D01*
X105850000Y-80285000D02*
X105850000Y-73815000D01*
%TD*%
M02*
