(module rd53b_hybrid_wirebonds_Chip3 (layer F.Cu) (tedit 5F936342)
  (descr "wirebonding diagram for RD53B Chip")
  (clearance 0.127)
  (fp_text reference Chip (at 9.6 -6.21) (layer F.SilkS) hide
    (effects (font (size 1 1) (thickness 0.15)))
  )
  (fp_text value RD53B (at 9.78 -4.45) (layer F.Fab)
    (effects (font (size 1 1) (thickness 0.15)))
  )
  (fp_line (start 19.67 1.7) (end 19 -1.8) (layer Dwgs.User) (width 0.01))
  (fp_line (start 19.57 1.7) (end 18.95 -1.2) (layer Dwgs.User) (width 0.01))
  (fp_line (start 19.48 1.7) (end 18.9 -1.2) (layer Dwgs.User) (width 0.01))
  (fp_line (start 19.38 1.7) (end 18.85 -1.2) (layer Dwgs.User) (width 0.01))
  (fp_line (start 19.27 1.7) (end 18.8 -1.2) (layer Dwgs.User) (width 0.01))
  (fp_line (start 19.17 1.7) (end 18.75 -1.2) (layer Dwgs.User) (width 0.01))
  (fp_line (start 19.07 1.7) (end 18.7 -1.2) (layer Dwgs.User) (width 0.01))
  (fp_line (start 18.97 1.7) (end 18.65 -1.2) (layer Dwgs.User) (width 0.01))
  (fp_line (start 18.88 1.7) (end 18.55 -1.8) (layer Dwgs.User) (width 0.01))
  (fp_line (start 18.78 1.7) (end 18.45 -1.6) (layer Dwgs.User) (width 0.01))
  (fp_line (start 18.67 1.7) (end 18.35 -1.8) (layer Dwgs.User) (width 0.01))
  (fp_line (start 18.58 1.7) (end 18.3 -1.6) (layer Dwgs.User) (width 0.01))
  (fp_line (start 18.47 1.7) (end 18.2 -1.8) (layer Dwgs.User) (width 0.01))
  (fp_line (start 18.37 1.7) (end 18 -1.8) (layer Dwgs.User) (width 0.01))
  (fp_line (start 18.18 1.7) (end 17.95 -1.8) (layer Dwgs.User) (width 0.01))
  (fp_line (start 18.27 1.7) (end 18 -1.6) (layer Dwgs.User) (width 0.01))
  (fp_line (start 18.07 1.7) (end 17.9 -1.6) (layer Dwgs.User) (width 0.01))
  (fp_line (start 17.97 1.7) (end 17.85 -1.8) (layer Dwgs.User) (width 0.01))
  (fp_line (start 17.87 1.7) (end 17.8 -1.6) (layer Dwgs.User) (width 0.01))
  (fp_line (start 17.77 1.7) (end 17.75 -1.8) (layer Dwgs.User) (width 0.01))
  (fp_line (start 17.67 1.7) (end 17.7 -1.6) (layer Dwgs.User) (width 0.01))
  (fp_line (start 17.57 1.7) (end 17.65 -1.8) (layer Dwgs.User) (width 0.01))
  (fp_line (start 17.47 1.7) (end 17.6 -1.6) (layer Dwgs.User) (width 0.01))
  (fp_line (start 17.38 1.7) (end 17.4 -1.8) (layer Dwgs.User) (width 0.01))
  (fp_line (start 17.28 1.7) (end 17.3 -1.6) (layer Dwgs.User) (width 0.01))
  (fp_line (start 17.17 1.7) (end 17.2 -1.8) (layer Dwgs.User) (width 0.01))
  (fp_line (start 17.07 1.7) (end 17.1 -1.6) (layer Dwgs.User) (width 0.01))
  (fp_line (start 16.97 1.7) (end 17 -1.8) (layer Dwgs.User) (width 0.01))
  (fp_line (start 16.87 1.7) (end 16.85 -1.2) (layer Dwgs.User) (width 0.01))
  (fp_line (start 16.77 1.7) (end 16.75 -1.2) (layer Dwgs.User) (width 0.01))
  (fp_line (start 16.67 1.7) (end 16.65 -1.2) (layer Dwgs.User) (width 0.01))
  (fp_line (start 16.57 1.7) (end 16.55 -1.2) (layer Dwgs.User) (width 0.01))
  (fp_line (start 16.47 1.7) (end 16.45 -1.2) (layer Dwgs.User) (width 0.01))
  (fp_line (start 15.68 1.7) (end 16.25 -1.9) (layer Dwgs.User) (width 0.01))
  (fp_line (start 15.58 1.7) (end 16 -1.9) (layer Dwgs.User) (width 0.01))
  (fp_line (start 14.58 1.7) (end 14.9 -1.6) (layer Dwgs.User) (width 0.01))
  (fp_line (start 14.47 1.7) (end 14.7 -1.6) (layer Dwgs.User) (width 0.01))
  (fp_line (start 14.37 1.7) (end 14.5 -1.55) (layer Dwgs.User) (width 0.01))
  (fp_line (start 14.28 1.7) (end 14.3 -1.6) (layer Dwgs.User) (width 0.01))
  (fp_line (start 14.08 1.7) (end 14.1 -1.2) (layer Dwgs.User) (width 0.01))
  (fp_line (start 13.97 1.7) (end 14.05 -1.2) (layer Dwgs.User) (width 0.01))
  (fp_line (start 13.88 1.7) (end 14 -1.2) (layer Dwgs.User) (width 0.01))
  (fp_line (start 13.78 1.7) (end 13.95 -1.2) (layer Dwgs.User) (width 0.01))
  (fp_line (start 13.67 1.7) (end 13.9 -1.2) (layer Dwgs.User) (width 0.01))
  (fp_line (start 13.58 1.69) (end 13.9 -1.8) (layer Dwgs.User) (width 0.01))
  (fp_line (start 13.48 1.69) (end 13.8 -1.6) (layer Dwgs.User) (width 0.01))
  (fp_line (start 13.37 1.69) (end 13.7 -1.8) (layer Dwgs.User) (width 0.01))
  (fp_line (start 13.28 1.69) (end 13.6 -1.6) (layer Dwgs.User) (width 0.01))
  (fp_line (start 13.18 1.69) (end 13.5 -1.8) (layer Dwgs.User) (width 0.01))
  (fp_line (start 13.08 1.69) (end 13.3 -1.8) (layer Dwgs.User) (width 0.01))
  (fp_line (start 12.98 1.69) (end 13.25 -1.6) (layer Dwgs.User) (width 0.01))
  (fp_line (start 12.88 1.69) (end 13.2 -1.8) (layer Dwgs.User) (width 0.01))
  (fp_line (start 12.78 1.69) (end 13.15 -1.6) (layer Dwgs.User) (width 0.01))
  (fp_line (start 12.68 1.69) (end 13.15 -1.8) (layer Dwgs.User) (width 0.01))
  (fp_line (start 12.58 1.69) (end 13.1 -1.6) (layer Dwgs.User) (width 0.01))
  (fp_line (start 12.48 1.69) (end 13.1 -1.8) (layer Dwgs.User) (width 0.01))
  (fp_line (start 12.38 1.69) (end 13 -1.6) (layer Dwgs.User) (width 0.01))
  (fp_line (start 12.28 1.69) (end 13 -1.8) (layer Dwgs.User) (width 0.01))
  (fp_line (start 12.18 1.69) (end 12.9 -1.6) (layer Dwgs.User) (width 0.01))
  (fp_line (start 12.08 1.69) (end 12.7 -1.8) (layer Dwgs.User) (width 0.01))
  (fp_line (start 11.98 1.69) (end 12.55 -1.6) (layer Dwgs.User) (width 0.01))
  (fp_line (start 11.88 1.69) (end 12.5 -1.8) (layer Dwgs.User) (width 0.01))
  (fp_line (start 11.78 1.69) (end 12.35 -1.6) (layer Dwgs.User) (width 0.01))
  (fp_line (start 11.67 1.69) (end 12.3 -1.8) (layer Dwgs.User) (width 0.01))
  (fp_line (start 11.58 1.69) (end 12.1 -1.2) (layer Dwgs.User) (width 0.01))
  (fp_line (start 11.48 1.69) (end 12 -1.2) (layer Dwgs.User) (width 0.01))
  (fp_line (start 11.38 1.69) (end 11.9 -1.2) (layer Dwgs.User) (width 0.01))
  (fp_line (start 11.27 1.69) (end 11.8 -1.2) (layer Dwgs.User) (width 0.01))
  (fp_line (start 11.17 1.69) (end 11.7 -1.2) (layer Dwgs.User) (width 0.01))
  (fp_line (start 10.98 1.69) (end 11.6 -1.5) (layer Dwgs.User) (width 0.01))
  (fp_line (start 10.88 1.69) (end 11.5 -1.2) (layer Dwgs.User) (width 0.01))
  (fp_line (start 10.57 1.69) (end 11.05 -1.2) (layer Dwgs.User) (width 0.01))
  (fp_line (start 10.28 1.69) (end 10.6 -1.2) (layer Dwgs.User) (width 0.01))
  (fp_line (start 9.98 1.69) (end 9.95 -1.2) (layer Dwgs.User) (width 0.01))
  (fp_line (start 9.67 1.69) (end 9.55 -1.2) (layer Dwgs.User) (width 0.01))
  (fp_line (start 9.57 1.69) (end 9.5 -1.5) (layer Dwgs.User) (width 0.01))
  (fp_line (start 9.47 1.69) (end 9.45 -1.2) (layer Dwgs.User) (width 0.01))
  (fp_line (start 9.38 1.69) (end 9.4 -1.5) (layer Dwgs.User) (width 0.01))
  (fp_line (start 10.78 1.7) (end 11.55 -1.9) (layer Dwgs.User) (width 0.01))
  (fp_line (start 10.68 1.7) (end 11.3 -1.9) (layer Dwgs.User) (width 0.01))
  (fp_line (start 10.48 1.7) (end 10.8 -0.3) (layer Dwgs.User) (width 0.01))
  (fp_line (start 10.37 1.7) (end 10.6 0) (layer Dwgs.User) (width 0.01))
  (fp_line (start 10.18 1.7) (end 10.35 -1.9) (layer Dwgs.User) (width 0.01))
  (fp_line (start 10.08 1.7) (end 10.1 -1.9) (layer Dwgs.User) (width 0.01))
  (fp_line (start 9.88 1.7) (end 9.85 -1.9) (layer Dwgs.User) (width 0.01))
  (fp_line (start 9.78 1.7) (end 9.6 -1.9) (layer Dwgs.User) (width 0.01))
  (fp_line (start 9.28 1.69) (end 9.2 -1.9) (layer Dwgs.User) (width 0.01))
  (fp_line (start 9.18 1.69) (end 8.95 -1.9) (layer Dwgs.User) (width 0.01))
  (fp_line (start 0.07 1.69) (end 0.6 -1.6) (layer Dwgs.User) (width 0.01))
  (fp_line (start -0.2 -19.252) (end 19.854 -19.252) (layer Dwgs.User) (width 0.01))
  (fp_line (start 19.854 1.77) (end 19.854 -19.252) (layer Dwgs.User) (width 0.01))
  (fp_line (start -0.2 1.77) (end -0.2 -19.252) (layer Dwgs.User) (width 0.01))
  (fp_line (start -0.2 1.77) (end 19.854 1.77) (layer Dwgs.User) (width 0.01))
  (fp_line (start -0.02286 1.69) (end 0.4 -1.6) (layer Dwgs.User) (width 0.01))
  (fp_line (start 0.17 1.69) (end 0.8 -1.6) (layer Dwgs.User) (width 0.01))
  (fp_line (start 0.28 1.69) (end 1 -1.8) (layer Dwgs.User) (width 0.01))
  (fp_line (start 0.38 1.69) (end 1.2 -1.8) (layer Dwgs.User) (width 0.01))
  (fp_line (start 0.48 1.69) (end 1.4 -1.8) (layer Dwgs.User) (width 0.01))
  (fp_line (start 0.67 1.69) (end 1.35 -1.2) (layer Dwgs.User) (width 0.01))
  (fp_line (start 0.77 1.69) (end 1.4 -1.2) (layer Dwgs.User) (width 0.01))
  (fp_line (start 0.87 1.69) (end 1.45 -1.2) (layer Dwgs.User) (width 0.01))
  (fp_line (start 0.97 1.69) (end 1.5 -1.2) (layer Dwgs.User) (width 0.01))
  (fp_line (start 1.07 1.69) (end 1.55 -1.2) (layer Dwgs.User) (width 0.01))
  (fp_line (start 1.17 1.69) (end 1.6 -1.2) (layer Dwgs.User) (width 0.01))
  (fp_line (start 1.28 1.69) (end 1.8 -1.8) (layer Dwgs.User) (width 0.01))
  (fp_line (start 1.38 1.69) (end 1.9 -1.6) (layer Dwgs.User) (width 0.01))
  (fp_line (start 1.48 1.69) (end 2 -1.8) (layer Dwgs.User) (width 0.01))
  (fp_line (start 1.57 1.69) (end 2.1 -1.6) (layer Dwgs.User) (width 0.01))
  (fp_line (start 1.67 1.69) (end 2.2 -1.8) (layer Dwgs.User) (width 0.01))
  (fp_line (start 1.77 1.69) (end 2.4 -1.8) (layer Dwgs.User) (width 0.01))
  (fp_line (start 1.87 1.69) (end 2.4 -1.6) (layer Dwgs.User) (width 0.01))
  (fp_line (start 2.07 1.69) (end 2.5 -1.6) (layer Dwgs.User) (width 0.01))
  (fp_line (start 1.97 1.69) (end 2.5 -1.8) (layer Dwgs.User) (width 0.01))
  (fp_line (start 2.17 1.69) (end 2.6 -1.8) (layer Dwgs.User) (width 0.01))
  (fp_line (start 2.27 1.69) (end 2.6 -1.6) (layer Dwgs.User) (width 0.01))
  (fp_line (start 2.37 1.69) (end 2.7 -1.8) (layer Dwgs.User) (width 0.01))
  (fp_line (start 2.47 1.69) (end 2.7 -1.6) (layer Dwgs.User) (width 0.01))
  (fp_line (start 2.57 1.69) (end 2.8 -1.8) (layer Dwgs.User) (width 0.01))
  (fp_line (start 2.68 1.7) (end 2.8 -1.6) (layer Dwgs.User) (width 0.01))
  (fp_line (start 2.78 1.7) (end 3 -1.8) (layer Dwgs.User) (width 0.01))
  (fp_line (start 2.87 1.7) (end 3.1 -1.6) (layer Dwgs.User) (width 0.01))
  (fp_line (start 2.97 1.7) (end 3.2 -1.8) (layer Dwgs.User) (width 0.01))
  (fp_line (start 3.08 1.7) (end 3.3 -1.6) (layer Dwgs.User) (width 0.01))
  (fp_line (start 3.17 1.69) (end 3.4 -1.8) (layer Dwgs.User) (width 0.01))
  (fp_line (start 3.28 1.69) (end 3.4 -1.2) (layer Dwgs.User) (width 0.01))
  (fp_line (start 3.37 1.69) (end 3.5 -1.2) (layer Dwgs.User) (width 0.01))
  (fp_line (start 3.48 1.69) (end 3.6 -1.2) (layer Dwgs.User) (width 0.01))
  (fp_line (start 3.57 1.69) (end 3.7 -1.2) (layer Dwgs.User) (width 0.01))
  (fp_line (start 3.68 1.69) (end 3.75 -1.2) (layer Dwgs.User) (width 0.01))
  (fp_line (start 3.78 1.69) (end 3.85 -1.2) (layer Dwgs.User) (width 0.01))
  (fp_line (start 3.88 1.69) (end 3.95 -1.2) (layer Dwgs.User) (width 0.01))
  (fp_line (start 3.98 1.69) (end 4 -1.2) (layer Dwgs.User) (width 0.01))
  (fp_line (start 4.18 1.69) (end 4.05 -1.2) (layer Dwgs.User) (width 0.01))
  (fp_line (start 4.38 1.69) (end 4.1 -1.6) (layer Dwgs.User) (width 0.01))
  (fp_line (start 4.48 1.69) (end 4.3 -1.6) (layer Dwgs.User) (width 0.01))
  (fp_line (start 4.58 1.69) (end 4.4 -1.2) (layer Dwgs.User) (width 0.01))
  (fp_line (start 4.68 1.69) (end 4.45 -1.2) (layer Dwgs.User) (width 0.01))
  (fp_line (start 4.78 1.69) (end 4.51 -1.2) (layer Dwgs.User) (width 0.01))
  (fp_line (start 4.88 1.69) (end 4.56 -1.2) (layer Dwgs.User) (width 0.01))
  (fp_line (start 4.98 1.69) (end 4.5 -1.8) (layer Dwgs.User) (width 0.01))
  (fp_line (start 5.07 1.69) (end 4.7 -1.8) (layer Dwgs.User) (width 0.01))
  (fp_line (start 5.18 1.69) (end 4.9 -1.8) (layer Dwgs.User) (width 0.01))
  (fp_line (start 5.28 1.69) (end 5.1 -1.8) (layer Dwgs.User) (width 0.01))
  (fp_line (start 5.38 1.69) (end 5.3 -1.8) (layer Dwgs.User) (width 0.01))
  (fp_line (start 5.47 1.69) (end 5.5 -1.8) (layer Dwgs.User) (width 0.01))
  (fp_line (start 5.58 1.69) (end 5.7 -1.8) (layer Dwgs.User) (width 0.01))
  (fp_line (start 5.68 1.69) (end 5.9 -1.8) (layer Dwgs.User) (width 0.01))
  (fp_line (start 5.78 1.69) (end 6.1 -1.8) (layer Dwgs.User) (width 0.01))
  (fp_line (start 5.98 1.69) (end 6.15 -1.2) (layer Dwgs.User) (width 0.01))
  (fp_line (start 6.07 1.69) (end 6.2 -1.2) (layer Dwgs.User) (width 0.01))
  (fp_line (start 6.18 1.69) (end 6.25 -1.2) (layer Dwgs.User) (width 0.01))
  (fp_line (start 6.27 1.69) (end 6.35 -1.2) (layer Dwgs.User) (width 0.01))
  (fp_line (start 6.37 1.69) (end 6.4 -1.2) (layer Dwgs.User) (width 0.01))
  (fp_line (start 6.48 1.69) (end 6.5 -1.8) (layer Dwgs.User) (width 0.01))
  (fp_line (start 6.57 1.7) (end 6.6 -1.6) (layer Dwgs.User) (width 0.01))
  (fp_line (start 6.67 1.7) (end 6.7 -1.8) (layer Dwgs.User) (width 0.01))
  (fp_line (start 6.77 1.7) (end 6.8 -1.6) (layer Dwgs.User) (width 0.01))
  (fp_line (start 6.87 1.7) (end 6.9 -1.8) (layer Dwgs.User) (width 0.01))
  (fp_line (start 6.97 1.7) (end 7.1 -1.6) (layer Dwgs.User) (width 0.01))
  (fp_line (start 7.07 1.7) (end 7.15 -1.8) (layer Dwgs.User) (width 0.01))
  (fp_line (start 7.17 1.7) (end 7.2 -1.6) (layer Dwgs.User) (width 0.01))
  (fp_line (start 7.28 1.7) (end 7.25 -1.8) (layer Dwgs.User) (width 0.01))
  (fp_line (start 7.37 1.7) (end 7.3 -1.6) (layer Dwgs.User) (width 0.01))
  (fp_line (start 7.48 1.7) (end 7.35 -1.8) (layer Dwgs.User) (width 0.01))
  (fp_line (start 7.57 1.7) (end 7.4 -1.6) (layer Dwgs.User) (width 0.01))
  (fp_line (start 7.67 1.7) (end 7.45 -1.8) (layer Dwgs.User) (width 0.01))
  (fp_line (start 7.78 1.7) (end 7.5 -1.6) (layer Dwgs.User) (width 0.01))
  (fp_line (start 7.88 1.7) (end 7.5 -1.8) (layer Dwgs.User) (width 0.01))
  (fp_line (start 7.97 1.7) (end 7.7 -1.8) (layer Dwgs.User) (width 0.01))
  (fp_line (start 8.07 1.7) (end 7.8 -1.6) (layer Dwgs.User) (width 0.01))
  (fp_line (start 8.18 1.7) (end 7.85 -1.8) (layer Dwgs.User) (width 0.01))
  (fp_line (start 8.28 1.7) (end 7.95 -1.6) (layer Dwgs.User) (width 0.01))
  (fp_line (start 8.37 1.7) (end 8 -1.8) (layer Dwgs.User) (width 0.01))
  (fp_line (start 8.48 1.7) (end 8.15 -1.2) (layer Dwgs.User) (width 0.01))
  (fp_line (start 8.58 1.7) (end 8.2 -1.2) (layer Dwgs.User) (width 0.01))
  (fp_line (start 8.88 1.69) (end 8.4 -1.2) (layer Dwgs.User) (width 0.01))
  (fp_line (start 8.77 1.69) (end 8.3 -1.2) (layer Dwgs.User) (width 0.01))
  (fp_line (start 8.68 1.7) (end 8.25 -1.2) (layer Dwgs.User) (width 0.01))
  (fp_line (start 8.98 1.69) (end 8.5 -1.2) (layer Dwgs.User) (width 0.01))
  (fp_line (start -0.21 0.22) (end 19.87 0.22) (layer Dwgs.User) (width 0.02))
  (fp_text user DET_GRD0 (at -0.03 2.17 90) (layer Dwgs.User)
    (effects (font (size 0.07 0.07) (thickness 0.01)))
  )
  (fp_text user NTC (at 0.07 2.01 90) (layer Dwgs.User)
    (effects (font (size 0.07 0.07) (thickness 0.01)))
  )
  (fp_text user VREF_ADC (at 0.17 2.16 90) (layer Dwgs.User)
    (effects (font (size 0.07 0.07) (thickness 0.01)))
  )
  (fp_text user GNDA_REF (at 0.27 2.17 90) (layer Dwgs.User)
    (effects (font (size 0.07 0.07) (thickness 0.01)))
  )
  (fp_text user VMUX_OUT (at 0.37 2.18 90) (layer Dwgs.User)
    (effects (font (size 0.07 0.07) (thickness 0.01)))
  )
  (fp_text user IMUX_OUT (at 0.47 2.16 90) (layer Dwgs.User)
    (effects (font (size 0.07 0.07) (thickness 0.01)))
  )
  (fp_text user NC0 (at 0.57 2.01 90) (layer Dwgs.User)
    (effects (font (size 0.07 0.07) (thickness 0.01)))
  )
  (fp_text user VSUB (at 0.67 2.04 90) (layer Dwgs.User)
    (effects (font (size 0.07 0.07) (thickness 0.01)))
  )
  (fp_text user GNDA (at 0.77 2.05 90) (layer Dwgs.User)
    (effects (font (size 0.07 0.07) (thickness 0.01)))
  )
  (fp_text user GNDA (at 0.87 2.05 90) (layer Dwgs.User)
    (effects (font (size 0.07 0.07) (thickness 0.01)))
  )
  (fp_text user GNDA (at 0.97 2.04 90) (layer Dwgs.User)
    (effects (font (size 0.07 0.07) (thickness 0.01)))
  )
  (fp_text user GNDA (at 1.07 2.04 90) (layer Dwgs.User)
    (effects (font (size 0.07 0.07) (thickness 0.01)))
  )
  (fp_text user GNDA (at 1.17 2.04 90) (layer Dwgs.User)
    (effects (font (size 0.07 0.07) (thickness 0.01)))
  )
  (fp_text user VDDA (at 1.27 2.04 90) (layer Dwgs.User)
    (effects (font (size 0.07 0.07) (thickness 0.01)))
  )
  (fp_text user VDDA (at 1.37 2.04 90) (layer Dwgs.User)
    (effects (font (size 0.07 0.07) (thickness 0.01)))
  )
  (fp_text user VDDA (at 1.47 2.04 90) (layer Dwgs.User)
    (effects (font (size 0.07 0.07) (thickness 0.01)))
  )
  (fp_text user VDDA (at 1.57 2.04 90) (layer Dwgs.User)
    (effects (font (size 0.07 0.07) (thickness 0.01)))
  )
  (fp_text user VDDA (at 1.67 2.04 90) (layer Dwgs.User)
    (effects (font (size 0.07 0.07) (thickness 0.01)))
  )
  (fp_text user VINA (at 1.77 2.03 90) (layer Dwgs.User)
    (effects (font (size 0.07 0.07) (thickness 0.01)))
  )
  (fp_text user VINA (at 1.87 2.03 90) (layer Dwgs.User)
    (effects (font (size 0.07 0.07) (thickness 0.01)))
  )
  (fp_text user VINA (at 1.97 2.03 90) (layer Dwgs.User)
    (effects (font (size 0.07 0.07) (thickness 0.01)))
  )
  (fp_text user VINA (at 2.07 2.03 90) (layer Dwgs.User)
    (effects (font (size 0.07 0.07) (thickness 0.01)))
  )
  (fp_text user VINA (at 2.17 2.03 90) (layer Dwgs.User)
    (effects (font (size 0.07 0.07) (thickness 0.01)))
  )
  (fp_text user VIND (at 2.27 2.03 90) (layer Dwgs.User)
    (effects (font (size 0.07 0.07) (thickness 0.01)))
  )
  (fp_text user VIND (at 2.37 2.03 90) (layer Dwgs.User)
    (effects (font (size 0.07 0.07) (thickness 0.01)))
  )
  (fp_text user VIND (at 2.47 2.03 90) (layer Dwgs.User)
    (effects (font (size 0.07 0.07) (thickness 0.01)))
  )
  (fp_text user VIND (at 2.57 2.03 90) (layer Dwgs.User)
    (effects (font (size 0.07 0.07) (thickness 0.01)))
  )
  (fp_text user VIND (at 2.67 2.03 90) (layer Dwgs.User)
    (effects (font (size 0.07 0.07) (thickness 0.01)))
  )
  (fp_text user VDDD (at 2.77 2.04 90) (layer Dwgs.User)
    (effects (font (size 0.07 0.07) (thickness 0.01)))
  )
  (fp_text user VDDD (at 2.87 2.04 90) (layer Dwgs.User)
    (effects (font (size 0.07 0.07) (thickness 0.01)))
  )
  (fp_text user VDDD (at 2.97 2.04 90) (layer Dwgs.User)
    (effects (font (size 0.07 0.07) (thickness 0.01)))
  )
  (fp_text user VDDD (at 3.07 2.04 90) (layer Dwgs.User)
    (effects (font (size 0.07 0.07) (thickness 0.01)))
  )
  (fp_text user VDDD (at 3.17 2.04 90) (layer Dwgs.User)
    (effects (font (size 0.07 0.07) (thickness 0.01)))
  )
  (fp_text user GNDD (at 3.27 2.04 90) (layer Dwgs.User)
    (effects (font (size 0.07 0.07) (thickness 0.01)))
  )
  (fp_text user GNDD (at 3.37 2.04 90) (layer Dwgs.User)
    (effects (font (size 0.07 0.07) (thickness 0.01)))
  )
  (fp_text user GNDD (at 3.47 2.04 90) (layer Dwgs.User)
    (effects (font (size 0.07 0.07) (thickness 0.01)))
  )
  (fp_text user GNDD (at 3.57 2.04 90) (layer Dwgs.User)
    (effects (font (size 0.07 0.07) (thickness 0.01)))
  )
  (fp_text user GNDD (at 3.67 2.04 90) (layer Dwgs.User)
    (effects (font (size 0.07 0.07) (thickness 0.01)))
  )
  (fp_text user BYPASS_MODE (at 3.77 2.27 90) (layer Dwgs.User)
    (effects (font (size 0.07 0.07) (thickness 0.01)))
  )
  (fp_text user TEST_MODE (at 3.87 2.19 90) (layer Dwgs.User)
    (effects (font (size 0.07 0.07) (thickness 0.01)))
  )
  (fp_text user SCAN_EN (at 3.97 2.13 90) (layer Dwgs.User)
    (effects (font (size 0.07 0.07) (thickness 0.01)))
  )
  (fp_text user GPO_CMOS (at 4.07 2.18 90) (layer Dwgs.User)
    (effects (font (size 0.07 0.07) (thickness 0.01)))
  )
  (fp_text user CHIP_ID0 (at 4.17 2.14 90) (layer Dwgs.User)
    (effects (font (size 0.07 0.07) (thickness 0.01)))
  )
  (fp_text user CHIP_ID1 (at 4.27 2.13 90) (layer Dwgs.User)
    (effects (font (size 0.07 0.07) (thickness 0.01)))
  )
  (fp_text user CHIP_ID2 (at 4.37 2.13 90) (layer Dwgs.User)
    (effects (font (size 0.07 0.07) (thickness 0.01)))
  )
  (fp_text user CHIP_ID3 (at 4.47 2.13 90) (layer Dwgs.User)
    (effects (font (size 0.07 0.07) (thickness 0.01)))
  )
  (fp_text user IREF_TRIM0 (at 4.57 2.18 90) (layer Dwgs.User)
    (effects (font (size 0.07 0.07) (thickness 0.01)))
  )
  (fp_text user IREF_TRIM1 (at 4.67 2.18 90) (layer Dwgs.User)
    (effects (font (size 0.07 0.07) (thickness 0.01)))
  )
  (fp_text user IREF_TRIM2 (at 4.77 2.18 90) (layer Dwgs.User)
    (effects (font (size 0.07 0.07) (thickness 0.01)))
  )
  (fp_text user IREF_TRIM3 (at 4.87 2.18 90) (layer Dwgs.User)
    (effects (font (size 0.07 0.07) (thickness 0.01)))
  )
  (fp_text user VDD_PRE (at 4.97 2.12 90) (layer Dwgs.User)
    (effects (font (size 0.07 0.07) (thickness 0.01)))
  )
  (fp_text user GNDA_REF (at 5.07 2.15 90) (layer Dwgs.User)
    (effects (font (size 0.07 0.07) (thickness 0.01)))
  )
  (fp_text user R_IREF (at 5.17 2.07 90) (layer Dwgs.User)
    (effects (font (size 0.07 0.07) (thickness 0.01)))
  )
  (fp_text user VREFA (at 5.27 2.05 90) (layer Dwgs.User)
    (effects (font (size 0.07 0.07) (thickness 0.01)))
  )
  (fp_text user REXTA (at 5.37 2.05 90) (layer Dwgs.User)
    (effects (font (size 0.07 0.07) (thickness 0.01)))
  )
  (fp_text user VOFS_OUT (at 5.47 2.15 90) (layer Dwgs.User)
    (effects (font (size 0.07 0.07) (thickness 0.01)))
  )
  (fp_text user VOFS_LP (at 5.57 2.1 90) (layer Dwgs.User)
    (effects (font (size 0.07 0.07) (thickness 0.01)))
  )
  (fp_text user VOFS_IN (at 5.67 2.09 90) (layer Dwgs.User)
    (effects (font (size 0.07 0.07) (thickness 0.01)))
  )
  (fp_text user LP_EN_AC (at 5.77 2.13 90) (layer Dwgs.User)
    (effects (font (size 0.07 0.07) (thickness 0.01)))
  )
  (fp_text user NC1 (at 5.87 2 90) (layer Dwgs.User)
    (effects (font (size 0.07 0.07) (thickness 0.01)))
  )
  (fp_text user GNDA (at 5.97 2.03 90) (layer Dwgs.User)
    (effects (font (size 0.07 0.07) (thickness 0.01)))
  )
  (fp_text user GNDA (at 6.07 2.03 90) (layer Dwgs.User)
    (effects (font (size 0.07 0.07) (thickness 0.01)))
  )
  (fp_text user GNDA (at 6.17 2.03 90) (layer Dwgs.User)
    (effects (font (size 0.07 0.07) (thickness 0.01)))
  )
  (fp_text user GNDA (at 6.27 2.03 90) (layer Dwgs.User)
    (effects (font (size 0.07 0.07) (thickness 0.01)))
  )
  (fp_text user GNDA (at 6.37 2.03 90) (layer Dwgs.User)
    (effects (font (size 0.07 0.07) (thickness 0.01)))
  )
  (fp_text user VDDA (at 6.47 2.02 90) (layer Dwgs.User)
    (effects (font (size 0.07 0.07) (thickness 0.01)))
  )
  (fp_text user VDDA (at 6.57 2.02 90) (layer Dwgs.User)
    (effects (font (size 0.07 0.07) (thickness 0.01)))
  )
  (fp_text user VDDA (at 6.67 2.02 90) (layer Dwgs.User)
    (effects (font (size 0.07 0.07) (thickness 0.01)))
  )
  (fp_text user VDDA (at 6.77 2.02 90) (layer Dwgs.User)
    (effects (font (size 0.07 0.07) (thickness 0.01)))
  )
  (fp_text user VDDA (at 6.87 2.02 90) (layer Dwgs.User)
    (effects (font (size 0.07 0.07) (thickness 0.01)))
  )
  (fp_text user VINA (at 6.97 2.01 90) (layer Dwgs.User)
    (effects (font (size 0.07 0.07) (thickness 0.01)))
  )
  (fp_text user VINA (at 7.07 2.01 90) (layer Dwgs.User)
    (effects (font (size 0.07 0.07) (thickness 0.01)))
  )
  (fp_text user VINA (at 7.17 2.01 90) (layer Dwgs.User)
    (effects (font (size 0.07 0.07) (thickness 0.01)))
  )
  (fp_text user VINA (at 7.27 2.01 90) (layer Dwgs.User)
    (effects (font (size 0.07 0.07) (thickness 0.01)))
  )
  (fp_text user VINA (at 7.37 2.01 90) (layer Dwgs.User)
    (effects (font (size 0.07 0.07) (thickness 0.01)))
  )
  (fp_text user VIND (at 7.47 2.01 90) (layer Dwgs.User)
    (effects (font (size 0.07 0.07) (thickness 0.01)))
  )
  (fp_text user VIND (at 7.57 2.01 90) (layer Dwgs.User)
    (effects (font (size 0.07 0.07) (thickness 0.01)))
  )
  (fp_text user VIND (at 7.67 2.01 90) (layer Dwgs.User)
    (effects (font (size 0.07 0.07) (thickness 0.01)))
  )
  (fp_text user VIND (at 7.77 2.01 90) (layer Dwgs.User)
    (effects (font (size 0.07 0.07) (thickness 0.01)))
  )
  (fp_text user VIND (at 7.87 2.01 90) (layer Dwgs.User)
    (effects (font (size 0.07 0.07) (thickness 0.01)))
  )
  (fp_text user VDDD (at 7.97 2.02 90) (layer Dwgs.User)
    (effects (font (size 0.07 0.07) (thickness 0.01)))
  )
  (fp_text user VDDD (at 8.07 2.02 90) (layer Dwgs.User)
    (effects (font (size 0.07 0.07) (thickness 0.01)))
  )
  (fp_text user VDDD (at 8.17 2.02 90) (layer Dwgs.User)
    (effects (font (size 0.07 0.07) (thickness 0.01)))
  )
  (fp_text user VDDD (at 8.27 2.02 90) (layer Dwgs.User)
    (effects (font (size 0.07 0.07) (thickness 0.01)))
  )
  (fp_text user VDDD (at 8.37 2.02 90) (layer Dwgs.User)
    (effects (font (size 0.07 0.07) (thickness 0.01)))
  )
  (fp_text user GNDD (at 8.47 2.03 90) (layer Dwgs.User)
    (effects (font (size 0.07 0.07) (thickness 0.01)))
  )
  (fp_text user GNDD (at 8.57 2.03 90) (layer Dwgs.User)
    (effects (font (size 0.07 0.07) (thickness 0.01)))
  )
  (fp_text user GNDD (at 8.67 2.03 90) (layer Dwgs.User)
    (effects (font (size 0.07 0.07) (thickness 0.01)))
  )
  (fp_text user GNDD (at 8.77 2.025 90) (layer Dwgs.User)
    (effects (font (size 0.07 0.07) (thickness 0.01)))
  )
  (fp_text user GNDD (at 8.87 2.025 90) (layer Dwgs.User)
    (effects (font (size 0.07 0.07) (thickness 0.01)))
  )
  (fp_text user VSUB (at 8.97 2.02 90) (layer Dwgs.User)
    (effects (font (size 0.07 0.07) (thickness 0.01)))
  )
  (fp_text user PLL_VCTRL_RST (at 9.07 2.29 90) (layer Dwgs.User)
    (effects (font (size 0.07 0.07) (thickness 0.01)))
  )
  (fp_text user CMD_P (at 9.17 2.06 90) (layer Dwgs.User)
    (effects (font (size 0.07 0.07) (thickness 0.01)))
  )
  (fp_text user CMD_N (at 9.27 2.06 90) (layer Dwgs.User)
    (effects (font (size 0.07 0.07) (thickness 0.01)))
  )
  (fp_text user VDD_PLL (at 9.37 2.11 90) (layer Dwgs.User)
    (effects (font (size 0.07 0.07) (thickness 0.01)))
  )
  (fp_text user GND_PLL (at 9.47 2.12 90) (layer Dwgs.User)
    (effects (font (size 0.07 0.07) (thickness 0.01)))
  )
  (fp_text user VDD_CML (at 9.58 2.12 90) (layer Dwgs.User)
    (effects (font (size 0.07 0.07) (thickness 0.01)))
  )
  (fp_text user GND_CML (at 9.68 2.13 90) (layer Dwgs.User)
    (effects (font (size 0.07 0.07) (thickness 0.01)))
  )
  (fp_text user GTX0_N (at 9.77 2.08 90) (layer Dwgs.User)
    (effects (font (size 0.07 0.07) (thickness 0.01)))
  )
  (fp_text user GTX0_P (at 9.87 2.08 90) (layer Dwgs.User)
    (effects (font (size 0.07 0.07) (thickness 0.01)))
  )
  (fp_text user GND_CML (at 10.87 2.15 90) (layer Dwgs.User)
    (effects (font (size 0.07 0.07) (thickness 0.01)))
  )
  (fp_text user VDD_CML (at 10.97 2.14 90) (layer Dwgs.User)
    (effects (font (size 0.07 0.07) (thickness 0.01)))
  )
  (fp_text user VREF_OVP (at 14.18 2.14 90) (layer Dwgs.User)
    (effects (font (size 0.07 0.07) (thickness 0.01)))
  )
  (fp_text user VREFD (at 14.28 2.05 90) (layer Dwgs.User)
    (effects (font (size 0.07 0.07) (thickness 0.01)))
  )
  (fp_text user GNDD_REF (at 14.38 2.16 90) (layer Dwgs.User)
    (effects (font (size 0.07 0.07) (thickness 0.01)))
  )
  (fp_text user REXTD (at 14.48 2.05 90) (layer Dwgs.User)
    (effects (font (size 0.07 0.07) (thickness 0.01)))
  )
  (fp_text user VDD_SHUNT (at 14.58 2.19 90) (layer Dwgs.User)
    (effects (font (size 0.07 0.07) (thickness 0.01)))
  )
  (fp_text user EXT_POR_CAP (at 14.68 2.24 90) (layer Dwgs.User)
    (effects (font (size 0.07 0.07) (thickness 0.01)))
  )
  (fp_text user DATA_IN0_P (at 14.78 2.18 90) (layer Dwgs.User)
    (effects (font (size 0.07 0.07) (thickness 0.01)))
  )
  (fp_text user DATA_IN0_N (at 14.88 2.18 90) (layer Dwgs.User)
    (effects (font (size 0.07 0.07) (thickness 0.01)))
  )
  (fp_text user GPO_LVDS0_P (at 15.58 2.24 90) (layer Dwgs.User)
    (effects (font (size 0.07 0.07) (thickness 0.01)))
  )
  (fp_text user VSUB (at 19.47 2.02 90) (layer Dwgs.User)
    (effects (font (size 0.07 0.07) (thickness 0.01)))
  )
  (fp_text user VDD_EFUSE (at 19.57 2.18 90) (layer Dwgs.User)
    (effects (font (size 0.07 0.07) (thickness 0.01)))
  )
  (fp_text user DET_GRD1 (at 19.67 2.15 90) (layer Dwgs.User)
    (effects (font (size 0.07 0.07) (thickness 0.01)))
  )
  (fp_text user 1 (at -0.02 1.84) (layer Dwgs.User)
    (effects (font (size 0.07 0.07) (thickness 0.01)))
  )
  (fp_text user 10 (at 0.88 1.84) (layer Dwgs.User)
    (effects (font (size 0.07 0.07) (thickness 0.01)))
  )
  (fp_text user 20 (at 1.88 1.84) (layer Dwgs.User)
    (effects (font (size 0.07 0.07) (thickness 0.01)))
  )
  (fp_text user 30 (at 2.88 1.84) (layer Dwgs.User)
    (effects (font (size 0.07 0.07) (thickness 0.01)))
  )
  (fp_text user 40 (at 3.87 1.84) (layer Dwgs.User)
    (effects (font (size 0.07 0.07) (thickness 0.01)))
  )
  (fp_text user 50 (at 4.87 1.84) (layer Dwgs.User)
    (effects (font (size 0.07 0.07) (thickness 0.01)))
  )
  (fp_text user 60 (at 5.88 1.84) (layer Dwgs.User)
    (effects (font (size 0.07 0.07) (thickness 0.01)))
  )
  (fp_text user 70 (at 6.88 1.84) (layer Dwgs.User)
    (effects (font (size 0.07 0.07) (thickness 0.01)))
  )
  (fp_text user 80 (at 7.88 1.84) (layer Dwgs.User)
    (effects (font (size 0.07 0.07) (thickness 0.01)))
  )
  (fp_text user 90 (at 8.88 1.84) (layer Dwgs.User)
    (effects (font (size 0.07 0.07) (thickness 0.01)))
  )
  (fp_text user 100 (at 9.88 1.84) (layer Dwgs.User)
    (effects (font (size 0.07 0.07) (thickness 0.01)))
  )
  (fp_text user 110 (at 10.88 1.84) (layer Dwgs.User)
    (effects (font (size 0.07 0.07) (thickness 0.01)))
  )
  (fp_text user 120 (at 11.88 1.84) (layer Dwgs.User)
    (effects (font (size 0.07 0.07) (thickness 0.01)))
  )
  (fp_text user 130 (at 12.88 1.84) (layer Dwgs.User)
    (effects (font (size 0.07 0.07) (thickness 0.01)))
  )
  (fp_text user 140 (at 13.88 1.84) (layer Dwgs.User)
    (effects (font (size 0.07 0.07) (thickness 0.01)))
  )
  (fp_text user 150 (at 14.87 1.84) (layer Dwgs.User)
    (effects (font (size 0.07 0.07) (thickness 0.01)))
  )
  (fp_text user 160 (at 15.88 1.84) (layer Dwgs.User)
    (effects (font (size 0.07 0.07) (thickness 0.01)))
  )
  (fp_text user 170 (at 16.88 1.84) (layer Dwgs.User)
    (effects (font (size 0.07 0.07) (thickness 0.01)))
  )
  (fp_text user 180 (at 17.87 1.84) (layer Dwgs.User)
    (effects (font (size 0.07 0.07) (thickness 0.01)))
  )
  (fp_text user 190 (at 18.88 1.84) (layer Dwgs.User)
    (effects (font (size 0.07 0.07) (thickness 0.01)))
  )
  (fp_text user NC2 (at 11.08 2 90) (layer Dwgs.User)
    (effects (font (size 0.07 0.07) (thickness 0.01)))
  )
  (fp_text user GNDA (at 11.18 2.03 90) (layer Dwgs.User)
    (effects (font (size 0.07 0.07) (thickness 0.01)))
  )
  (fp_text user GNDA (at 11.28 2.03 90) (layer Dwgs.User)
    (effects (font (size 0.07 0.07) (thickness 0.01)))
  )
  (fp_text user GNDA (at 11.38 2.03 90) (layer Dwgs.User)
    (effects (font (size 0.07 0.07) (thickness 0.01)))
  )
  (fp_text user GNDA (at 11.48 2.03 90) (layer Dwgs.User)
    (effects (font (size 0.07 0.07) (thickness 0.01)))
  )
  (fp_text user GNDA (at 11.58 2.03 90) (layer Dwgs.User)
    (effects (font (size 0.07 0.07) (thickness 0.01)))
  )
  (fp_text user VDDA (at 11.68 2.02 90) (layer Dwgs.User)
    (effects (font (size 0.07 0.07) (thickness 0.01)))
  )
  (fp_text user VDDA (at 11.78 2.02 90) (layer Dwgs.User)
    (effects (font (size 0.07 0.07) (thickness 0.01)))
  )
  (fp_text user VDDA (at 11.88 2.02 90) (layer Dwgs.User)
    (effects (font (size 0.07 0.07) (thickness 0.01)))
  )
  (fp_text user VDDA (at 11.98 2.02 90) (layer Dwgs.User)
    (effects (font (size 0.07 0.07) (thickness 0.01)))
  )
  (fp_text user VDDA (at 12.08 2.02 90) (layer Dwgs.User)
    (effects (font (size 0.07 0.07) (thickness 0.01)))
  )
  (fp_text user VINA (at 12.18 2.01 90) (layer Dwgs.User)
    (effects (font (size 0.07 0.07) (thickness 0.01)))
  )
  (fp_text user VINA (at 12.28 2.01 90) (layer Dwgs.User)
    (effects (font (size 0.07 0.07) (thickness 0.01)))
  )
  (fp_text user VINA (at 12.38 2.01 90) (layer Dwgs.User)
    (effects (font (size 0.07 0.07) (thickness 0.01)))
  )
  (fp_text user VINA (at 12.48 2.01 90) (layer Dwgs.User)
    (effects (font (size 0.07 0.07) (thickness 0.01)))
  )
  (fp_text user VINA (at 12.58 2.01 90) (layer Dwgs.User)
    (effects (font (size 0.07 0.07) (thickness 0.01)))
  )
  (fp_text user VIND (at 12.68 2.01 90) (layer Dwgs.User)
    (effects (font (size 0.07 0.07) (thickness 0.01)))
  )
  (fp_text user VIND (at 12.78 2.01 90) (layer Dwgs.User)
    (effects (font (size 0.07 0.07) (thickness 0.01)))
  )
  (fp_text user VIND (at 12.88 2.01 90) (layer Dwgs.User)
    (effects (font (size 0.07 0.07) (thickness 0.01)))
  )
  (fp_text user VIND (at 12.98 2.01 90) (layer Dwgs.User)
    (effects (font (size 0.07 0.07) (thickness 0.01)))
  )
  (fp_text user VIND (at 13.08 2.01 90) (layer Dwgs.User)
    (effects (font (size 0.07 0.07) (thickness 0.01)))
  )
  (fp_text user VDDD (at 13.18 2.02 90) (layer Dwgs.User)
    (effects (font (size 0.07 0.07) (thickness 0.01)))
  )
  (fp_text user VDDD (at 13.28 2.02 90) (layer Dwgs.User)
    (effects (font (size 0.07 0.07) (thickness 0.01)))
  )
  (fp_text user VDDD (at 13.38 2.02 90) (layer Dwgs.User)
    (effects (font (size 0.07 0.07) (thickness 0.01)))
  )
  (fp_text user VDDD (at 13.48 2.02 90) (layer Dwgs.User)
    (effects (font (size 0.07 0.07) (thickness 0.01)))
  )
  (fp_text user VDDD (at 13.58 2.02 90) (layer Dwgs.User)
    (effects (font (size 0.07 0.07) (thickness 0.01)))
  )
  (fp_text user GNDD (at 13.68 2.03 90) (layer Dwgs.User)
    (effects (font (size 0.07 0.07) (thickness 0.01)))
  )
  (fp_text user GNDD (at 13.78 2.03 90) (layer Dwgs.User)
    (effects (font (size 0.07 0.07) (thickness 0.01)))
  )
  (fp_text user GNDD (at 13.88 2.03 90) (layer Dwgs.User)
    (effects (font (size 0.07 0.07) (thickness 0.01)))
  )
  (fp_text user GNDD (at 13.98 2.025 90) (layer Dwgs.User)
    (effects (font (size 0.07 0.07) (thickness 0.01)))
  )
  (fp_text user GNDD (at 14.08 2.025 90) (layer Dwgs.User)
    (effects (font (size 0.07 0.07) (thickness 0.01)))
  )
  (fp_text user NC3 (at 16.38 2 90) (layer Dwgs.User)
    (effects (font (size 0.07 0.07) (thickness 0.01)))
  )
  (fp_text user GNDA (at 16.48 2.03 90) (layer Dwgs.User)
    (effects (font (size 0.07 0.07) (thickness 0.01)))
  )
  (fp_text user GNDA (at 16.58 2.03 90) (layer Dwgs.User)
    (effects (font (size 0.07 0.07) (thickness 0.01)))
  )
  (fp_text user GNDA (at 16.68 2.03 90) (layer Dwgs.User)
    (effects (font (size 0.07 0.07) (thickness 0.01)))
  )
  (fp_text user GNDA (at 16.78 2.03 90) (layer Dwgs.User)
    (effects (font (size 0.07 0.07) (thickness 0.01)))
  )
  (fp_text user GNDA (at 16.88 2.03 90) (layer Dwgs.User)
    (effects (font (size 0.07 0.07) (thickness 0.01)))
  )
  (fp_text user VDDA (at 16.98 2.02 90) (layer Dwgs.User)
    (effects (font (size 0.07 0.07) (thickness 0.01)))
  )
  (fp_text user VDDA (at 17.08 2.02 90) (layer Dwgs.User)
    (effects (font (size 0.07 0.07) (thickness 0.01)))
  )
  (fp_text user VDDA (at 17.18 2.02 90) (layer Dwgs.User)
    (effects (font (size 0.07 0.07) (thickness 0.01)))
  )
  (fp_text user VDDA (at 17.28 2.02 90) (layer Dwgs.User)
    (effects (font (size 0.07 0.07) (thickness 0.01)))
  )
  (fp_text user VDDA (at 17.38 2.02 90) (layer Dwgs.User)
    (effects (font (size 0.07 0.07) (thickness 0.01)))
  )
  (fp_text user VINA (at 17.48 2.01 90) (layer Dwgs.User)
    (effects (font (size 0.07 0.07) (thickness 0.01)))
  )
  (fp_text user VINA (at 17.58 2.01 90) (layer Dwgs.User)
    (effects (font (size 0.07 0.07) (thickness 0.01)))
  )
  (fp_text user VINA (at 17.68 2.01 90) (layer Dwgs.User)
    (effects (font (size 0.07 0.07) (thickness 0.01)))
  )
  (fp_text user VINA (at 17.78 2.01 90) (layer Dwgs.User)
    (effects (font (size 0.07 0.07) (thickness 0.01)))
  )
  (fp_text user VINA (at 17.88 2.01 90) (layer Dwgs.User)
    (effects (font (size 0.07 0.07) (thickness 0.01)))
  )
  (fp_text user VIND (at 17.98 2.01 90) (layer Dwgs.User)
    (effects (font (size 0.07 0.07) (thickness 0.01)))
  )
  (fp_text user VIND (at 18.08 2.01 90) (layer Dwgs.User)
    (effects (font (size 0.07 0.07) (thickness 0.01)))
  )
  (fp_text user VIND (at 18.18 2.01 90) (layer Dwgs.User)
    (effects (font (size 0.07 0.07) (thickness 0.01)))
  )
  (fp_text user VIND (at 18.28 2.01 90) (layer Dwgs.User)
    (effects (font (size 0.07 0.07) (thickness 0.01)))
  )
  (fp_text user VIND (at 18.38 2.01 90) (layer Dwgs.User)
    (effects (font (size 0.07 0.07) (thickness 0.01)))
  )
  (fp_text user VDDD (at 18.48 2.02 90) (layer Dwgs.User)
    (effects (font (size 0.07 0.07) (thickness 0.01)))
  )
  (fp_text user VDDD (at 18.58 2.02 90) (layer Dwgs.User)
    (effects (font (size 0.07 0.07) (thickness 0.01)))
  )
  (fp_text user VDDD (at 18.68 2.02 90) (layer Dwgs.User)
    (effects (font (size 0.07 0.07) (thickness 0.01)))
  )
  (fp_text user VDDD (at 18.78 2.02 90) (layer Dwgs.User)
    (effects (font (size 0.07 0.07) (thickness 0.01)))
  )
  (fp_text user VDDD (at 18.88 2.02 90) (layer Dwgs.User)
    (effects (font (size 0.07 0.07) (thickness 0.01)))
  )
  (fp_text user GNDD (at 18.98 2.03 90) (layer Dwgs.User)
    (effects (font (size 0.07 0.07) (thickness 0.01)))
  )
  (fp_text user GNDD (at 19.08 2.03 90) (layer Dwgs.User)
    (effects (font (size 0.07 0.07) (thickness 0.01)))
  )
  (fp_text user GNDD (at 19.18 2.03 90) (layer Dwgs.User)
    (effects (font (size 0.07 0.07) (thickness 0.01)))
  )
  (fp_text user GNDD (at 19.28 2.025 90) (layer Dwgs.User)
    (effects (font (size 0.07 0.07) (thickness 0.01)))
  )
  (fp_text user GNDD (at 19.38 2.025 90) (layer Dwgs.User)
    (effects (font (size 0.07 0.07) (thickness 0.01)))
  )
  (fp_text user GTX1_P (at 10.18 2.08 90) (layer Dwgs.User)
    (effects (font (size 0.07 0.07) (thickness 0.01)))
  )
  (fp_text user GTX1_N (at 10.08 2.08 90) (layer Dwgs.User)
    (effects (font (size 0.07 0.07) (thickness 0.01)))
  )
  (fp_text user GND_CML (at 9.98 2.14 90) (layer Dwgs.User)
    (effects (font (size 0.07 0.07) (thickness 0.01)))
  )
  (fp_text user GTX2_P (at 10.48 2.09 90) (layer Dwgs.User)
    (effects (font (size 0.07 0.07) (thickness 0.01)))
  )
  (fp_text user GTX2_N (at 10.38 2.09 90) (layer Dwgs.User)
    (effects (font (size 0.07 0.07) (thickness 0.01)))
  )
  (fp_text user GND_CML (at 10.28 2.14 90) (layer Dwgs.User)
    (effects (font (size 0.07 0.07) (thickness 0.01)))
  )
  (fp_text user GTX3_P (at 10.76 2.09 90) (layer Dwgs.User)
    (effects (font (size 0.07 0.07) (thickness 0.01)))
  )
  (fp_text user GTX3_N (at 10.67 2.09 90) (layer Dwgs.User)
    (effects (font (size 0.07 0.07) (thickness 0.01)))
  )
  (fp_text user GND_CML (at 10.58 2.15 90) (layer Dwgs.User)
    (effects (font (size 0.07 0.07) (thickness 0.01)))
  )
  (fp_text user DATA_IN1_N (at 15.08 2.18 90) (layer Dwgs.User)
    (effects (font (size 0.07 0.07) (thickness 0.01)))
  )
  (fp_text user DATA_IN1_P (at 14.98 2.18 90) (layer Dwgs.User)
    (effects (font (size 0.07 0.07) (thickness 0.01)))
  )
  (fp_text user DATA_IN2_P (at 15.18 2.18 90) (layer Dwgs.User)
    (effects (font (size 0.07 0.07) (thickness 0.01)))
  )
  (fp_text user DATA_IN2_N (at 15.28 2.18 90) (layer Dwgs.User)
    (effects (font (size 0.07 0.07) (thickness 0.01)))
  )
  (fp_text user DATA_IN3_N (at 15.48 2.18 90) (layer Dwgs.User)
    (effects (font (size 0.07 0.07) (thickness 0.01)))
  )
  (fp_text user DATA_IN3_P (at 15.38 2.18 90) (layer Dwgs.User)
    (effects (font (size 0.07 0.07) (thickness 0.01)))
  )
  (fp_text user GPO_LVDS0_N (at 15.68 2.24 90) (layer Dwgs.User)
    (effects (font (size 0.07 0.07) (thickness 0.01)))
  )
  (fp_text user GPO_LVDS1_P (at 15.79 2.24 90) (layer Dwgs.User)
    (effects (font (size 0.07 0.07) (thickness 0.01)))
  )
  (fp_text user GPO_LVDS1_N (at 15.89 2.24 90) (layer Dwgs.User)
    (effects (font (size 0.07 0.07) (thickness 0.01)))
  )
  (fp_text user GPO_LVDS2_N (at 16.09 2.24 90) (layer Dwgs.User)
    (effects (font (size 0.07 0.07) (thickness 0.01)))
  )
  (fp_text user GPO_LVDS2_P (at 15.99 2.24 90) (layer Dwgs.User)
    (effects (font (size 0.07 0.07) (thickness 0.01)))
  )
  (fp_text user GPO_LVDS3_N (at 16.28 2.24 90) (layer Dwgs.User)
    (effects (font (size 0.07 0.07) (thickness 0.01)))
  )
  (fp_text user GPO_LVDS3_P (at 16.18 2.24 90) (layer Dwgs.User)
    (effects (font (size 0.07 0.07) (thickness 0.01)))
  )
  (pad ~ smd rect (at -0.0254 1.688) (size 0.068 0.101) (layers Dwgs.User))
  (pad 1 smd rect (at 0.4 -1.6) (size 0.1 1) (layers F.Cu F.Mask)
    (clearance 0.0254))
  (pad ~ smd rect (at 0.0746 1.688) (size 0.068 0.101) (layers Dwgs.User))
  (pad ~ smd rect (at 0.1746 1.688) (size 0.068 0.101) (layers Dwgs.User))
  (pad ~ smd rect (at 0.2746 1.688) (size 0.068 0.101) (layers Dwgs.User))
  (pad ~ smd rect (at 0.3746 1.688) (size 0.068 0.101) (layers Dwgs.User))
  (pad ~ smd rect (at 0.4746 1.688) (size 0.068 0.101) (layers Dwgs.User))
  (pad ~ smd rect (at 0.5746 1.688) (size 0.068 0.101) (layers Dwgs.User))
  (pad ~ smd rect (at 0.6746 1.688) (size 0.068 0.101) (layers Dwgs.User))
  (pad ~ smd rect (at 0.7746 1.688) (size 0.068 0.101) (layers Dwgs.User))
  (pad ~ smd rect (at 0.8746 1.688) (size 0.068 0.101) (layers Dwgs.User))
  (pad ~ smd rect (at 0.9746 1.688) (size 0.068 0.101) (layers Dwgs.User))
  (pad ~ smd rect (at 1.0746 1.688) (size 0.068 0.101) (layers Dwgs.User))
  (pad ~ smd rect (at 1.1746 1.688) (size 0.068 0.101) (layers Dwgs.User))
  (pad ~ smd rect (at 1.2746 1.688) (size 0.068 0.101) (layers Dwgs.User))
  (pad ~ smd rect (at 1.3746 1.688) (size 0.068 0.101) (layers Dwgs.User))
  (pad ~ smd rect (at 1.4746 1.688) (size 0.068 0.101) (layers Dwgs.User))
  (pad ~ smd rect (at 1.5746 1.688) (size 0.068 0.101) (layers Dwgs.User))
  (pad ~ smd rect (at 1.6746 1.688) (size 0.068 0.101) (layers Dwgs.User))
  (pad ~ smd rect (at 1.7746 1.688) (size 0.068 0.101) (layers Dwgs.User))
  (pad ~ smd rect (at 1.8746 1.688) (size 0.068 0.101) (layers Dwgs.User))
  (pad ~ smd rect (at 1.9746 1.688) (size 0.068 0.101) (layers Dwgs.User))
  (pad ~ smd rect (at 2.0746 1.688) (size 0.068 0.101) (layers Dwgs.User))
  (pad ~ smd rect (at 2.1746 1.688) (size 0.068 0.101) (layers Dwgs.User))
  (pad ~ smd rect (at 2.2746 1.688) (size 0.068 0.101) (layers Dwgs.User))
  (pad ~ smd rect (at 2.3746 1.688) (size 0.068 0.101) (layers Dwgs.User))
  (pad ~ smd rect (at 2.4746 1.688) (size 0.068 0.101) (layers Dwgs.User))
  (pad ~ smd rect (at 2.5746 1.688) (size 0.068 0.101) (layers Dwgs.User))
  (pad ~ smd rect (at 2.6746 1.688) (size 0.068 0.101) (layers Dwgs.User))
  (pad ~ smd rect (at 2.7746 1.688) (size 0.068 0.101) (layers Dwgs.User))
  (pad ~ smd rect (at 2.8746 1.688) (size 0.068 0.101) (layers Dwgs.User))
  (pad ~ smd rect (at 2.9746 1.688) (size 0.068 0.101) (layers Dwgs.User))
  (pad ~ smd rect (at 3.0746 1.688) (size 0.068 0.101) (layers Dwgs.User))
  (pad ~ smd rect (at 3.1746 1.688) (size 0.068 0.101) (layers Dwgs.User))
  (pad ~ smd rect (at 3.2746 1.688) (size 0.068 0.101) (layers Dwgs.User))
  (pad ~ smd rect (at 3.3746 1.688) (size 0.068 0.101) (layers Dwgs.User))
  (pad ~ smd rect (at 3.4746 1.688) (size 0.068 0.101) (layers Dwgs.User))
  (pad ~ smd rect (at 3.5746 1.688) (size 0.068 0.101) (layers Dwgs.User))
  (pad ~ smd rect (at 3.6746 1.688) (size 0.068 0.101) (layers Dwgs.User))
  (pad ~ smd rect (at 3.7746 1.688) (size 0.068 0.101) (layers Dwgs.User))
  (pad ~ smd rect (at 3.8746 1.688) (size 0.068 0.101) (layers Dwgs.User))
  (pad ~ smd rect (at 3.9746 1.688) (size 0.068 0.101) (layers Dwgs.User))
  (pad ~ smd rect (at 4.0746 1.688) (size 0.068 0.101) (layers Dwgs.User))
  (pad ~ smd rect (at 4.1746 1.688) (size 0.068 0.101) (layers Dwgs.User))
  (pad ~ smd rect (at 4.2746 1.688) (size 0.068 0.101) (layers Dwgs.User))
  (pad ~ smd rect (at 4.3746 1.688) (size 0.068 0.101) (layers Dwgs.User))
  (pad ~ smd rect (at 4.4746 1.688) (size 0.068 0.101) (layers Dwgs.User))
  (pad ~ smd rect (at 4.5746 1.688) (size 0.068 0.101) (layers Dwgs.User))
  (pad ~ smd rect (at 4.6746 1.688) (size 0.068 0.101) (layers Dwgs.User))
  (pad ~ smd rect (at 4.7746 1.688) (size 0.068 0.101) (layers Dwgs.User))
  (pad ~ smd rect (at 4.8746 1.688) (size 0.068 0.101) (layers Dwgs.User))
  (pad ~ smd rect (at 4.9746 1.688) (size 0.068 0.101) (layers Dwgs.User))
  (pad ~ smd rect (at 5.0746 1.688) (size 0.068 0.101) (layers Dwgs.User))
  (pad ~ smd rect (at 5.1746 1.688) (size 0.068 0.101) (layers Dwgs.User))
  (pad ~ smd rect (at 5.2746 1.688) (size 0.068 0.101) (layers Dwgs.User))
  (pad ~ smd rect (at 5.3746 1.688) (size 0.068 0.101) (layers Dwgs.User))
  (pad ~ smd rect (at 5.4746 1.688) (size 0.068 0.101) (layers Dwgs.User))
  (pad ~ smd rect (at 5.5746 1.688) (size 0.068 0.101) (layers Dwgs.User))
  (pad ~ smd rect (at 5.6746 1.688) (size 0.068 0.101) (layers Dwgs.User))
  (pad ~ smd rect (at 5.7746 1.688) (size 0.068 0.101) (layers Dwgs.User))
  (pad ~ smd rect (at 5.8746 1.688) (size 0.068 0.101) (layers Dwgs.User))
  (pad ~ smd rect (at 5.9746 1.688) (size 0.068 0.101) (layers Dwgs.User))
  (pad ~ smd rect (at 6.0746 1.688) (size 0.068 0.101) (layers Dwgs.User))
  (pad ~ smd rect (at 6.1746 1.688) (size 0.068 0.101) (layers Dwgs.User))
  (pad ~ smd rect (at 6.2746 1.688) (size 0.068 0.101) (layers Dwgs.User))
  (pad ~ smd rect (at 6.3746 1.688) (size 0.068 0.101) (layers Dwgs.User))
  (pad ~ smd rect (at 6.4746 1.688) (size 0.068 0.101) (layers Dwgs.User))
  (pad ~ smd rect (at 6.5746 1.688) (size 0.068 0.101) (layers Dwgs.User))
  (pad ~ smd rect (at 6.6746 1.688) (size 0.068 0.101) (layers Dwgs.User))
  (pad ~ smd rect (at 6.7746 1.688) (size 0.068 0.101) (layers Dwgs.User))
  (pad ~ smd rect (at 6.8746 1.688) (size 0.068 0.101) (layers Dwgs.User))
  (pad ~ smd rect (at 6.9746 1.688) (size 0.068 0.101) (layers Dwgs.User))
  (pad ~ smd rect (at 7.0746 1.688) (size 0.068 0.101) (layers Dwgs.User))
  (pad ~ smd rect (at 7.1746 1.688) (size 0.068 0.101) (layers Dwgs.User))
  (pad ~ smd rect (at 7.2746 1.688) (size 0.068 0.101) (layers Dwgs.User))
  (pad ~ smd rect (at 7.3746 1.688) (size 0.068 0.101) (layers Dwgs.User))
  (pad ~ smd rect (at 7.4746 1.688) (size 0.068 0.101) (layers Dwgs.User))
  (pad ~ smd rect (at 7.5746 1.688) (size 0.068 0.101) (layers Dwgs.User))
  (pad ~ smd rect (at 7.6746 1.688) (size 0.068 0.101) (layers Dwgs.User))
  (pad ~ smd rect (at 7.7746 1.688) (size 0.068 0.101) (layers Dwgs.User))
  (pad ~ smd rect (at 7.8746 1.688) (size 0.068 0.101) (layers Dwgs.User))
  (pad ~ smd rect (at 7.9746 1.688) (size 0.068 0.101) (layers Dwgs.User))
  (pad ~ smd rect (at 8.0746 1.688) (size 0.068 0.101) (layers Dwgs.User))
  (pad ~ smd rect (at 8.1746 1.688) (size 0.068 0.101) (layers Dwgs.User))
  (pad ~ smd rect (at 8.2746 1.688) (size 0.068 0.101) (layers Dwgs.User))
  (pad ~ smd rect (at 8.3746 1.688) (size 0.068 0.101) (layers Dwgs.User))
  (pad ~ smd rect (at 8.4746 1.688) (size 0.068 0.101) (layers Dwgs.User))
  (pad ~ smd rect (at 8.5746 1.688) (size 0.068 0.101) (layers Dwgs.User))
  (pad ~ smd rect (at 8.6746 1.688) (size 0.068 0.101) (layers Dwgs.User))
  (pad ~ smd rect (at 8.7746 1.688) (size 0.068 0.101) (layers Dwgs.User))
  (pad ~ smd rect (at 8.8746 1.688) (size 0.068 0.101) (layers Dwgs.User))
  (pad ~ smd rect (at 8.9746 1.688) (size 0.068 0.101) (layers Dwgs.User))
  (pad ~ smd rect (at 9.0746 1.688) (size 0.068 0.101) (layers Dwgs.User))
  (pad ~ smd rect (at 9.1746 1.688) (size 0.068 0.101) (layers Dwgs.User))
  (pad ~ smd rect (at 9.2746 1.688) (size 0.068 0.101) (layers Dwgs.User))
  (pad ~ smd rect (at 9.3746 1.688) (size 0.068 0.101) (layers Dwgs.User))
  (pad ~ smd rect (at 9.4746 1.688) (size 0.068 0.101) (layers Dwgs.User))
  (pad ~ smd rect (at 9.5746 1.688) (size 0.068 0.101) (layers Dwgs.User))
  (pad ~ smd rect (at 9.6746 1.688) (size 0.068 0.101) (layers Dwgs.User))
  (pad ~ smd rect (at 9.7746 1.688) (size 0.068 0.101) (layers Dwgs.User))
  (pad ~ smd rect (at 9.8746 1.688) (size 0.068 0.101) (layers Dwgs.User))
  (pad ~ smd rect (at 9.9746 1.688) (size 0.068 0.101) (layers Dwgs.User))
  (pad ~ smd rect (at 10.0746 1.688) (size 0.068 0.101) (layers Dwgs.User))
  (pad ~ smd rect (at 10.1746 1.688) (size 0.068 0.101) (layers Dwgs.User))
  (pad ~ smd rect (at 10.2746 1.688) (size 0.068 0.101) (layers Dwgs.User))
  (pad ~ smd rect (at 10.3746 1.688) (size 0.068 0.101) (layers Dwgs.User))
  (pad ~ smd rect (at 10.4746 1.688) (size 0.068 0.101) (layers Dwgs.User))
  (pad ~ smd rect (at 10.5746 1.688) (size 0.068 0.101) (layers Dwgs.User))
  (pad ~ smd rect (at 10.6746 1.688) (size 0.068 0.101) (layers Dwgs.User))
  (pad ~ smd rect (at 10.7746 1.688) (size 0.068 0.101) (layers Dwgs.User))
  (pad ~ smd rect (at 10.8746 1.688) (size 0.068 0.101) (layers Dwgs.User))
  (pad ~ smd rect (at 10.9746 1.688) (size 0.068 0.101) (layers Dwgs.User))
  (pad ~ smd rect (at 11.0746 1.688) (size 0.068 0.101) (layers Dwgs.User))
  (pad ~ smd rect (at 11.1746 1.688) (size 0.068 0.101) (layers Dwgs.User))
  (pad ~ smd rect (at 11.2746 1.688) (size 0.068 0.101) (layers Dwgs.User))
  (pad ~ smd rect (at 11.3746 1.688) (size 0.068 0.101) (layers Dwgs.User))
  (pad ~ smd rect (at 11.4746 1.688) (size 0.068 0.101) (layers Dwgs.User))
  (pad ~ smd rect (at 11.5746 1.688) (size 0.068 0.101) (layers Dwgs.User))
  (pad ~ smd rect (at 11.6746 1.688) (size 0.068 0.101) (layers Dwgs.User))
  (pad ~ smd rect (at 11.7746 1.688) (size 0.068 0.101) (layers Dwgs.User))
  (pad ~ smd rect (at 11.8746 1.688) (size 0.068 0.101) (layers Dwgs.User))
  (pad ~ smd rect (at 11.9746 1.688) (size 0.068 0.101) (layers Dwgs.User))
  (pad ~ smd rect (at 12.0746 1.688) (size 0.068 0.101) (layers Dwgs.User))
  (pad ~ smd rect (at 12.1746 1.688) (size 0.068 0.101) (layers Dwgs.User))
  (pad ~ smd rect (at 12.2746 1.688) (size 0.068 0.101) (layers Dwgs.User))
  (pad ~ smd rect (at 12.3746 1.688) (size 0.068 0.101) (layers Dwgs.User))
  (pad ~ smd rect (at 12.4746 1.688) (size 0.068 0.101) (layers Dwgs.User))
  (pad ~ smd rect (at 12.5746 1.688) (size 0.068 0.101) (layers Dwgs.User))
  (pad ~ smd rect (at 12.6746 1.688) (size 0.068 0.101) (layers Dwgs.User))
  (pad ~ smd rect (at 12.7746 1.688) (size 0.068 0.101) (layers Dwgs.User))
  (pad ~ smd rect (at 12.8746 1.688) (size 0.068 0.101) (layers Dwgs.User))
  (pad ~ smd rect (at 12.9746 1.688) (size 0.068 0.101) (layers Dwgs.User))
  (pad ~ smd rect (at 13.0746 1.688) (size 0.068 0.101) (layers Dwgs.User))
  (pad ~ smd rect (at 13.1746 1.688) (size 0.068 0.101) (layers Dwgs.User))
  (pad ~ smd rect (at 13.2746 1.688) (size 0.068 0.101) (layers Dwgs.User))
  (pad ~ smd rect (at 13.3746 1.688) (size 0.068 0.101) (layers Dwgs.User))
  (pad ~ smd rect (at 13.4746 1.688) (size 0.068 0.101) (layers Dwgs.User))
  (pad ~ smd rect (at 13.5746 1.688) (size 0.068 0.101) (layers Dwgs.User))
  (pad ~ smd rect (at 13.6746 1.688) (size 0.068 0.101) (layers Dwgs.User))
  (pad ~ smd rect (at 13.7746 1.688) (size 0.068 0.101) (layers Dwgs.User))
  (pad ~ smd rect (at 13.8746 1.688) (size 0.068 0.101) (layers Dwgs.User))
  (pad ~ smd rect (at 13.9746 1.688) (size 0.068 0.101) (layers Dwgs.User))
  (pad ~ smd rect (at 14.0746 1.688) (size 0.068 0.101) (layers Dwgs.User))
  (pad ~ smd rect (at 14.1746 1.688) (size 0.068 0.101) (layers Dwgs.User))
  (pad ~ smd rect (at 14.2746 1.688) (size 0.068 0.101) (layers Dwgs.User))
  (pad ~ smd rect (at 14.3746 1.688) (size 0.068 0.101) (layers Dwgs.User))
  (pad ~ smd rect (at 14.4746 1.688) (size 0.068 0.101) (layers Dwgs.User))
  (pad ~ smd rect (at 14.5746 1.688) (size 0.068 0.101) (layers Dwgs.User))
  (pad ~ smd rect (at 14.6746 1.688) (size 0.068 0.101) (layers Dwgs.User))
  (pad ~ smd rect (at 14.7746 1.688) (size 0.068 0.101) (layers Dwgs.User))
  (pad ~ smd rect (at 14.8746 1.688) (size 0.068 0.101) (layers Dwgs.User))
  (pad ~ smd rect (at 14.9746 1.688) (size 0.068 0.101) (layers Dwgs.User))
  (pad ~ smd rect (at 15.0746 1.688) (size 0.068 0.101) (layers Dwgs.User))
  (pad ~ smd rect (at 15.1746 1.688) (size 0.068 0.101) (layers Dwgs.User))
  (pad ~ smd rect (at 15.2746 1.688) (size 0.068 0.101) (layers Dwgs.User))
  (pad ~ smd rect (at 15.3746 1.688) (size 0.068 0.101) (layers Dwgs.User))
  (pad ~ smd rect (at 15.4746 1.688) (size 0.068 0.101) (layers Dwgs.User))
  (pad ~ smd rect (at 15.5746 1.688) (size 0.068 0.101) (layers Dwgs.User))
  (pad ~ smd rect (at 15.6746 1.688) (size 0.068 0.101) (layers Dwgs.User))
  (pad ~ smd rect (at 15.7746 1.688) (size 0.068 0.101) (layers Dwgs.User))
  (pad ~ smd rect (at 15.8746 1.688) (size 0.068 0.101) (layers Dwgs.User))
  (pad ~ smd rect (at 15.9746 1.688) (size 0.068 0.101) (layers Dwgs.User))
  (pad ~ smd rect (at 16.0746 1.688) (size 0.068 0.101) (layers Dwgs.User))
  (pad ~ smd rect (at 16.1746 1.688) (size 0.068 0.101) (layers Dwgs.User))
  (pad ~ smd rect (at 16.2746 1.688) (size 0.068 0.101) (layers Dwgs.User))
  (pad ~ smd rect (at 16.3746 1.688) (size 0.068 0.101) (layers Dwgs.User))
  (pad ~ smd rect (at 16.4746 1.688) (size 0.068 0.101) (layers Dwgs.User))
  (pad ~ smd rect (at 16.5746 1.688) (size 0.068 0.101) (layers Dwgs.User))
  (pad ~ smd rect (at 16.6746 1.688) (size 0.068 0.101) (layers Dwgs.User))
  (pad ~ smd rect (at 16.7746 1.688) (size 0.068 0.101) (layers Dwgs.User))
  (pad ~ smd rect (at 16.8746 1.688) (size 0.068 0.101) (layers Dwgs.User))
  (pad ~ smd rect (at 16.9746 1.688) (size 0.068 0.101) (layers Dwgs.User))
  (pad ~ smd rect (at 17.0746 1.688) (size 0.068 0.101) (layers Dwgs.User))
  (pad ~ smd rect (at 17.1746 1.688) (size 0.068 0.101) (layers Dwgs.User))
  (pad ~ smd rect (at 17.2746 1.688) (size 0.068 0.101) (layers Dwgs.User))
  (pad ~ smd rect (at 17.3746 1.688) (size 0.068 0.101) (layers Dwgs.User))
  (pad ~ smd rect (at 17.4746 1.688) (size 0.068 0.101) (layers Dwgs.User))
  (pad ~ smd rect (at 17.5746 1.688) (size 0.068 0.101) (layers Dwgs.User))
  (pad ~ smd rect (at 17.6746 1.688) (size 0.068 0.101) (layers Dwgs.User))
  (pad ~ smd rect (at 17.7746 1.688) (size 0.068 0.101) (layers Dwgs.User))
  (pad ~ smd rect (at 17.8746 1.688) (size 0.068 0.101) (layers Dwgs.User))
  (pad ~ smd rect (at 17.9746 1.688) (size 0.068 0.101) (layers Dwgs.User))
  (pad ~ smd rect (at 18.0746 1.688) (size 0.068 0.101) (layers Dwgs.User))
  (pad ~ smd rect (at 18.1746 1.688) (size 0.068 0.101) (layers Dwgs.User))
  (pad ~ smd rect (at 18.2746 1.688) (size 0.068 0.101) (layers Dwgs.User))
  (pad ~ smd rect (at 18.3746 1.688) (size 0.068 0.101) (layers Dwgs.User))
  (pad ~ smd rect (at 18.4746 1.688) (size 0.068 0.101) (layers Dwgs.User))
  (pad ~ smd rect (at 18.5746 1.688) (size 0.068 0.101) (layers Dwgs.User))
  (pad ~ smd rect (at 18.6746 1.688) (size 0.068 0.101) (layers Dwgs.User))
  (pad ~ smd rect (at 18.7746 1.688) (size 0.068 0.101) (layers Dwgs.User))
  (pad ~ smd rect (at 18.8746 1.688) (size 0.068 0.101) (layers Dwgs.User))
  (pad ~ smd rect (at 18.9746 1.688) (size 0.068 0.101) (layers Dwgs.User))
  (pad ~ smd rect (at 19.0746 1.688) (size 0.068 0.101) (layers Dwgs.User))
  (pad ~ smd rect (at 19.1746 1.688) (size 0.068 0.101) (layers Dwgs.User))
  (pad ~ smd rect (at 19.2746 1.688) (size 0.068 0.101) (layers Dwgs.User))
  (pad ~ smd rect (at 19.3746 1.688) (size 0.068 0.101) (layers Dwgs.User))
  (pad ~ smd rect (at 19.4746 1.688) (size 0.068 0.101) (layers Dwgs.User))
  (pad ~ smd rect (at 19.5746 1.688) (size 0.068 0.101) (layers Dwgs.User))
  (pad ~ smd rect (at 19.6746 1.688) (size 0.068 0.101) (layers Dwgs.User))
  (pad 2 smd rect (at 0.6 -1.6) (size 0.1 1) (layers F.Cu F.Mask)
    (clearance 0.0254))
  (pad 3 smd rect (at 0.8 -1.6) (size 0.1 1) (layers F.Cu F.Mask)
    (clearance 0.0254))
  (pad 4 smd rect (at 1 -1.8) (size 0.1 0.6) (layers F.Cu F.Mask)
    (clearance 0.0254))
  (pad 5 smd rect (at 1.2 -1.8) (size 0.1 0.6) (layers F.Cu F.Mask)
    (clearance 0.0254))
  (pad 6 smd rect (at 1.4 -1.8) (size 0.1 0.6) (layers F.Cu F.Mask)
    (clearance 0.0254))
  (pad 51 smd rect (at 4.5 -1.8) (size 0.1 0.6) (layers F.Cu F.Mask)
    (clearance 0.0254))
  (pad 52 smd rect (at 4.7 -1.8) (size 0.1 0.6) (layers F.Cu F.Mask)
    (clearance 0.0254))
  (pad 53 smd rect (at 4.9 -1.8) (size 0.1 0.6) (layers F.Cu F.Mask)
    (clearance 0.0254))
  (pad 54 smd rect (at 5.1 -1.8) (size 0.1 0.6) (layers F.Cu F.Mask)
    (clearance 0.0254))
  (pad 55 smd rect (at 5.3 -1.8) (size 0.1 0.6) (layers F.Cu F.Mask)
    (clearance 0.0254))
  (pad 56 smd rect (at 5.5 -1.8) (size 0.1 0.6) (layers F.Cu F.Mask)
    (clearance 0.0254))
  (pad 57 smd rect (at 5.7 -1.8) (size 0.1 0.6) (layers F.Cu F.Mask)
    (clearance 0.0254))
  (pad 58 smd rect (at 5.9 -1.8) (size 0.1 0.6) (layers F.Cu F.Mask)
    (clearance 0.0254))
  (pad 59 smd rect (at 6.1 -1.8) (size 0.1 0.6) (layers F.Cu F.Mask)
    (clearance 0.0254))
  (pad 93 smd rect (at 8.95 -1.9) (size 0.1 0.4) (layers F.Cu F.Mask)
    (clearance 0.0254))
  (pad 94 smd rect (at 9.2 -1.9) (size 0.1 0.4) (layers F.Cu F.Mask)
    (clearance 0.0254))
  (pad 99 smd rect (at 9.6 -1.9) (size 0.1 0.4) (layers F.Cu F.Mask)
    (clearance 0.0254))
  (pad 100 smd rect (at 9.85 -1.9) (size 0.1 0.4) (layers F.Cu F.Mask)
    (clearance 0.0254))
  (pad 102 smd rect (at 10.1 -1.9) (size 0.1 0.4) (layers F.Cu F.Mask)
    (clearance 0.0254))
  (pad 103 smd rect (at 10.35 -1.9) (size 0.1 0.4) (layers F.Cu F.Mask)
    (clearance 0.0254))
  (pad 105 smd rect (at 10.8 -1.9) (size 0.1 0.4) (layers F.Cu F.Mask)
    (clearance 0.0254))
  (pad 106 smd rect (at 11.05 -1.9 180) (size 0.1 0.4) (layers F.Cu F.Mask)
    (clearance 0.0254))
  (pad 108 smd rect (at 11.3 -1.9) (size 0.1 0.4) (layers F.Cu F.Mask)
    (clearance 0.0254))
  (pad 109 smd rect (at 11.55 -1.9) (size 0.1 0.4) (layers F.Cu F.Mask)
    (clearance 0.0254))
  (pad 144 smd rect (at 14.3 -1.6) (size 0.1 1) (layers F.Cu F.Mask)
    (clearance 0.0254))
  (pad 145 smd rect (at 14.5 -1.6) (size 0.1 1) (layers F.Cu F.Mask)
    (clearance 0.0254))
  (pad 146 smd rect (at 14.7 -1.6) (size 0.1 1) (layers F.Cu F.Mask)
    (clearance 0.0254))
  (pad 147 smd rect (at 14.9 -1.6) (size 0.1 1) (layers F.Cu F.Mask)
    (clearance 0.0254))
  (pad 198 smd rect (at 19 -1.8) (size 0.1 0.6) (layers F.Cu F.Mask)
    (clearance 0.0254))
  (pad 149 smd rect (at 14.6 -1.9) (size 0.1 0.4) (layers Dwgs.User)
    (clearance 0.0254))
  (pad 150 smd rect (at 14.8 -1.9) (size 0.1 0.4) (layers Dwgs.User)
    (clearance 0.0254))
  (pad 152 smd rect (at 15.2 -1.9) (size 0.1 0.4) (layers Dwgs.User)
    (clearance 0.0254))
  (pad 151 smd rect (at 15 -1.9) (size 0.1 0.4) (layers Dwgs.User)
    (clearance 0.0254))
  (pad 154 smd rect (at 15.6 -1.9) (size 0.1 0.4) (layers Dwgs.User)
    (clearance 0.0254))
  (pad 153 smd rect (at 15.4 -1.9) (size 0.1 0.4) (layers Dwgs.User)
    (clearance 0.0254))
  (pad 156 smd rect (at 16 -1.9) (size 0.1 0.4) (layers Dwgs.User)
    (clearance 0.0254))
  (pad 155 smd rect (at 15.8 -1.9) (size 0.1 0.4) (layers Dwgs.User)
    (clearance 0.0254))
  (pad 14 smd rect (at 2 -1.8) (size 0.5 0.6) (layers F.Cu F.Mask)
    (clearance 0.0254))
  (pad 29 smd rect (at 3.2 -1.8) (size 0.5 0.6) (layers F.Cu F.Mask)
    (clearance 0.0254))
  (pad 19 smd rect (at 2.6 -1.8) (size 0.5 0.6) (layers F.Cu F.Mask)
    (clearance 0.0254))
  (pad 66 smd rect (at 6.7 -1.8) (size 0.5 0.6) (layers F.Cu F.Mask)
    (clearance 0.0254))
  (pad 71 smd rect (at 7.3 -1.8) (size 0.5 0.6) (layers F.Cu F.Mask)
    (clearance 0.0254))
  (pad 81 smd rect (at 7.9 -1.8) (size 0.5 0.6) (layers F.Cu F.Mask)
    (clearance 0.0254))
  (pad 118 smd rect (at 12.5 -1.8) (size 0.5 0.6) (layers F.Cu F.Mask)
    (clearance 0.0254))
  (pad 133 smd rect (at 13.7 -1.8) (size 0.5 0.6) (layers F.Cu F.Mask)
    (clearance 0.0254))
  (pad 123 smd rect (at 13.1 -1.8) (size 0.5 0.6) (layers F.Cu F.Mask)
    (clearance 0.0254))
  (pad 171 smd rect (at 17.2 -1.8) (size 0.5 0.6) (layers F.Cu F.Mask)
    (clearance 0.0254))
  (pad 186 smd rect (at 18.4 -1.8) (size 0.5 0.6) (layers F.Cu F.Mask)
    (clearance 0.0254))
  (pad 176 smd rect (at 17.8 -1.8) (size 0.5 0.6) (layers F.Cu F.Mask)
    (clearance 0.0254))
  (pad 118 smd rect (at 10.6 -1.5) (size 2.5 0.2) (layers F.Cu F.Mask)
    (clearance 0.0254) (zone_connect 0))
  (pad 8 smd custom (at 2.9 -1.2) (size 3.9 0.2) (layers F.Cu F.Mask)
    (clearance 0.0254) (zone_connect 2)
    (options (clearance outline) (anchor rect))
    (primitives
      (gr_poly (pts
         (xy -1.35 0.1) (xy -1.25 0.1) (xy -1.25 -0.9) (xy -1.35 -0.9)) (width 0))
      (gr_poly (pts
         (xy 0.65 0.1) (xy 0.75 0.1) (xy 0.75 -0.9) (xy 0.65 -0.9)) (width 0))
    ))
  (pad 157 smd rect (at 16 -1.9) (size 0.1 0.4) (layers F.Cu F.Mask)
    (clearance 0.0254))
  (pad 158 smd rect (at 16.25 -1.9) (size 0.1 0.4) (layers F.Cu F.Mask)
    (clearance 0.0254))
  (pad 61 smd custom (at 7.2 -1.2) (size 2.7 0.2) (layers F.Cu F.Mask)
    (clearance 0.0254) (zone_connect 2)
    (options (clearance outline) (anchor rect))
    (primitives
      (gr_poly (pts
         (xy -0.95 0.1) (xy -0.85 0.1) (xy -0.85 -0.9) (xy -0.95 -0.9)) (width 0))
      (gr_poly (pts
         (xy 1.05 0.1) (xy 1.15 0.1) (xy 1.15 -0.9) (xy 1.05 -0.9)) (width 0))
    ))
  (pad 113 smd custom (at 11.7 -1.2) (size 4.7 0.2) (layers F.Cu F.Mask)
    (clearance 0.0254) (zone_connect 2)
    (options (clearance outline) (anchor rect))
    (primitives
      (gr_poly (pts
         (xy 0.35 0.1) (xy 0.45 0.1) (xy 0.45 -0.9) (xy 0.35 -0.9)) (width 0))
      (gr_poly (pts
         (xy 2.35 0.1) (xy 2.45 0.1) (xy 2.45 -0.9) (xy 2.35 -0.9)) (width 0))
    ))
  (pad 166 smd custom (at 17.7 -1.2) (size 2.7 0.2) (layers F.Cu F.Mask)
    (clearance 0.0254) (zone_connect 2)
    (options (clearance outline) (anchor rect))
    (primitives
      (gr_poly (pts
         (xy -0.95 0.1) (xy -0.85 0.1) (xy -0.85 -0.9) (xy -0.95 -0.9)) (width 0))
      (gr_poly (pts
         (xy 1.05 0.1) (xy 1.15 0.1) (xy 1.15 -0.9) (xy 1.05 -0.9)) (width 0))
    ))
  (pad 45 smd rect (at 4.1 -1.6) (size 0.1 0.4) (layers F.Cu F.Mask)
    (clearance 0.0254))
  (pad 46 smd rect (at 4.3 -1.6) (size 0.1 0.4) (layers F.Cu F.Mask)
    (clearance 0.0254))
  (pad 102 smd roundrect (at 10.55 0 90) (size 0.25 0.2) (layers F.Cu F.Mask) (roundrect_rratio 0.25)
    (clearance 0.0254))
  (pad 103 smd roundrect (at 10.8 -0.35 270) (size 0.25 0.2) (layers F.Cu F.Mask) (roundrect_rratio 0.25)
    (clearance 0.0254))
)
