EESchema Schematic File Version 4
EELAYER 30 0
EELAYER END
$Descr User 17000 11000
encoding utf-8
Sheet 1 5
Title "ITkPixV1 Quad Hybrid"
Date "2020-08-25"
Rev "1.5"
Comp "LBNL"
Comment1 "cross-check: Timon Heim, Maurice Garcia-Sciveres "
Comment2 "design: Aleksandra Dimitrievska"
Comment3 ""
Comment4 ""
$EndDescr
Wire Wire Line
	6850 3900 6300 3900
Wire Wire Line
	6850 4000 6300 4000
Wire Wire Line
	6850 5100 6300 5100
Wire Wire Line
	6850 5200 6300 5200
Wire Wire Line
	6850 5300 6300 5300
Wire Wire Line
	6850 5400 6300 5400
Wire Wire Line
	6850 5500 6300 5500
Wire Wire Line
	6850 5600 6300 5600
Wire Wire Line
	8750 3950 9450 3950
Wire Wire Line
	8750 4050 9450 4050
Text Label 9450 3950 2    50   ~ 0
DATA_IN0_Chip1_P
Wire Wire Line
	8750 4150 9450 4150
Wire Wire Line
	8750 4250 9450 4250
Wire Wire Line
	8750 4350 9450 4350
Wire Wire Line
	8750 4450 9450 4450
Wire Wire Line
	8750 4550 9450 4550
Wire Wire Line
	8750 4650 9450 4650
Wire Wire Line
	8750 4850 9450 4850
Wire Wire Line
	8750 4950 9450 4950
Wire Wire Line
	8750 5050 9450 5050
Wire Wire Line
	8750 5150 9450 5150
Text Label 9450 4050 2    50   ~ 0
DATA_IN0_Chip1_N
Text Label 9450 4150 2    50   ~ 0
DATA_IN1_Chip1_P
Text Label 9450 4250 2    50   ~ 0
DATA_IN1_Chip1_N
Text Label 9450 4350 2    50   ~ 0
DATA_IN2_Chip1_P
Text Label 9450 4450 2    50   ~ 0
DATA_IN2_Chip1_N
Text Label 9450 4550 2    50   ~ 0
DATA_IN3_Chip1_P
Text Label 9450 4650 2    50   ~ 0
DATA_IN3_Chip1_N
Text Label 9450 4850 2    50   ~ 0
LVDS0_Chip1_P
Text Label 9450 4950 2    50   ~ 0
LVDS0_Chip1_N
Text Label 6300 3900 0    50   ~ 0
CMD_Chip1_P
Text Label 6300 4000 0    50   ~ 0
CMD_Chip1_N
Text Label 6300 4200 0    50   ~ 0
GTX0_Chip1_N
Text Label 6300 4300 0    50   ~ 0
GTX0_Chip1_P
Text Label 6300 5100 0    50   ~ 0
VIN
Text Label 6300 5200 0    50   ~ 0
LP_EN_Chip1
Text Label 6300 5300 0    50   ~ 0
MUX_Chip1
Text Label 6300 5400 0    50   ~ 0
VOFS_LP_Chip1
Text Label 6300 5500 0    50   ~ 0
VOFS_IN_Chip1
Text Label 6300 5600 0    50   ~ 0
VOFS_OUT_Chip1
Text Label 6300 4900 0    50   ~ 0
GTX3_Chip1_P
Text Label 6300 4800 0    50   ~ 0
GTX3_Chip1_N
Text Label 6300 4700 0    50   ~ 0
GTX2_Chip1_P
Text Label 6300 4600 0    50   ~ 0
GTX2_Chip1_N
Wire Wire Line
	11050 3950 10500 3950
Wire Wire Line
	11050 4050 10500 4050
Wire Wire Line
	11050 4250 10500 4250
Wire Wire Line
	11050 4350 10500 4350
Wire Wire Line
	11050 4450 10500 4450
Wire Wire Line
	11050 4550 10500 4550
Wire Wire Line
	11050 4650 10500 4650
Wire Wire Line
	11050 4750 10500 4750
Wire Wire Line
	11050 4850 10500 4850
Wire Wire Line
	11050 4950 10500 4950
Wire Wire Line
	11050 5150 10500 5150
Wire Wire Line
	11050 5250 10500 5250
Wire Wire Line
	11050 5350 10500 5350
Wire Wire Line
	11050 5450 10500 5450
Wire Wire Line
	11050 5550 10500 5550
Wire Wire Line
	11050 5650 10500 5650
Text Label 10500 3950 0    50   ~ 0
CMD_Chip4_P
Text Label 10500 4050 0    50   ~ 0
CMD_Chip4_N
Text Label 10500 4250 0    50   ~ 0
GTX0_Chip4_N
Text Label 10500 4350 0    50   ~ 0
GTX0_Chip4_P
Text Label 10500 5150 0    50   ~ 0
VIN
Text Label 10500 5250 0    50   ~ 0
LP_EN_Chip4
Text Label 10500 5350 0    50   ~ 0
MUX_Chip4
Text Label 10500 5450 0    50   ~ 0
VOFS_LP_Chip4
Text Label 10500 5550 0    50   ~ 0
VOFS_IN_Chip4
Text Label 10500 5650 0    50   ~ 0
VOFS_OUT_Chip4
Text Label 10500 4950 0    50   ~ 0
GTX3_Chip4_P
Text Label 10500 4850 0    50   ~ 0
GTX3_Chip4_N
Text Label 10500 4750 0    50   ~ 0
GTX2_Chip4_P
Text Label 10500 4650 0    50   ~ 0
GTX2_Chip4_N
Text Label 10500 4550 0    50   ~ 0
GTX1_Chip4_P
Text Label 10500 4450 0    50   ~ 0
GTX1_Chip4_N
Wire Wire Line
	12950 4900 13650 4900
Wire Wire Line
	12950 5000 13650 5000
Wire Wire Line
	12950 5100 13650 5100
Wire Wire Line
	12950 5200 13650 5200
Wire Wire Line
	12950 5400 13650 5400
Wire Wire Line
	12950 5500 13650 5500
Text Label 13650 4500 2    50   ~ 0
DATA_IN1_Chip4_P
Text Label 13650 4400 2    50   ~ 0
DATA_IN1_Chip4_N
Text Label 13650 4300 2    50   ~ 0
DATA_IN2_Chip4_P
Text Label 13650 4200 2    50   ~ 0
DATA_IN2_Chip4_N
Text Label 13650 4100 2    50   ~ 0
DATA_IN3_Chip4_P
Text Label 13650 4000 2    50   ~ 0
DATA_IN3_Chip4_N
Text Label 13650 4900 2    50   ~ 0
LVDS0_Chip4_P
Text Label 13650 5000 2    50   ~ 0
LVDS0_Chip4_N
Text Label 13650 5100 2    50   ~ 0
LVDS1_Chip4_P
Text Label 13650 5200 2    50   ~ 0
LVDS1_Chip4_N
Text Label 13650 5400 2    50   ~ 0
CHIP_ID2
Text Label 13650 5500 2    50   ~ 0
CHIP_ID3
Wire Wire Line
	12950 6700 13650 6700
Wire Wire Line
	12950 6800 13650 6800
Text Label 13650 6700 2    50   ~ 0
DATA_IN0_Chip3_P
Wire Wire Line
	12950 6900 13650 6900
Wire Wire Line
	12950 7000 13650 7000
Wire Wire Line
	12950 7100 13650 7100
Wire Wire Line
	12950 7200 13650 7200
Wire Wire Line
	12950 7300 13650 7300
Wire Wire Line
	12950 7400 13650 7400
Wire Wire Line
	12950 7600 13650 7600
Wire Wire Line
	12950 7700 13650 7700
Wire Wire Line
	12950 7800 13650 7800
Wire Wire Line
	12950 7900 13650 7900
Text Label 13650 6800 2    50   ~ 0
DATA_IN0_Chip3_N
Text Label 13650 6900 2    50   ~ 0
DATA_IN1_Chip3_P
Text Label 13650 7000 2    50   ~ 0
DATA_IN1_Chip3_N
Text Label 13650 7100 2    50   ~ 0
DATA_IN2_Chip3_P
Text Label 13650 7200 2    50   ~ 0
DATA_IN2_Chip3_N
Text Label 13650 7300 2    50   ~ 0
DATA_IN3_Chip3_P
Text Label 13650 7400 2    50   ~ 0
DATA_IN3_Chip3_N
Text Label 13650 7600 2    50   ~ 0
LVDS0_Chip3_P
Text Label 13650 7700 2    50   ~ 0
LVDS0_Chip3_N
Text Label 13650 7800 2    50   ~ 0
LVDS1_Chip3_P
Text Label 13650 7900 2    50   ~ 0
LVDS1_Chip3_N
Wire Wire Line
	11050 6650 10500 6650
Wire Wire Line
	11050 6750 10500 6750
Wire Wire Line
	11050 7850 10500 7850
Wire Wire Line
	11050 7950 10500 7950
Wire Wire Line
	11050 8050 10500 8050
Wire Wire Line
	11050 8150 10500 8150
Wire Wire Line
	11050 8250 10500 8250
Wire Wire Line
	11050 8350 10500 8350
Text Label 10500 6650 0    50   ~ 0
CMD_Chip3_P
Text Label 10500 6750 0    50   ~ 0
CMD_Chip3_N
Text Label 10500 6950 0    50   ~ 0
GTX0_Chip3_N
Text Label 10500 7050 0    50   ~ 0
GTX0_Chip3_P
Text Label 10500 7850 0    50   ~ 0
VIN
Text Label 10500 7950 0    50   ~ 0
LP_EN_Chip3
Text Label 10500 8050 0    50   ~ 0
MUX_Chip3
Text Label 10500 8150 0    50   ~ 0
VOFS_LP_Chip3
Text Label 10500 8250 0    50   ~ 0
VOFS_IN_Chip3
Text Label 10500 8350 0    50   ~ 0
VOFS_OUT_Chip3
Text Label 10500 7650 0    50   ~ 0
GTX3_Chip3_P
Text Label 10500 7550 0    50   ~ 0
GTX3_Chip3_N
Text Label 10500 7450 0    50   ~ 0
GTX2_Chip3_P
Text Label 10500 7350 0    50   ~ 0
GTX2_Chip3_N
Text Label 10500 7250 0    50   ~ 0
GTX1_Chip3_P
Text Label 10500 7150 0    50   ~ 0
GTX1_Chip3_N
Wire Wire Line
	8750 7150 9450 7150
Wire Wire Line
	8750 7250 9450 7250
Wire Wire Line
	8750 7350 9450 7350
Wire Wire Line
	8750 7450 9450 7450
Wire Wire Line
	8750 7650 9450 7650
Wire Wire Line
	8750 7750 9450 7750
Wire Wire Line
	8750 7850 9450 7850
Wire Wire Line
	8750 7950 9450 7950
Wire Wire Line
	8750 8150 9450 8150
Wire Wire Line
	8750 8250 9450 8250
Text Label 9450 7050 2    50   ~ 0
DATA_IN1_Chip2_P
Text Label 9450 7250 2    50   ~ 0
DATA_IN2_Chip2_P
Text Label 9450 7150 2    50   ~ 0
DATA_IN2_Chip2_N
Text Label 9450 7450 2    50   ~ 0
DATA_IN3_Chip2_P
Text Label 9450 7350 2    50   ~ 0
DATA_IN3_Chip2_N
Text Label 9450 7650 2    50   ~ 0
LVDS0_Chip2_P
Text Label 9450 7750 2    50   ~ 0
LVDS0_Chip2_N
Text Label 9450 7850 2    50   ~ 0
LVDS1_Chip2_P
Text Label 9450 7950 2    50   ~ 0
LVDS1_Chip2_N
Text Label 9450 8150 2    50   ~ 0
CHIP_ID2
Text Label 9450 8250 2    50   ~ 0
CHIP_ID3
Wire Wire Line
	6850 6650 6300 6650
Wire Wire Line
	6850 6750 6300 6750
Wire Wire Line
	6850 6950 6300 6950
Wire Wire Line
	6850 7050 6300 7050
Wire Wire Line
	6850 7150 6300 7150
Wire Wire Line
	6850 7250 6300 7250
Wire Wire Line
	6850 7550 6300 7550
Wire Wire Line
	6850 7650 6300 7650
Wire Wire Line
	6850 7850 6300 7850
Wire Wire Line
	6850 7950 6300 7950
Wire Wire Line
	6850 8050 6300 8050
Wire Wire Line
	6850 8150 6300 8150
Wire Wire Line
	6850 8250 6300 8250
Wire Wire Line
	6850 8350 6300 8350
Text Label 6300 7850 0    50   ~ 0
VIN
Text Label 6300 7950 0    50   ~ 0
LP_EN_Chip2
Text Label 6300 8050 0    50   ~ 0
MUX_Chip2
Text Label 6300 8150 0    50   ~ 0
VOFS_LP_Chip2
Text Label 6300 8250 0    50   ~ 0
VOFS_IN_Chip2
Text Label 6300 8350 0    50   ~ 0
VOFS_OUT_Chip2
$Comp
L conn_5025983993:ConnSingle J_conn1
U 1 1 5FBD9EF2
P 2500 4350
F 0 "J_conn1" H 2600 6837 60  0000 C CNN
F 1 "ConnSingle" H 2600 6731 60  0000 C CNN
F 2 "Library:Molex-502598-3993" H 2500 3850 60  0001 C CNN
F 3 "" H 2500 3850 60  0001 C CNN
	1    2500 4350
	1    0    0    -1  
$EndComp
Text Notes 8250 1000 0    50   ~ 0
CLK/CMD (multi-drop)\n
$Comp
L Device:R R4
U 1 1 5FC1A128
P 11350 1350
F 0 "R4" H 11420 1396 50  0000 L CNN
F 1 "100" H 11420 1305 50  0000 L CNN
F 2 "Resistors_SMD:R_0201_NoSilk" V 11280 1350 50  0001 C CNN
F 3 "~" H 11350 1350 50  0001 C CNN
	1    11350 1350
	1    0    0    -1  
$EndComp
Text Label 8250 1200 0    50   ~ 0
CMD_P
Text Label 8250 1500 0    50   ~ 0
CMD_N
$Comp
L Device:C C23
U 1 1 5FC2A9B1
P 8700 1700
F 0 "C23" H 8550 1800 50  0000 L CNN
F 1 "100n" H 8450 1600 50  0000 L CNN
F 2 "Capacitors_SMD:C_0402_NoSilk" H 8738 1550 50  0001 C CNN
F 3 "~" H 8700 1700 50  0001 C CNN
	1    8700 1700
	1    0    0    -1  
$EndComp
$Comp
L Device:C C24
U 1 1 5FC2B344
P 8900 1850
F 0 "C24" H 9015 1896 50  0000 L CNN
F 1 "100n" H 9015 1805 50  0000 L CNN
F 2 "Capacitors_SMD:C_0402_NoSilk" H 8938 1700 50  0001 C CNN
F 3 "~" H 8900 1850 50  0001 C CNN
	1    8900 1850
	1    0    0    -1  
$EndComp
Wire Wire Line
	8700 1850 8700 2450
Text Label 8700 2450 1    50   ~ 0
CMD_Chip1_P
Text Label 8900 2450 1    50   ~ 0
CMD_Chip1_N
Wire Wire Line
	8900 2000 8900 2450
Wire Wire Line
	8700 1550 8700 1200
Connection ~ 8700 1200
Wire Wire Line
	8700 1200 8250 1200
Wire Wire Line
	8900 1700 8900 1500
Connection ~ 8900 1500
Wire Wire Line
	8900 1500 8250 1500
$Comp
L Device:C C25
U 1 1 5FC65200
P 9450 1700
F 0 "C25" H 9300 1800 50  0000 L CNN
F 1 "100n" H 9150 1700 50  0000 L CNN
F 2 "Capacitors_SMD:C_0402_NoSilk" H 9488 1550 50  0001 C CNN
F 3 "~" H 9450 1700 50  0001 C CNN
	1    9450 1700
	1    0    0    -1  
$EndComp
$Comp
L Device:C C26
U 1 1 5FC6520A
P 9650 1850
F 0 "C26" H 9765 1896 50  0000 L CNN
F 1 "100n" H 9765 1805 50  0000 L CNN
F 2 "Capacitors_SMD:C_0402_NoSilk" H 9688 1700 50  0001 C CNN
F 3 "~" H 9650 1850 50  0001 C CNN
	1    9650 1850
	1    0    0    -1  
$EndComp
Wire Wire Line
	9450 1850 9450 2450
Text Label 9450 2450 1    50   ~ 0
CMD_Chip2_P
Text Label 9650 2450 1    50   ~ 0
CMD_Chip2_N
Wire Wire Line
	9650 2000 9650 2450
Wire Wire Line
	9450 1550 9450 1200
Wire Wire Line
	9650 1700 9650 1500
Connection ~ 9450 1200
Wire Wire Line
	9450 1200 8700 1200
Connection ~ 9650 1500
Wire Wire Line
	9650 1500 8900 1500
$Comp
L Device:C C27
U 1 1 5FC6EB51
P 10150 1700
F 0 "C27" H 10000 1800 50  0000 L CNN
F 1 "100n" H 9850 1700 50  0000 L CNN
F 2 "Capacitors_SMD:C_0402_NoSilk" H 10188 1550 50  0001 C CNN
F 3 "~" H 10150 1700 50  0001 C CNN
	1    10150 1700
	1    0    0    -1  
$EndComp
$Comp
L Device:C C28
U 1 1 5FC6EB5B
P 10350 1850
F 0 "C28" H 10465 1896 50  0000 L CNN
F 1 "100n" H 10465 1805 50  0000 L CNN
F 2 "Capacitors_SMD:C_0402_NoSilk" H 10388 1700 50  0001 C CNN
F 3 "~" H 10350 1850 50  0001 C CNN
	1    10350 1850
	1    0    0    -1  
$EndComp
Wire Wire Line
	10150 1850 10150 2450
Text Label 10150 2450 1    50   ~ 0
CMD_Chip3_P
Text Label 10350 2450 1    50   ~ 0
CMD_Chip3_N
Wire Wire Line
	10350 2000 10350 2450
Wire Wire Line
	10150 1550 10150 1200
Wire Wire Line
	10350 1700 10350 1500
Connection ~ 10150 1200
Wire Wire Line
	10150 1200 9450 1200
Connection ~ 10350 1500
Wire Wire Line
	10350 1500 9650 1500
$Comp
L Device:C C29
U 1 1 5FC78460
P 10850 1700
F 0 "C29" H 10700 1800 50  0000 L CNN
F 1 "100n" H 10550 1700 50  0000 L CNN
F 2 "Capacitors_SMD:C_0402_NoSilk" H 10888 1550 50  0001 C CNN
F 3 "~" H 10850 1700 50  0001 C CNN
	1    10850 1700
	1    0    0    -1  
$EndComp
$Comp
L Device:C C30
U 1 1 5FC7846A
P 11050 1850
F 0 "C30" H 11165 1896 50  0000 L CNN
F 1 "100n" H 11165 1805 50  0000 L CNN
F 2 "Capacitors_SMD:C_0402_NoSilk" H 11088 1700 50  0001 C CNN
F 3 "~" H 11050 1850 50  0001 C CNN
	1    11050 1850
	1    0    0    -1  
$EndComp
Wire Wire Line
	10850 1850 10850 2450
Text Label 10850 2450 1    50   ~ 0
CMD_Chip4_P
Text Label 11050 2450 1    50   ~ 0
CMD_Chip4_N
Wire Wire Line
	11050 2000 11050 2450
Wire Wire Line
	10850 1550 10850 1200
Wire Wire Line
	11050 1700 11050 1500
Connection ~ 10850 1200
Wire Wire Line
	10850 1200 10150 1200
Wire Wire Line
	10850 1200 11350 1200
Wire Wire Line
	10350 1500 11050 1500
Wire Wire Line
	11350 1500 11050 1500
Connection ~ 11050 1500
$Comp
L Device:Thermistor_NTC TH1
U 1 1 5FC9E155
P 5650 2400
F 0 "TH1" V 5360 2400 50  0000 C CNN
F 1 "10k" V 5451 2400 50  0000 C CNN
F 2 "Resistors_SMD:R_0402_NoSilk" H 5650 2450 50  0001 C CNN
F 3 "~" H 5650 2450 50  0001 C CNN
	1    5650 2400
	0    1    1    0   
$EndComp
Wire Wire Line
	5500 2400 5100 2400
Wire Wire Line
	5800 2400 6150 2400
Text Label 5100 2400 0    50   ~ 0
NTC
Text Label 6150 2400 2    50   ~ 0
NTC_RET
Text Notes 5100 2150 0    50   ~ 0
NTC\n
$Comp
L solder_pad:Solder_Pad U1
U 1 1 5FBE352B
P 7050 1150
F 0 "U1" H 7278 1203 59  0000 L CNN
F 1 "Solder_Pad" H 7278 1098 59  0000 L CNN
F 2 "Library:HV" H 7900 1550 59  0001 C CNN
F 3 "" H 7900 1550 59  0001 C CNN
	1    7050 1150
	1    0    0    -1  
$EndComp
Text Notes 5150 900  0    50   ~ 0
HV\n
$Comp
L Device:R R1
U 1 1 5FCF9356
P 5700 1150
F 0 "R1" V 5493 1150 50  0000 C CNN
F 1 "100k" V 5584 1150 50  0000 C CNN
F 2 "Resistors_SMD:R_0402_NoSilk" V 5630 1150 50  0001 C CNN
F 3 "~" H 5700 1150 50  0001 C CNN
	1    5700 1150
	0    1    1    0   
$EndComp
$Comp
L Device:C C18
U 1 1 5FCF9A98
P 6300 1400
F 0 "C18" H 6415 1446 50  0000 L CNN
F 1 "100n" H 6415 1355 50  0000 L CNN
F 2 "Capacitors_SMD:C_1206" H 6338 1250 50  0001 C CNN
F 3 "~" H 6300 1400 50  0001 C CNN
	1    6300 1400
	1    0    0    -1  
$EndComp
Wire Wire Line
	5850 1150 6300 1150
Wire Wire Line
	6300 1150 6300 1250
Wire Wire Line
	6300 1650 6300 1550
Wire Wire Line
	5150 1150 5550 1150
Wire Wire Line
	6300 1150 6850 1150
Connection ~ 6300 1150
Text Label 6300 1650 0    50   ~ 0
GND
Text Label 5150 1150 0    50   ~ 0
HV
$Comp
L Device:C C19
U 1 1 5FDE4893
P 7200 2000
F 0 "C19" V 7150 1850 50  0000 C CNN
F 1 "100n" V 7150 2150 50  0000 C CNN
F 2 "Capacitors_SMD:C_0402_NoSilk" H 7238 1850 50  0001 C CNN
F 3 "~" H 7200 2000 50  0001 C CNN
	1    7200 2000
	0    1    1    0   
$EndComp
Text Label 6450 2450 0    50   ~ 0
LP_EN
Text Label 8000 2000 2    50   ~ 0
LP_EN_Chip1
Text Label 8000 2300 2    50   ~ 0
LP_EN_Chip2
Text Label 8000 2600 2    50   ~ 0
LP_EN_Chip3
Text Label 8000 2900 2    50   ~ 0
LP_EN_Chip4
Text Notes 6550 1850 0    50   ~ 0
LowPower Enable Mode\n(AC coupled on the module)\n
Wire Wire Line
	2050 8600 1250 8600
Wire Wire Line
	2050 8700 1250 8700
Wire Wire Line
	2050 8800 1250 8800
Wire Wire Line
	2050 8900 1250 8900
Wire Wire Line
	2050 9000 1250 9000
Wire Wire Line
	2050 9100 1250 9100
Wire Wire Line
	2050 9200 1250 9200
Wire Wire Line
	3050 8600 3850 8600
Wire Wire Line
	3050 8700 3850 8700
Wire Wire Line
	3050 8800 3850 8800
Wire Wire Line
	3050 8900 3850 8900
Wire Wire Line
	3050 9000 3850 9000
Wire Wire Line
	3050 9100 3850 9100
Wire Wire Line
	3050 9200 3850 9200
Wire Wire Line
	3050 9300 3850 9300
Text Label 1250 8600 0    50   ~ 0
VOUT
Text Label 1250 8700 0    50   ~ 0
VOUT
Text Label 3850 8600 2    50   ~ 0
VOUT
Text Label 3850 8700 2    50   ~ 0
VOUT
Text Label 3850 8800 2    50   ~ 0
VOUT
Text Label 3850 8900 2    50   ~ 0
VOUT
Text Label 3850 9000 2    50   ~ 0
LP_EN
Text Label 3850 9100 2    50   ~ 0
VIN
Text Label 3850 9200 2    50   ~ 0
VIN
Text Label 3850 9300 2    50   ~ 0
VIN
Text Label 1250 9200 0    50   ~ 0
VIN
Text Label 1250 9100 0    50   ~ 0
VIN
Text Label 1250 9000 0    50   ~ 0
HV
Text Label 1250 8900 0    50   ~ 0
NTC_RET
Text Label 1250 8800 0    50   ~ 0
NTC
$Comp
L power:GND #PWR01
U 1 1 5FF46938
P 1500 9900
F 0 "#PWR01" H 1500 9650 50  0001 C CNN
F 1 "GND" H 1505 9727 50  0000 C CNN
F 2 "" H 1500 9900 50  0001 C CNN
F 3 "" H 1500 9900 50  0001 C CNN
	1    1500 9900
	1    0    0    -1  
$EndComp
Wire Wire Line
	1500 9900 2250 9900
Text Label 2250 9900 2    50   ~ 0
VOUT
Text Notes 12050 850  0    50   ~ 0
Voffset sharing\n
Text Notes 600  1200 0    50   ~ 0
Quad:\n- Data sharing: 0.25/0.5/1.0/2.0 lines per FE\n(data_in lines have internal termination of 100 Ohms in ITkPixV1)\n- If requested the next version of the chip the internal termination can be removed, \nthen we need to terminate the data lines for which a additional resitots are added (do not load for ITkPixV1)\n- CMD forwarding: from 2 chips\n- Data pinout not final\n- AC coupling capacitors on data lines are not final\n
NoConn ~ 13650 6700
NoConn ~ 13650 6800
NoConn ~ 13650 6900
NoConn ~ 13650 7000
NoConn ~ 13650 7100
NoConn ~ 13650 7200
NoConn ~ 13650 7300
NoConn ~ 13650 7400
NoConn ~ 9450 3950
NoConn ~ 9450 4050
NoConn ~ 9450 4150
NoConn ~ 9450 4250
NoConn ~ 9450 4350
NoConn ~ 9450 4450
NoConn ~ 9450 4550
NoConn ~ 9450 4650
NoConn ~ 9450 7150
NoConn ~ 9450 7250
NoConn ~ 9450 7350
NoConn ~ 9450 7450
Wire Wire Line
	10500 7350 11050 7350
Wire Wire Line
	10500 7450 11050 7450
Wire Wire Line
	10500 7550 11050 7550
Wire Wire Line
	10500 7650 11050 7650
NoConn ~ 6300 7550
NoConn ~ 6300 7650
Wire Wire Line
	5950 7350 6850 7350
Wire Wire Line
	6050 7450 6850 7450
NoConn ~ 10500 4950
NoConn ~ 10500 4850
NoConn ~ 10500 4750
NoConn ~ 10500 4650
Wire Wire Line
	6300 4900 6850 4900
Wire Wire Line
	8750 7050 9900 7050
Wire Wire Line
	6300 4800 6850 4800
Wire Wire Line
	8750 6950 9600 6950
Wire Wire Line
	8750 6850 9750 6850
Wire Wire Line
	8750 6750 9450 6750
Wire Wire Line
	12950 4700 13950 4700
Wire Wire Line
	12950 4600 14250 4600
Wire Wire Line
	12950 4400 14450 4400
Wire Wire Line
	12950 4300 14600 4300
Wire Wire Line
	12950 4200 14900 4200
Wire Wire Line
	12950 4100 14000 4100
Wire Wire Line
	14000 4100 14000 3700
Wire Wire Line
	12950 4000 13900 4000
Wire Wire Line
	13900 4000 13900 3400
NoConn ~ 9450 5050
NoConn ~ 9450 5150
NoConn ~ 9450 7850
NoConn ~ 9450 7950
NoConn ~ 13650 7800
NoConn ~ 13650 7900
NoConn ~ 13650 5100
NoConn ~ 13650 5200
Wire Wire Line
	1900 4550 1300 4550
Text Label 1300 4550 0    50   ~ 0
GTX2_AC_Chip1_N
$Comp
L Device:C C1
U 1 1 609570B6
P 1150 4550
F 0 "C1" V 1050 4450 50  0000 C CNN
F 1 "1n" V 1100 4650 50  0000 C CNN
F 2 "Capacitors_SMD:C_0402_NoSilk" H 1188 4400 50  0001 C CNN
F 3 "~" H 1150 4550 50  0001 C CNN
	1    1150 4550
	0    1    1    0   
$EndComp
Wire Wire Line
	1000 4550 500  4550
Text Label 500  4550 0    50   ~ 0
GTX2_Chip1_N
Wire Wire Line
	1900 4750 1300 4750
Text Label 1300 4750 0    50   ~ 0
GND_C_L
Wire Wire Line
	1900 5150 1300 5150
Text Label 1300 5150 0    50   ~ 0
GTX3_AC_Chip1_N
$Comp
L Device:C C11
U 1 1 60A5112A
P 1150 5150
F 0 "C11" V 1050 5050 50  0000 C CNN
F 1 "1n" V 1100 5250 50  0000 C CNN
F 2 "Capacitors_SMD:C_0402_NoSilk" H 1188 5000 50  0001 C CNN
F 3 "~" H 1150 5150 50  0001 C CNN
	1    1150 5150
	0    1    1    0   
$EndComp
Wire Wire Line
	1000 5150 500  5150
Text Label 500  5150 0    50   ~ 0
GTX3_Chip1_N
Text Label 1300 5350 0    50   ~ 0
GND_C_L
Wire Wire Line
	1900 5550 1300 5550
Text Label 1300 5550 0    50   ~ 0
GTX0_AC_Chip2_N
$Comp
L Device:C C12
U 1 1 60AB12E9
P 1150 5550
F 0 "C12" V 1050 5450 50  0000 C CNN
F 1 "1n" V 1100 5650 50  0000 C CNN
F 2 "Capacitors_SMD:C_0402_NoSilk" H 1188 5400 50  0001 C CNN
F 3 "~" H 1150 5550 50  0001 C CNN
	1    1150 5550
	0    -1   -1   0   
$EndComp
Wire Wire Line
	1000 5550 500  5550
Text Label 500  5550 0    50   ~ 0
GTX0_Chip2_N
Wire Wire Line
	1900 4950 1300 4950
Text Label 1300 4950 0    50   ~ 0
GTX1_AC_Chip2_N
$Comp
L Device:C C4
U 1 1 60ACA03E
P 1150 4950
F 0 "C4" V 1050 4850 50  0000 C CNN
F 1 "1n" V 1100 5050 50  0000 C CNN
F 2 "Capacitors_SMD:C_0402_NoSilk" H 1188 4800 50  0001 C CNN
F 3 "~" H 1150 4950 50  0001 C CNN
	1    1150 4950
	0    1    1    0   
$EndComp
Wire Wire Line
	1000 4950 500  4950
Text Label 500  4950 0    50   ~ 0
GTX1_Chip2_N
Wire Wire Line
	3300 3650 3900 3650
Text Label 3900 3650 2    50   ~ 0
GND_C_R
Wire Wire Line
	1900 4150 1300 4150
Text Label 1300 4150 0    50   ~ 0
LP_EN
Wire Wire Line
	1900 5950 1300 5950
Text Label 1300 5950 0    50   ~ 0
MUX_Chip2
Wire Wire Line
	1900 2550 1300 2550
Text Label 1300 2550 0    50   ~ 0
CMD_P
Wire Wire Line
	1900 5750 1300 5750
Text Label 1300 5750 0    50   ~ 0
LVDS0_Chip1_P
Wire Wire Line
	1900 2750 1300 2750
Text Label 1300 2750 0    50   ~ 0
GND_C_R
Wire Wire Line
	1900 2350 1300 2350
Text Label 1300 2350 0    50   ~ 0
LVDS0_Chip3_P
Wire Wire Line
	1900 4350 1300 4350
Text Label 1300 4350 0    50   ~ 0
CHIP_ID3
Wire Wire Line
	3300 3250 3900 3250
Text Label 3900 3250 2    50   ~ 0
GTX3_AC_Chip3_N
$Comp
L Device:C C5
U 1 1 60D988FC
P 4050 3250
F 0 "C5" V 3950 3150 50  0000 C CNN
F 1 "1n" V 4000 3350 50  0000 C CNN
F 2 "Capacitors_SMD:C_0402_NoSilk" H 4088 3100 50  0001 C CNN
F 3 "~" H 4050 3250 50  0001 C CNN
	1    4050 3250
	0    -1   -1   0   
$EndComp
Wire Wire Line
	4200 3250 4700 3250
Text Label 4700 3250 2    50   ~ 0
GTX3_Chip3_N
Wire Wire Line
	3300 3850 3900 3850
Text Label 3900 3850 2    50   ~ 0
GTX2_AC_Chip3_N
$Comp
L Device:C C15
U 1 1 60E19BF5
P 4050 3850
F 0 "C15" V 3950 3750 50  0000 C CNN
F 1 "1n" V 4000 3950 50  0000 C CNN
F 2 "Capacitors_SMD:C_0402_NoSilk" H 4088 3700 50  0001 C CNN
F 3 "~" H 4050 3850 50  0001 C CNN
	1    4050 3850
	0    -1   -1   0   
$EndComp
Wire Wire Line
	4200 3850 4700 3850
Text Label 4700 3850 2    50   ~ 0
GTX2_Chip3_N
Wire Wire Line
	3300 3050 3900 3050
Text Label 3900 3050 2    50   ~ 0
GND_C_R
Wire Wire Line
	3300 2850 3900 2850
Text Label 3900 2850 2    50   ~ 0
GTX0_AC_Chip4_N
$Comp
L Device:C C16
U 1 1 60E19C05
P 4050 2850
F 0 "C16" V 3950 2750 50  0000 C CNN
F 1 "1n" V 4000 2950 50  0000 C CNN
F 2 "Capacitors_SMD:C_0402_NoSilk" H 4088 2700 50  0001 C CNN
F 3 "~" H 4050 2850 50  0001 C CNN
	1    4050 2850
	0    -1   -1   0   
$EndComp
Wire Wire Line
	4200 2850 4700 2850
Text Label 4700 2850 2    50   ~ 0
GTX0_Chip4_N
Wire Wire Line
	3300 3450 3900 3450
Text Label 3900 3450 2    50   ~ 0
GTX1_AC_Chip4_N
$Comp
L Device:C C8
U 1 1 60E3D7CC
P 4050 3450
F 0 "C8" V 3950 3350 50  0000 C CNN
F 1 "1n" V 4000 3550 50  0000 C CNN
F 2 "Capacitors_SMD:C_0402_NoSilk" H 4088 3300 50  0001 C CNN
F 3 "~" H 4050 3450 50  0001 C CNN
	1    4050 3450
	0    -1   -1   0   
$EndComp
Wire Wire Line
	4200 3450 4700 3450
Text Label 4700 3450 2    50   ~ 0
GTX1_Chip4_N
Wire Wire Line
	1900 2150 1300 2150
Text Label 1300 2150 0    50   ~ 0
MUX_Chip4
$Comp
L Device:C C9
U 1 1 60EAC90C
P 2600 6550
F 0 "C9" V 2348 6550 50  0000 C CNN
F 1 "100n" V 2439 6550 50  0000 C CNN
F 2 "Capacitors_SMD:C_0402_NoSilk" H 2638 6400 50  0001 C CNN
F 3 "~" H 2600 6550 50  0001 C CNN
	1    2600 6550
	0    1    1    0   
$EndComp
Wire Wire Line
	2750 6550 3400 6550
Wire Wire Line
	2450 6550 1750 6550
Text Label 1750 6550 0    50   ~ 0
GND_C_L
Text Label 3400 6550 2    50   ~ 0
GND
Wire Wire Line
	6450 2450 6950 2450
$Comp
L Device:C C20
U 1 1 5F292B49
P 7200 2300
F 0 "C20" V 7150 2150 50  0000 C CNN
F 1 "100n" V 7150 2450 50  0000 C CNN
F 2 "Capacitors_SMD:C_0402_NoSilk" H 7238 2150 50  0001 C CNN
F 3 "~" H 7200 2300 50  0001 C CNN
	1    7200 2300
	0    1    1    0   
$EndComp
$Comp
L Device:C C21
U 1 1 5F2935BB
P 7200 2600
F 0 "C21" V 7150 2450 50  0000 C CNN
F 1 "100n" V 7150 2750 50  0000 C CNN
F 2 "Capacitors_SMD:C_0402_NoSilk" H 7238 2450 50  0001 C CNN
F 3 "~" H 7200 2600 50  0001 C CNN
	1    7200 2600
	0    1    1    0   
$EndComp
$Comp
L Device:C C22
U 1 1 5F293A80
P 7200 2900
F 0 "C22" V 7150 2750 50  0000 C CNN
F 1 "100n" V 7150 3050 50  0000 C CNN
F 2 "Capacitors_SMD:C_0402_NoSilk" H 7238 2750 50  0001 C CNN
F 3 "~" H 7200 2900 50  0001 C CNN
	1    7200 2900
	0    1    1    0   
$EndComp
Wire Wire Line
	6950 2000 7050 2000
Wire Wire Line
	6950 2000 6950 2300
Wire Wire Line
	6950 2300 7050 2300
Connection ~ 6950 2300
Wire Wire Line
	6950 2300 6950 2450
Wire Wire Line
	6950 2600 7050 2600
Connection ~ 6950 2600
Wire Wire Line
	6950 2900 7050 2900
Wire Wire Line
	6950 2600 6950 2900
Wire Wire Line
	7350 2600 8000 2600
Wire Wire Line
	7350 2900 8000 2900
Wire Wire Line
	7350 2300 8000 2300
Wire Wire Line
	7350 2000 8000 2000
Connection ~ 6950 2450
Wire Wire Line
	6950 2450 6950 2600
$Comp
L Device:R R10
U 1 1 5F35D106
P 14150 3550
F 0 "R10" H 14080 3504 50  0000 R CNN
F 1 "100" H 14080 3595 50  0000 R CNN
F 2 "Resistors_SMD:R_0201_NoSilk" V 14080 3550 50  0001 C CNN
F 3 "~" H 14150 3550 50  0001 C CNN
	1    14150 3550
	-1   0    0    1   
$EndComp
Wire Wire Line
	13900 3400 14150 3400
Connection ~ 13900 3400
Wire Wire Line
	13900 3400 13900 3350
Wire Wire Line
	14000 3700 14150 3700
Connection ~ 14000 3700
Wire Wire Line
	14000 3700 14000 3250
$Comp
L Device:R R11
U 1 1 5F3AB74A
P 14300 4100
F 0 "R11" V 14093 4100 50  0000 C CNN
F 1 "100" V 14184 4100 50  0000 C CNN
F 2 "Resistors_SMD:R_0201_NoSilk" V 14230 4100 50  0001 C CNN
F 3 "~" H 14300 4100 50  0001 C CNN
	1    14300 4100
	0    1    1    0   
$EndComp
$Comp
L Device:R R14
U 1 1 5F3AC5DD
P 14750 4100
F 0 "R14" V 14543 4100 50  0000 C CNN
F 1 "100" V 14634 4100 50  0000 C CNN
F 2 "Resistors_SMD:R_0201_NoSilk" V 14680 4100 50  0001 C CNN
F 3 "~" H 14750 4100 50  0001 C CNN
	1    14750 4100
	0    1    1    0   
$EndComp
$Comp
L Device:R R9
U 1 1 5F3ACEAD
P 14100 4850
F 0 "R9" V 14200 4850 50  0000 C CNN
F 1 "100" V 14300 4850 50  0000 C CNN
F 2 "Resistors_SMD:R_0201_NoSilk" V 14030 4850 50  0001 C CNN
F 3 "~" H 14100 4850 50  0001 C CNN
	1    14100 4850
	0    1    1    0   
$EndComp
$Comp
L Device:R R2
U 1 1 5F3AD70F
P 9600 6650
F 0 "R2" V 9393 6650 50  0000 C CNN
F 1 "100" V 9484 6650 50  0000 C CNN
F 2 "Resistors_SMD:R_0201_NoSilk" V 9530 6650 50  0001 C CNN
F 3 "~" H 9600 6650 50  0001 C CNN
	1    9600 6650
	0    1    1    0   
$EndComp
$Comp
L Device:R R3
U 1 1 5F3ADD70
P 9750 7150
F 0 "R3" V 9850 7100 50  0000 C CNN
F 1 "100" V 9700 7400 50  0000 C CNN
F 2 "Resistors_SMD:R_0201_NoSilk" V 9680 7150 50  0001 C CNN
F 3 "~" H 9750 7150 50  0001 C CNN
	1    9750 7150
	0    1    1    0   
$EndComp
Wire Wire Line
	14900 4100 14900 4200
Connection ~ 14900 4200
Wire Wire Line
	14900 4200 15050 4200
Wire Wire Line
	14600 4100 14600 4300
Connection ~ 14600 4300
Wire Wire Line
	14450 4100 14450 4400
Connection ~ 14450 4400
Wire Wire Line
	14450 4400 14850 4400
Wire Wire Line
	14150 4100 14150 4500
Wire Wire Line
	12950 4500 14150 4500
Connection ~ 14150 4500
Wire Wire Line
	14150 4500 14750 4500
Wire Wire Line
	14250 4850 14250 4600
Connection ~ 14250 4600
Wire Wire Line
	14250 4600 14650 4600
Wire Wire Line
	13950 4850 13950 4700
Connection ~ 13950 4700
Wire Wire Line
	13950 4700 14550 4700
Connection ~ 9450 6750
Connection ~ 9750 6850
Wire Wire Line
	9600 7150 9600 6950
Connection ~ 9600 6950
Wire Wire Line
	9900 7150 9900 7050
Connection ~ 9900 7050
Wire Wire Line
	9750 6650 9750 6850
Wire Wire Line
	9450 6650 9450 6750
Text Notes 14400 3600 0    50   ~ 0
Do not load \nfor ITkPixV1
Text Notes 14300 3850 0    50   ~ 0
Do not load \nfor ITkPixV1
Text Notes 13900 5250 0    50   ~ 0
Do not load \nfor ITkPixV1
Text Notes 9050 6550 0    50   ~ 0
Do not load \nfor ITkPixV1
Text Notes 9850 7300 0    50   ~ 0
Do not load \nfor ITkPixV1
Text Notes 10000 6550 0    50   ~ 0
0.5/0.25 option\n
Text Label 1250 9300 0    50   ~ 0
VIN
Wire Wire Line
	2050 9300 1250 9300
Text Label 12300 1350 0    50   ~ 0
VOFS_LP_Chip1
$Comp
L Device:R R5
U 1 1 60D639EE
P 13150 1200
F 0 "R5" H 13220 1246 50  0000 L CNN
F 1 "24.9k" H 13220 1155 50  0000 L CNN
F 2 "Resistors_SMD:R_0402_NoSilk" V 13080 1200 50  0001 C CNN
F 3 "~" H 13150 1200 50  0001 C CNN
	1    13150 1200
	-1   0    0    1   
$EndComp
$Comp
L Device:R R7
U 1 1 60D639F4
P 13400 1050
F 0 "R7" H 13300 1100 50  0000 C CNN
F 1 "10k" H 13300 1000 50  0000 C CNN
F 2 "Resistors_SMD:R_0402_NoSilk" V 13330 1050 50  0001 C CNN
F 3 "~" H 13400 1050 50  0001 C CNN
	1    13400 1050
	0    1    1    0   
$EndComp
Text Label 12300 1050 0    50   ~ 0
VOFS_OUT_Chip1
Text Label 12300 1600 0    50   ~ 0
VOFS_IN_Chip1
Wire Wire Line
	12300 1600 13600 1600
Text Label 12300 2300 0    50   ~ 0
VOFS_LP_Chip2
$Comp
L Device:R R6
U 1 1 60D639FE
P 13150 2150
F 0 "R6" H 13220 2196 50  0000 L CNN
F 1 "24.9k" H 13220 2105 50  0000 L CNN
F 2 "Resistors_SMD:R_0402_NoSilk" V 13080 2150 50  0001 C CNN
F 3 "~" H 13150 2150 50  0001 C CNN
	1    13150 2150
	-1   0    0    1   
$EndComp
$Comp
L Device:R R8
U 1 1 60D63A04
P 13400 2000
F 0 "R8" H 13300 2050 50  0000 C CNN
F 1 "10k" H 13300 1950 50  0000 C CNN
F 2 "Resistors_SMD:R_0402_NoSilk" V 13330 2000 50  0001 C CNN
F 3 "~" H 13400 2000 50  0001 C CNN
	1    13400 2000
	0    1    1    0   
$EndComp
Text Label 12300 2000 0    50   ~ 0
VOFS_OUT_Chip2
Text Label 12300 2550 0    50   ~ 0
VOFS_IN_Chip2
Wire Wire Line
	12300 2550 13600 2550
Text Label 15800 2250 2    50   ~ 0
VOFS_LP_Chip3
$Comp
L Device:R R16
U 1 1 60D63A0E
P 14950 2400
F 0 "R16" H 15020 2446 50  0000 L CNN
F 1 "24.9k" H 15020 2355 50  0000 L CNN
F 2 "Resistors_SMD:R_0402_NoSilk" V 14880 2400 50  0001 C CNN
F 3 "~" H 14950 2400 50  0001 C CNN
	1    14950 2400
	1    0    0    -1  
$EndComp
$Comp
L Device:R R13
U 1 1 60D63A14
P 14700 2550
F 0 "R13" H 14600 2600 50  0000 C CNN
F 1 "10k" H 14600 2500 50  0000 C CNN
F 2 "Resistors_SMD:R_0402_NoSilk" V 14630 2550 50  0001 C CNN
F 3 "~" H 14700 2550 50  0001 C CNN
	1    14700 2550
	0    -1   -1   0   
$EndComp
Text Label 15800 2550 2    50   ~ 0
VOFS_OUT_Chip3
Text Label 15800 2000 2    50   ~ 0
VOFS_IN_Chip3
Wire Wire Line
	15800 2000 14500 2000
Text Label 15800 1300 2    50   ~ 0
VOFS_LP_Chip4
$Comp
L Device:R R15
U 1 1 60D63A1E
P 14950 1450
F 0 "R15" H 15020 1496 50  0000 L CNN
F 1 "24.9k" H 15020 1405 50  0000 L CNN
F 2 "Resistors_SMD:R_0402_NoSilk" V 14880 1450 50  0001 C CNN
F 3 "~" H 14950 1450 50  0001 C CNN
	1    14950 1450
	1    0    0    -1  
$EndComp
$Comp
L Device:R R12
U 1 1 60D63A24
P 14700 1600
F 0 "R12" H 14600 1650 50  0000 C CNN
F 1 "10k" H 14600 1550 50  0000 C CNN
F 2 "Resistors_SMD:R_0402_NoSilk" V 14630 1600 50  0001 C CNN
F 3 "~" H 14700 1600 50  0001 C CNN
	1    14700 1600
	0    -1   -1   0   
$EndComp
Text Label 15800 1600 2    50   ~ 0
VOFS_OUT_Chip4
Text Label 15800 1050 2    50   ~ 0
VOFS_IN_Chip4
Wire Wire Line
	15800 1050 14500 1050
Connection ~ 13600 1600
Connection ~ 14500 2000
Text Label 13850 2550 0    50   ~ 0
VOFS_Half
Wire Wire Line
	13600 2550 14500 2550
Connection ~ 13600 2550
Text Notes 11900 1500 0    50   ~ 0
10k to \nGND_REFA\n\n
Text Notes 11900 2450 0    50   ~ 0
10k to \nGND_REFA\n\n
Text Notes 15850 1450 0    50   ~ 0
10k to \nGND_REFA\n\n
Text Notes 15850 2400 0    50   ~ 0
10k to \nGND_REFA\n\n
Wire Wire Line
	13600 1050 13600 1600
Wire Wire Line
	12300 1050 13150 1050
Wire Wire Line
	12300 1350 13150 1350
Wire Wire Line
	13150 1050 13250 1050
Connection ~ 13150 1050
Wire Wire Line
	13550 1050 13600 1050
Wire Wire Line
	13600 1600 13600 2000
Wire Wire Line
	12300 2000 13150 2000
Connection ~ 13150 2000
Wire Wire Line
	13150 2000 13250 2000
Wire Wire Line
	13550 2000 13600 2000
Connection ~ 13600 2000
Wire Wire Line
	13600 2000 13600 2550
Wire Wire Line
	12300 2300 13150 2300
Wire Wire Line
	14500 2000 14500 2550
Wire Wire Line
	14950 2250 15800 2250
Wire Wire Line
	14850 2550 14950 2550
Connection ~ 14950 2550
Wire Wire Line
	14950 2550 15800 2550
Wire Wire Line
	14550 2550 14500 2550
Connection ~ 14500 2550
Wire Wire Line
	14500 1050 14500 1600
Wire Wire Line
	14850 1600 14950 1600
Connection ~ 14950 1600
Wire Wire Line
	14950 1600 15800 1600
Wire Wire Line
	14950 1300 15800 1300
Wire Wire Line
	14550 1600 14500 1600
Connection ~ 14500 1600
Wire Wire Line
	14500 1600 14500 2000
$Comp
L FTM-108-02-L-DV:FTM-108-02-L-DV J1
U 1 1 5FCE4F0F
P 2550 8900
F 0 "J1" H 2550 9467 50  0000 C CNN
F 1 "FTM-108-02-L-DV" H 2550 9376 50  0000 C CNN
F 2 "Library:SAMTEC_FTM-108-02-L-DV" H 2550 8900 50  0001 L BNN
F 3 "E" H 2550 8900 50  0001 L BNN
F 4 "Manufacturer Recommendations" H 2550 8900 50  0001 L BNN "Field4"
F 5 "SAMTEC" H 2550 8900 50  0001 L BNN "Field5"
	1    2550 8900
	1    0    0    -1  
$EndComp
Text Label 9450 6950 2    50   ~ 0
DATA_IN1_Chip2_N
Text Label 9450 6850 2    50   ~ 0
DATA_IN0_Chip2_P
Text Label 9450 6750 2    50   ~ 0
DATA_IN0_Chip2_N
Text Label 6300 7650 0    50   ~ 0
GTX3_Chip2_P
Text Label 6300 7550 0    50   ~ 0
GTX3_Chip2_N
Text Label 6300 7450 0    50   ~ 0
GTX2_Chip2_P
Text Label 6300 7350 0    50   ~ 0
GTX2_Chip2_N
Text Label 9450 5050 2    50   ~ 0
LVDS1_Chip1_P
Text Label 9450 5150 2    50   ~ 0
LVDS1_Chip1_N
Text Label 6300 4500 0    50   ~ 0
GTX1_Chip1_P
Text Label 6300 4400 0    50   ~ 0
GTX1_Chip1_N
Text Label 6300 6650 0    50   ~ 0
CMD_Chip2_P
Text Label 6300 6750 0    50   ~ 0
CMD_Chip2_N
Text Label 6300 6950 0    50   ~ 0
GTX0_Chip2_N
Text Label 6300 7050 0    50   ~ 0
GTX0_Chip2_P
Text Label 6300 7150 0    50   ~ 0
GTX1_Chip2_N
Text Label 6300 7250 0    50   ~ 0
GTX1_Chip2_P
Wire Wire Line
	6300 4700 6850 4700
Text Label 13650 4700 2    50   ~ 0
DATA_IN0_Chip4_P
Text Label 13650 4600 2    50   ~ 0
DATA_IN0_Chip4_N
Wire Wire Line
	8750 5350 9450 5350
Wire Wire Line
	8750 5450 9450 5450
Text Label 9450 5350 2    50   ~ 0
CHIP_ID2
Text Label 9450 5450 2    50   ~ 0
CHIP_ID3
Wire Wire Line
	12950 8100 13650 8100
Wire Wire Line
	12950 8200 13650 8200
Text Label 13650 8100 2    50   ~ 0
CHIP_ID2
Text Label 13650 8200 2    50   ~ 0
CHIP_ID3
NoConn ~ 9450 7650
NoConn ~ 9450 7750
NoConn ~ 13650 4900
NoConn ~ 13650 5000
Wire Wire Line
	6300 4600 6850 4600
Wire Wire Line
	9600 6950 11050 6950
Wire Wire Line
	9900 7050 11050 7050
Wire Wire Line
	10350 7250 10350 6850
Wire Wire Line
	10350 7250 11050 7250
Wire Wire Line
	9750 6850 10200 6850
Wire Wire Line
	10450 7150 10450 6750
Wire Wire Line
	10450 7150 11050 7150
Wire Wire Line
	9450 6750 10300 6750
Wire Wire Line
	6150 4200 6150 3350
Wire Wire Line
	6150 3350 13900 3350
Wire Wire Line
	6150 4200 6850 4200
Wire Wire Line
	6050 4300 6050 3250
Wire Wire Line
	6050 3250 14000 3250
Wire Wire Line
	6050 4300 6850 4300
Wire Wire Line
	5950 3150 15050 3150
Wire Wire Line
	15050 3150 15050 4200
Wire Wire Line
	5950 4400 6850 4400
Wire Wire Line
	15150 4300 15150 3050
Wire Wire Line
	14600 4300 15150 4300
Wire Wire Line
	5850 3050 5850 4500
Wire Wire Line
	5850 3050 15150 3050
Wire Wire Line
	5950 7350 5950 9200
Wire Wire Line
	5950 9200 14850 9200
Wire Wire Line
	14850 9200 14850 4400
Wire Wire Line
	6050 7450 6050 9100
Wire Wire Line
	14750 9100 14750 4500
Wire Wire Line
	6050 9100 14750 9100
Wire Wire Line
	10300 6750 10300 6350
Wire Wire Line
	10300 6350 14650 6350
Wire Wire Line
	14650 6350 14650 4600
Connection ~ 10300 6750
Wire Wire Line
	10300 6750 10450 6750
Wire Wire Line
	10200 6850 10200 6250
Wire Wire Line
	10200 6250 14550 6250
Wire Wire Line
	14550 6250 14550 4700
Connection ~ 10200 6850
Wire Wire Line
	10200 6850 10350 6850
Wire Wire Line
	1900 5350 1300 5350
Wire Wire Line
	5850 4500 6850 4500
Wire Wire Line
	5950 4400 5950 3150
Text Label 3900 2250 2    50   ~ 0
LVDS0_Chip3_N
Wire Wire Line
	3300 2250 3900 2250
Wire Wire Line
	3300 4650 3900 4650
Text Label 3900 4650 2    50   ~ 0
GTX2_AC_Chip1_P
$Comp
L Device:C C10
U 1 1 60A23ED8
P 4050 4650
F 0 "C10" V 3950 4550 50  0000 C CNN
F 1 "1n" V 4000 4750 50  0000 C CNN
F 2 "Capacitors_SMD:C_0402_NoSilk" H 4088 4500 50  0001 C CNN
F 3 "~" H 4050 4650 50  0001 C CNN
	1    4050 4650
	0    -1   -1   0   
$EndComp
Wire Wire Line
	4200 4650 4700 4650
Text Label 4700 4650 2    50   ~ 0
GTX2_Chip1_P
Text Label 3900 5250 2    50   ~ 0
GTX3_AC_Chip1_P
$Comp
L Device:C C2
U 1 1 60A6817B
P 4050 5250
F 0 "C2" V 3950 5150 50  0000 C CNN
F 1 "1n" V 4000 5350 50  0000 C CNN
F 2 "Capacitors_SMD:C_0402_NoSilk" H 4088 5100 50  0001 C CNN
F 3 "~" H 4050 5250 50  0001 C CNN
	1    4050 5250
	0    -1   -1   0   
$EndComp
Wire Wire Line
	4200 5250 4700 5250
Text Label 4700 5250 2    50   ~ 0
GTX3_Chip1_P
Text Label 3900 5450 2    50   ~ 0
GTX0_AC_Chip2_P
$Comp
L Device:C C3
U 1 1 60A98CA3
P 4050 5450
F 0 "C3" V 3950 5350 50  0000 C CNN
F 1 "1n" V 4000 5550 50  0000 C CNN
F 2 "Capacitors_SMD:C_0402_NoSilk" H 4088 5300 50  0001 C CNN
F 3 "~" H 4050 5450 50  0001 C CNN
	1    4050 5450
	0    1    1    0   
$EndComp
Wire Wire Line
	4200 5450 4700 5450
Text Label 4700 5450 2    50   ~ 0
GTX0_Chip2_P
Wire Wire Line
	3300 4850 3900 4850
Text Label 3900 4850 2    50   ~ 0
GTX1_AC_Chip2_P
$Comp
L Device:C C13
U 1 1 60AE3670
P 4050 4850
F 0 "C13" V 3950 4750 50  0000 C CNN
F 1 "1n" V 4000 4950 50  0000 C CNN
F 2 "Capacitors_SMD:C_0402_NoSilk" H 4088 4700 50  0001 C CNN
F 3 "~" H 4050 4850 50  0001 C CNN
	1    4050 4850
	0    -1   -1   0   
$EndComp
Wire Wire Line
	4200 4850 4700 4850
Text Label 4700 4850 2    50   ~ 0
GTX1_Chip2_P
Wire Wire Line
	3300 4050 3900 4050
Text Label 3900 4050 2    50   ~ 0
MUX_Chip1
Wire Wire Line
	3300 5050 3900 5050
Text Label 3900 5050 2    50   ~ 0
GND_C_L
Wire Wire Line
	3300 5650 3900 5650
Text Label 3900 5650 2    50   ~ 0
GND_C_L
Wire Wire Line
	3300 5850 3900 5850
Text Label 3900 5850 2    50   ~ 0
LVDS0_Chip1_N
Wire Wire Line
	3300 4450 3900 4450
Text Label 3900 4450 2    50   ~ 0
GND
Wire Wire Line
	3300 4250 3900 4250
Text Label 3900 4250 2    50   ~ 0
CHIP_ID2
Wire Wire Line
	1900 3750 1300 3750
Text Label 1300 3750 0    50   ~ 0
GTX2_AC_Chip3_P
$Comp
L Device:C C6
U 1 1 60DF82FA
P 1150 3750
F 0 "C6" V 1050 3650 50  0000 C CNN
F 1 "1n" V 1100 3850 50  0000 C CNN
F 2 "Capacitors_SMD:C_0402_NoSilk" H 1188 3600 50  0001 C CNN
F 3 "~" H 1150 3750 50  0001 C CNN
	1    1150 3750
	0    1    1    0   
$EndComp
Wire Wire Line
	1000 3750 500  3750
Text Label 500  3750 0    50   ~ 0
GTX2_Chip3_P
Wire Wire Line
	1900 3550 1300 3550
Text Label 1300 3550 0    50   ~ 0
GTX1_AC_Chip4_P
$Comp
L Device:C C17
U 1 1 60E8647C
P 1150 3550
F 0 "C17" V 1050 3450 50  0000 C CNN
F 1 "1n" V 1100 3650 50  0000 C CNN
F 2 "Capacitors_SMD:C_0402_NoSilk" H 1188 3400 50  0001 C CNN
F 3 "~" H 1150 3550 50  0001 C CNN
	1    1150 3550
	0    1    1    0   
$EndComp
Wire Wire Line
	1000 3550 500  3550
Text Label 500  3550 0    50   ~ 0
GTX1_Chip4_P
Wire Wire Line
	1900 3350 1300 3350
Text Label 1300 3350 0    50   ~ 0
GND_C_R
Wire Wire Line
	3300 5250 3900 5250
Wire Wire Line
	1900 3150 1300 3150
Text Label 1300 3150 0    50   ~ 0
GTX3_AC_Chip3_P
$Comp
L Device:C C14
U 1 1 60DB83CD
P 1150 3150
F 0 "C14" V 1050 3050 50  0000 C CNN
F 1 "1n" V 1100 3250 50  0000 C CNN
F 2 "Capacitors_SMD:C_0402_NoSilk" H 1188 3000 50  0001 C CNN
F 3 "~" H 1150 3150 50  0001 C CNN
	1    1150 3150
	0    1    1    0   
$EndComp
Wire Wire Line
	1000 3150 500  3150
Text Label 500  3150 0    50   ~ 0
GTX3_Chip3_P
Wire Wire Line
	3300 5450 3900 5450
Wire Wire Line
	1900 2950 1300 2950
Text Label 1300 2950 0    50   ~ 0
GTX0_AC_Chip4_P
$Comp
L Device:C C7
U 1 1 60E3D7BE
P 1150 2950
F 0 "C7" V 1050 2850 50  0000 C CNN
F 1 "1n" V 1100 3050 50  0000 C CNN
F 2 "Capacitors_SMD:C_0402_NoSilk" H 1188 2800 50  0001 C CNN
F 3 "~" H 1150 2950 50  0001 C CNN
	1    1150 2950
	0    1    1    0   
$EndComp
Wire Wire Line
	1000 2950 500  2950
Text Label 500  2950 0    50   ~ 0
GTX0_Chip4_P
Text Label 3900 2450 2    50   ~ 0
GND_C_R
Wire Wire Line
	3300 2450 3900 2450
Text Label 3900 2650 2    50   ~ 0
CMD_N
Wire Wire Line
	3300 2650 3900 2650
Text Label 1300 3950 0    50   ~ 0
MUX_Chip3
Wire Wire Line
	1900 3950 1300 3950
$Comp
L Device:C C107
U 1 1 617A0A94
P 2600 7000
F 0 "C107" V 2348 7000 50  0000 C CNN
F 1 "100n" V 2439 7000 50  0000 C CNN
F 2 "Capacitors_SMD:C_0402_NoSilk" H 2638 6850 50  0001 C CNN
F 3 "~" H 2600 7000 50  0001 C CNN
	1    2600 7000
	0    1    1    0   
$EndComp
Wire Wire Line
	2750 7000 3400 7000
Wire Wire Line
	2450 7000 1750 7000
Text Label 1750 7000 0    50   ~ 0
GND_C_R
Text Label 3400 7000 2    50   ~ 0
GND
$Sheet
S 6850 3800 1900 1900
U 5F0F427A
F0 "RD53B_Chip1" 50
F1 "rd53b_chip1.sch" 50
F2 "CMD_P" I L 6850 3900 50 
F3 "CMD_N" I L 6850 4000 50 
F4 "MUX" I L 6850 5300 50 
F5 "VIN" I L 6850 5100 50 
F6 "LP_EN" I L 6850 5200 50 
F7 "GTX0_N" I L 6850 4200 50 
F8 "GTX0_P" I L 6850 4300 50 
F9 "GTX1_N" I L 6850 4400 50 
F10 "GTX1_P" I L 6850 4500 50 
F11 "GTX2_N" I L 6850 4600 50 
F12 "GTX2_P" I L 6850 4700 50 
F13 "GTX3_N" I L 6850 4800 50 
F14 "GTX3_P" I L 6850 4900 50 
F15 "DATA_IN0_P" I R 8750 3950 50 
F16 "DATA_IN0_N" I R 8750 4050 50 
F17 "DATA_IN1_P" I R 8750 4150 50 
F18 "DATA_IN2_P" I R 8750 4350 50 
F19 "DATA_IN3_P" I R 8750 4550 50 
F20 "DATA_IN1_N" I R 8750 4250 50 
F21 "DATA_IN2_N" I R 8750 4450 50 
F22 "DATA_IN3_N" I R 8750 4650 50 
F23 "LVDS0_P" I R 8750 4850 50 
F24 "LVDS1_P" I R 8750 5050 50 
F25 "LVDS0_N" I R 8750 4950 50 
F26 "LVDS1_N" I R 8750 5150 50 
F27 "VOFS_LP" I L 6850 5400 50 
F28 "VOFS_IN" I L 6850 5500 50 
F29 "VOFS_OUT" I L 6850 5600 50 
F30 "CHIP_ID2" I R 8750 5350 50 
F31 "CHIP_ID3" I R 8750 5450 50 
$EndSheet
$Sheet
S 11050 3850 1900 1900
U 5F0F439D
F0 "RD53B_Chip4" 50
F1 "rd53b_chip4.sch" 50
F2 "CMD_P" I L 11050 3950 50 
F3 "CMD_N" I L 11050 4050 50 
F4 "MUX" I L 11050 5350 50 
F5 "VIN" I L 11050 5150 50 
F6 "LP_EN" I L 11050 5250 50 
F7 "GTX0_N" I L 11050 4250 50 
F8 "GTX0_P" I L 11050 4350 50 
F9 "GTX1_N" I L 11050 4450 50 
F10 "GTX1_P" I L 11050 4550 50 
F11 "GTX2_N" I L 11050 4650 50 
F12 "GTX2_P" I L 11050 4750 50 
F13 "GTX3_N" I L 11050 4850 50 
F14 "GTX3_P" I L 11050 4950 50 
F15 "DATA_IN0_P" I R 12950 4700 50 
F16 "DATA_IN0_N" I R 12950 4600 50 
F17 "DATA_IN1_P" I R 12950 4500 50 
F18 "DATA_IN2_P" I R 12950 4300 50 
F19 "DATA_IN3_P" I R 12950 4100 50 
F20 "DATA_IN1_N" I R 12950 4400 50 
F21 "DATA_IN2_N" I R 12950 4200 50 
F22 "DATA_IN3_N" I R 12950 4000 50 
F23 "LVDS0_P" I R 12950 4900 50 
F24 "LVDS1_P" I R 12950 5100 50 
F25 "LVDS0_N" I R 12950 5000 50 
F26 "LVDS1_N" I R 12950 5200 50 
F27 "VOFS_LP" I L 11050 5450 50 
F28 "VOFS_IN" I L 11050 5550 50 
F29 "VOFS_OUT" I L 11050 5650 50 
F30 "CHIP_ID2" I R 12950 5400 50 
F31 "CHIP_ID3" I R 12950 5500 50 
$EndSheet
$Sheet
S 6850 6550 1900 1900
U 5F0F4300
F0 "RD53B_Chip2" 50
F1 "rd53b_chip2.sch" 50
F2 "CMD_P" I L 6850 6650 50 
F3 "CMD_N" I L 6850 6750 50 
F4 "MUX" I L 6850 8050 50 
F5 "VIN" I L 6850 7850 50 
F6 "LP_EN" I L 6850 7950 50 
F7 "GTX0_N" I L 6850 6950 50 
F8 "GTX0_P" I L 6850 7050 50 
F9 "GTX1_N" I L 6850 7150 50 
F10 "GTX1_P" I L 6850 7250 50 
F11 "GTX2_N" I L 6850 7350 50 
F12 "GTX2_P" I L 6850 7450 50 
F13 "GTX3_N" I L 6850 7550 50 
F14 "GTX3_P" I L 6850 7650 50 
F15 "DATA_IN0_P" I R 8750 6850 50 
F16 "DATA_IN0_N" I R 8750 6750 50 
F17 "DATA_IN1_P" I R 8750 7050 50 
F18 "DATA_IN2_P" I R 8750 7250 50 
F19 "DATA_IN3_P" I R 8750 7450 50 
F20 "DATA_IN1_N" I R 8750 6950 50 
F21 "DATA_IN2_N" I R 8750 7150 50 
F22 "DATA_IN3_N" I R 8750 7350 50 
F23 "LVDS0_P" I R 8750 7650 50 
F24 "LVDS1_P" I R 8750 7850 50 
F25 "LVDS0_N" I R 8750 7750 50 
F26 "LVDS1_N" I R 8750 7950 50 
F27 "VOFS_LP" I L 6850 8150 50 
F28 "VOFS_IN" I L 6850 8250 50 
F29 "VOFS_OUT" I L 6850 8350 50 
F30 "CHIP_ID2" I R 8750 8150 50 
F31 "CHIP_ID3" I R 8750 8250 50 
$EndSheet
$Sheet
S 11050 6550 1900 1900
U 5F0F435C
F0 "RD53B_Chip3" 50
F1 "rd53b_chip3.sch" 50
F2 "CMD_P" I L 11050 6650 50 
F3 "CMD_N" I L 11050 6750 50 
F4 "MUX" I L 11050 8050 50 
F5 "VIN" I L 11050 7850 50 
F6 "LP_EN" I L 11050 7950 50 
F7 "GTX0_N" I L 11050 6950 50 
F8 "GTX0_P" I L 11050 7050 50 
F9 "GTX1_N" I L 11050 7150 50 
F10 "GTX1_P" I L 11050 7250 50 
F11 "GTX2_N" I L 11050 7350 50 
F12 "GTX2_P" I L 11050 7450 50 
F13 "GTX3_N" I L 11050 7550 50 
F14 "GTX3_P" I L 11050 7650 50 
F15 "DATA_IN0_P" I R 12950 6700 50 
F16 "DATA_IN0_N" I R 12950 6800 50 
F17 "DATA_IN1_P" I R 12950 6900 50 
F18 "DATA_IN2_P" I R 12950 7100 50 
F19 "DATA_IN3_P" I R 12950 7300 50 
F20 "DATA_IN1_N" I R 12950 7000 50 
F21 "DATA_IN2_N" I R 12950 7200 50 
F22 "DATA_IN3_N" I R 12950 7400 50 
F23 "LVDS0_P" I R 12950 7600 50 
F24 "LVDS1_P" I R 12950 7800 50 
F25 "LVDS0_N" I R 12950 7700 50 
F26 "LVDS1_N" I R 12950 7900 50 
F27 "VOFS_LP" I L 11050 8150 50 
F28 "VOFS_IN" I L 11050 8250 50 
F29 "VOFS_OUT" I L 11050 8350 50 
F30 "CHIP_ID2" I R 12950 8100 50 
F31 "CHIP_ID3" I R 12950 8200 50 
$EndSheet
$EndSCHEMATC
