M48
; DRILL file {KiCad (5.1.6-0)} date Friday, October 23, 2020 at 04:21:31 PM
; FORMAT={-:-/ absolute / metric / decimal}
; #@! TF.CreationDate,2020-10-23T16:21:31-07:00
; #@! TF.GenerationSoftware,Kicad,Pcbnew,(5.1.6-0)
; #@! TF.FileFunction,Plated,1,4,PTH
FMAT,2
METRIC
T1C0.200
T2C1.143
%
G90
G05
T1
X91.206Y-71.694
X91.306Y-51.394
X91.594Y-71.306
X91.6Y-44.2
X91.6Y-44.8
X91.6Y-45.4
X91.6Y-48.8
X91.6Y-49.4
X91.6Y-50.0
X91.6Y-74.4
X91.6Y-75.0
X91.6Y-75.6
X91.6Y-79.3
X91.6Y-79.9
X91.6Y-80.5
X91.694Y-51.006
X91.7Y-54.7
X91.7Y-55.3
X91.7Y-55.9
X91.7Y-59.4
X91.7Y-60.0
X91.7Y-60.6
X91.7Y-64.4
X91.7Y-65.0
X91.7Y-65.6
X91.7Y-69.1
X91.7Y-69.7
X91.7Y-70.3
X93.1Y-66.4
X93.15Y-46.15
X93.2Y-44.8
X93.2Y-49.5
X93.2Y-55.3
X93.2Y-60.0
X93.2Y-65.0
X93.2Y-69.8
X93.2Y-75.0
X93.2Y-79.9
X93.4Y-74.0
X93.5Y-81.1
X93.65Y-45.85
X93.65Y-46.35
X93.65Y-66.6
X93.7Y-44.8
X93.7Y-49.5
X93.7Y-55.3
X93.7Y-60.0
X93.7Y-65.0
X93.7Y-69.8
X93.7Y-75.0
X93.7Y-79.9
X93.75Y-66.1
X94.8Y-61.9
X94.8Y-62.6
X96.0Y-62.6
X96.0Y-81.4
X96.1Y-45.6
X96.1Y-46.4
X96.1Y-68.9
X96.2Y-48.7
X96.2Y-51.225
X96.2Y-51.775
X96.2Y-54.5
X96.2Y-56.1
X96.2Y-59.2
X96.2Y-61.0
X96.2Y-64.3
X96.2Y-65.9
X96.2Y-66.7
X96.2Y-71.425
X96.2Y-71.975
X96.2Y-74.1
X96.2Y-75.8
X96.2Y-79.1
X96.2Y-80.7
X96.3Y-44.0
X96.7Y-50.3
X96.7Y-54.5
X96.7Y-60.8
X96.7Y-64.3
X96.7Y-74.1
X96.8Y-44.0
X96.8Y-80.7
X96.9Y-81.2
X97.2Y-50.3
X97.2Y-70.7
X97.4Y-71.4
X97.6Y-51.4
X97.8Y-69.8
X98.2Y-49.6
X98.5Y-80.1
X98.5Y-80.7
X98.5Y-81.3
X99.2Y-76.1
X99.3Y-46.9
X99.3Y-57.7
X99.3Y-66.8
X100.8Y-53.6
X100.8Y-62.8
X100.9Y-71.6
X101.0Y-68.7
X102.2Y-48.0
X103.5Y-47.5
X103.75Y-81.5
X103.8Y-46.5
X105.1Y-42.8
X105.25Y-66.7
X105.9Y-59.3
X106.1Y-65.5
X106.3Y-73.0
X106.3Y-73.8
X106.4Y-71.1
X106.6Y-73.4
X106.9Y-73.0
X106.9Y-73.8
X107.0Y-66.5
X107.0Y-70.0
X107.1Y-69.5
X107.1Y-74.3
X107.1Y-74.8
X107.2Y-73.4
X107.5Y-73.0
X107.5Y-73.8
X107.6Y-69.0
X107.8Y-65.6
X107.8Y-73.4
X108.1Y-73.0
X108.1Y-73.8
X108.1Y-74.3
X108.1Y-74.8
X108.4Y-73.4
X108.7Y-73.0
X108.7Y-73.8
X109.0Y-73.4
X109.1Y-74.3
X109.1Y-74.8
X109.3Y-73.0
X109.3Y-73.8
X109.6Y-73.4
X109.9Y-73.0
X109.9Y-73.8
X110.1Y-47.4
X110.6Y-73.7
X110.6Y-81.5
X112.3Y-66.5
X112.4Y-65.4
X113.2Y-66.5
X114.0Y-71.8
X114.3Y-59.3
X114.5Y-74.4
X114.5Y-75.0
X114.5Y-75.6
X114.5Y-76.2
X114.5Y-76.8
X114.5Y-77.4
X114.5Y-78.0
X114.5Y-78.6
X114.5Y-79.2
X114.5Y-79.8
X114.8Y-66.6
X114.9Y-74.7
X114.9Y-75.3
X114.9Y-75.9
X114.9Y-76.5
X114.9Y-77.1
X114.9Y-77.7
X114.9Y-78.3
X114.9Y-78.9
X114.9Y-79.5
X115.3Y-75.0
X115.3Y-75.6
X115.3Y-76.2
X115.3Y-76.8
X115.3Y-77.4
X115.3Y-78.0
X115.3Y-78.6
X115.3Y-79.2
X115.3Y-79.8
X115.7Y-81.5
X116.2Y-74.4
X117.0Y-46.9
X118.0Y-49.3
X118.2Y-76.6
X118.3Y-48.8
X118.8Y-56.2
X119.0Y-55.3
X119.0Y-68.7
X119.8Y-47.1
X119.8Y-53.7
X120.0Y-70.8
X120.8Y-57.6
X120.8Y-77.3
X120.9Y-66.6
X121.0Y-42.8
X121.8Y-55.5
X121.8Y-70.4
X121.8Y-75.0
X122.5Y-50.0
X123.0Y-50.4
X123.4Y-43.2
X123.4Y-50.1
X123.4Y-53.7
X123.4Y-60.0
X123.5Y-69.8
X123.5Y-74.0
X123.5Y-80.3
X123.6Y-63.5
X123.8Y-52.225
X123.8Y-52.775
X123.9Y-63.0
X124.0Y-43.2
X124.0Y-44.8
X124.0Y-48.5
X124.0Y-50.1
X124.0Y-53.7
X124.0Y-57.6
X124.0Y-58.4
X124.0Y-60.0
X124.0Y-65.1
X124.0Y-68.2
X124.0Y-69.8
X124.0Y-78.7
X124.0Y-80.3
X124.1Y-55.4
X124.1Y-72.525
X124.1Y-73.075
X124.1Y-74.0
X124.1Y-75.6
X124.1Y-77.9
X125.6Y-62.6
X125.7Y-61.8
X126.45Y-57.7
X126.45Y-58.2
X126.45Y-78.45
X126.5Y-44.0
X126.5Y-49.2
X126.5Y-54.6
X126.5Y-59.2
X126.5Y-64.3
X126.5Y-69.0
X126.5Y-74.8
X126.5Y-79.5
X126.65Y-77.95
X127.0Y-44.0
X127.0Y-49.2
X127.0Y-54.6
X127.0Y-59.2
X127.0Y-64.3
X127.0Y-69.0
X127.0Y-74.8
X127.0Y-79.5
X127.15Y-57.9
X127.2Y-78.15
X128.306Y-52.994
X128.4Y-68.4
X128.4Y-69.0
X128.4Y-69.6
X128.5Y-54.0
X128.5Y-54.6
X128.5Y-55.2
X128.5Y-58.7
X128.5Y-59.3
X128.5Y-59.9
X128.5Y-63.7
X128.5Y-64.3
X128.5Y-64.9
X128.6Y-43.5
X128.6Y-44.1
X128.6Y-44.7
X128.6Y-48.6
X128.6Y-49.2
X128.6Y-49.8
X128.6Y-74.2
X128.6Y-74.8
X128.6Y-75.4
X128.6Y-78.9
X128.6Y-79.5
X128.6Y-80.1
X128.694Y-52.606
X128.706Y-73.094
X129.094Y-72.706
T2
X102.3Y-78.0
T0
M30
