%TF.GenerationSoftware,KiCad,Pcbnew,(5.1.6-0)*%
%TF.CreationDate,2020-10-23T16:21:28-07:00*%
%TF.ProjectId,rd53b_quad_hybrid,72643533-625f-4717-9561-645f68796272,1.5*%
%TF.SameCoordinates,Original*%
%TF.FileFunction,Soldermask,Bot*%
%TF.FilePolarity,Negative*%
%FSLAX46Y46*%
G04 Gerber Fmt 4.6, Leading zero omitted, Abs format (unit mm)*
G04 Created by KiCad (PCBNEW (5.1.6-0)) date 2020-10-23 16:21:28*
%MOMM*%
%LPD*%
G01*
G04 APERTURE LIST*
%ADD10C,3.202000*%
%ADD11C,1.653000*%
%ADD12C,0.100000*%
G04 APERTURE END LIST*
D10*
%TO.C,REF\u002A\u002A*%
X83100000Y-88800000D03*
%TD*%
%TO.C,REF\u002A\u002A*%
X137100000Y-88800000D03*
%TD*%
%TO.C,REF\u002A\u002A*%
X137100000Y-35400000D03*
%TD*%
%TO.C,REF\u002A\u002A*%
X83100000Y-35400000D03*
%TD*%
D11*
%TO.C,U1*%
X102300000Y-78000000D03*
%TD*%
D12*
G36*
X83050000Y-73950000D02*
G01*
X80150000Y-73950000D01*
X80150000Y-71050000D01*
X83050000Y-71050000D01*
X83050000Y-73950000D01*
G37*
X83050000Y-73950000D02*
X80150000Y-73950000D01*
X80150000Y-71050000D01*
X83050000Y-71050000D01*
X83050000Y-73950000D01*
M02*
