Id,Designator,Package,Quantity,Designation,Supplier and ref,,,
1,"C103,C93,C84,C74,C65,C55,C46,C36",C_0201_NoSilk,8,100n,CL03A104KA3NNNC,"25V, 10%",https://www.digikey.com/en/products/detail/samsung-electro-mechanics/CL03A104KA3NNNC/3886976,
2,"C107,C102,C95,C88,C83,C76,C69,C64,C57,C50,C45,C38,C31,C22,C21,C20,C19,C9",C_0402_NoSilk,18,100n,GRM155R71C104KA88J,"16V, 10%",https://www.digikey.com/en/products/detail/murata-electronics/GRM155R71C104KA88J/3845525,
3,"C30,C29,C28,C27,C26,C25,C24,C23",C_0402_NoSilk,8,100n,GRM155R71H104KE14J,"50V, 10%",https://www.digikey.com/en/products/detail/murata-electronics/GRM155R71H104KE14J/4905180,
4,"C7,C17,C16,C15,C14,C13,C12,C11,C10,C8,C6,C5,C4,C3,C2,C1",C_0402_NoSilk,16,1n,GRM1555C1H102GA01D,"50V, 2%",https://www.digikey.com/en/products/detail/murata-electronics/GRM1555C1H102GA01D/2543862,
5,"C32,C89,C70,C51",C_0402_NoSilk,4,22n,GRM155R71E223JA61D,"25V, 5%",https://www.digikey.com/en/products/detail/murata-electronics/GRM155R71E223JA61D/4420539,
6,"C106,C104,C101,C99,C98,C96,C92,C90,C87,C85,C82,C80,C79,C77,C73,C71,C68,C66,C63,C61,C60,C58,C54,C52,C49,C47,C44,C42,C41,C39,C35,C33",C_0402_NoSilk,32,560n,GRM155R61A564KE15D,"10V, 10%",https://www.digikey.com/en/products/detail/murata-electronics/GRM155R61A564KE15D/2610854,
7,"C105,C100,C97,C91,C86,C81,C78,C72,C67,C62,C59,C53,C48,C43,C40,C34",C_0402_NoSilk,16,4.7u,CL05A475KP5NRNC,"10V, 10%",https://www.digikey.com/en/products/detail/samsung-electro-mechanics/CL05A475KP5NRNC/3887138,
8,"C94,C75,C56,C37",C_0402_NoSilk,4,2.2u,GRM155R61C225KE11D,"16V, 10%",https://www.digikey.com/en/products/detail/murata-electronics/GRM155R61C225KE11D/4905134,
9,C18,C_1206,1,10n,C1206C103KFRACTU,"1.5kV, 10%",https://www.digikey.com/en/products/detail/kemet/C1206C103KFRACTU/4172876,DO NOT LOAD
,,,,,,,,
10,"R4,R14,R11,R10,R9,R3,R2",R_0201_NoSilk,7,100,CRCW0201100RFKED,"1%, 0.05W (1/20)",https://www.digikey.com/en/products/detail/vishay-dale/CRCW0201100RFKED/1967973,
11,"R49,R40,R31,R22,R13,R12,R8,R7",R_0402_NoSilk,8,10k,TNPW040210K0BEED,"0.1%, 0.1W (1/10)",https://www.digikey.com/en/products/detail/vishay-dale/TNPW040210K0BEED/1606424,
12,"R21,R50,R48,R41,R39,R32,R30,R23",R_0402_NoSilk,8,30k,TNPW040230K0BEED,"0.1%, 0.1W (1/10)",https://www.digikey.com/en/products/detail/vishay-dale/TNPW040230K0BEED/1606476,
13,"R52,R43,R34,R25",R_0402_NoSilk,4,0,CRCW04020000Z0EDHP,"jumper, 0.2 W (1/5)",https://www.digikey.com/en/products/detail/vishay-dale/CRCW04020000Z0EDHP/2222496,
14,"R47,R38,R29,R20",R_0402_NoSilk,4,698,ERA-2AEB6980X,"0.1%, 0.063W (1/16)",https://www.digikey.com/en/products/detail/panasonic-electronic-components/ERA-2AEB6980X/2026040,
15,"R51,R42,R33,R24",R_0402_NoSilk,4,825,ERA-2AEB8250X,"0.1%, 0.063W (1/16)",https://www.digikey.com/en/products/detail/panasonic-electronic-components/ERA-2AEB8250X/2026046,
16,"R46,R37,R28,R19,R16,R15,R6,R5",R_0402_NoSilk,8,24.9k,ERA-2APB2492X,"0.1%, 0.063W (1/16)",https://www.digikey.com/en/products/detail/panasonic-electronic-components/ERA-2APB2492X/5162077,
17,"R45,R36,R27,R18",R_0402_NoSilk,4,10k,ERA-2VRW1002X,"0.05%, 0.063W (1/16)",https://www.digikey.com/en/products/detail/panasonic-electronic-components/ERA-2VRW1002X/12085128,
18,"R44,R35,R26,R17",R_0402_NoSilk,4,84.5k,ERA-2AEB84R5X,"0.1%, 0.063W (1/16)",https://www.digikey.com/en/products/detail/panasonic-electronic-components/ERA-2AEB84R5X/2025957,
19,R1,R_0402_NoSilk,1,4.99k,RC0402FR-074K99L,"1%, 0.063 W (1/16)",https://www.digikey.com/en/products/detail/yageo/RC0402FR-074K99L/2827568,
20,"TH5,TH4,TH3,TH2",R_0201_NoSilk,4,10k,NCP03XH103F05RL,,https://www.digikey.com/en/products/detail/murata-electronics/NCP03XH103F05RL/5451936,
21,TH1,R_0402_NoSilk,1,10k,B57230V2103F260,,https://www.digikey.com/en/products/detail/epcos-tdk-electronics/B57230V2103F260/4360619,
,,,,,,,,
22,J_conn1,Molex-502598-3993,1,ConnSingle,5025983993,,https://www.digikey.com/en/products/detail/molex/5025983993/4141917,
23,J1,SAMTEC_FTM-108-02-L-DV,1,FTM-108-02-L-DV,FTM-108-02-L-DV ,177 in stock,https://www.mouser.com/ProductDetail/Samtec/FTM-108-02-L-DV?qs=0lQeLiL1qyZdXskWMCx4zg%3D%3D,