{
    "Card": 0,
    "Devices": {
        "0": {
            "Links": {}
        },
        "1": {
            "Links": {
                "8": {
                    "_comment": "OB7 (primary) lpGBT1 - DP2 (512)",
                    "polarity": 1,
                    "icec": 1,
                    "rx": [
                        512,
                        520,
                        516,
                        524
                    ],
                    "tx": [
                        512,
                        522
                    ]
                },
                "10": {
                    "_comment": "OB7 lpGBT3 - DP6 (522)",
                    "polarity": 1,
                    "icec": 0,
                    "rx": [],
                    "tx": [
                        648,
                        656,
                        652,
                        660
                    ]
                }
            }
        }
    }
}
