{
    "defaultConfig": "LLSQC-OB2",
    "LLSQC-OB234":{
        "OB2": {
            "optoboard_serial": "4200043",
            "vtrx_v": "1.3",
            "ConfigurationDB": "http://localhost:5000",
            "config_path": "",
            "debug": false,
            "flx_G": "0",
            "flx_d": "0",
            "configInDB": false,
            "test_mode": false,
            "commToolName": "lpgbt-com",
            "configure": 0
        },
        "OB3": {
            "optoboard_serial": "2400010",
            "vtrx_v": "1.3",
            "ConfigurationDB": "http://localhost:5000",
            "config_path": "",
            "debug": false,
            "flx_G": "4",
            "flx_d": "0",
            "configInDB": false,
            "test_mode": false,
            "commToolName": "lpgbt-com",
            "configure": 0
        },
        "OB4": {
            "optoboard_serial": "2400018",
            "vtrx_v": "1.3",
            "ConfigurationDB": "http://localhost:5000",
            "config_path": "",
            "debug": false,
            "flx_G": "8",
            "flx_d": "0",
            "configInDB": false,
            "test_mode": false,
            "commToolName": "lpgbt-com",
            "configure": 0
        } 
    },
    "LLSQC-OB2": {
        "OB2": {
            "optoboard_serial": "4200043",
            "vtrx_v": "1.3",
            "ConfigurationDB": "http://localhost:5000",
            "config_path": "",
            "debug": false,
            "flx_G": "0",
            "flx_d": "0",
            "configInDB": false,
            "test_mode": false,
            "commToolName": "lpgbt-com",
            "configure": 0
        }
    },
    "LLSQC-OB3": {
        "OB3": {
            "optoboard_serial": "2400010",
            "vtrx_v": "1.3",
            "ConfigurationDB": "http://localhost:5000",
            "config_path": "",
            "debug": false,
            "flx_G": "4",
            "flx_d": "0",
            "configInDB": false,
            "test_mode": false,
            "commToolName": "lpgbt-com",
            "configure": 0
        }
    },
    "LLSQC-OB4": {
        "OB4": {
            "optoboard_serial": "2400018",
            "vtrx_v": "1.3",
            "ConfigurationDB": "http://localhost:5000",
            "config_path": "",
            "debug": false,
            "flx_G": "8",
            "flx_d": "0",
            "configInDB": false,
            "test_mode": false,
            "commToolName": "lpgbt-com",
            "configure": 0
        }
    },
    "LLSQC-OB5": {
        "OB5": {
            "optoboard_serial": "4400052",
            "vtrx_v": "1.3",
            "ConfigurationDB": "http://localhost:5000",
            "config_path": "",
            "debug": false,
            "flx_G": "0",
            "flx_d": "1",
            "configInDB": false,
            "test_mode": false,
            "commToolName": "lpgbt-com",
            "configure": 0
        }
    },
    "LLSQC-OB6": {
        "OB6": {
            "optoboard_serial": "4400055",
            "vtrx_v": "1.3",
            "ConfigurationDB": "http://localhost:5000",
            "config_path": "",
            "debug": false,
            "flx_G": "4",
            "flx_d": "1",
            "configInDB": false,
            "test_mode": false,
            "commToolName": "lpgbt-com",
            "configure": 0
        }
    },
    "LLSQC-OB7": {
        "OB7": {
            "optoboard_serial": "3200032",
            "vtrx_v": "1.3",
            "ConfigurationDB": "http://localhost:5000",
            "config_path": "",
            "debug": false,
            "flx_G": "8",
            "flx_d": "1",
            "configInDB": false,
            "test_mode": false,
            "commToolName": "lpgbt-com",
            "configure": 0
        }
    }
}
