{
    "Card": 0,
    "Devices": {
        "0": {
            "Links": {
                "0": {
                    "polarity": 1,
                    "icec": 1,
                    "rx": [
                        12,
                        8,
                        20,
                        0,
                        16,
                        4
                    ],
                    "tx": [
                        4,
                        2,
                        6,
                        12,
                        8,
                        10
                    ]
                },
                "2": {
                    "polarity": 1,
                    "icec": 0,
                    "rx": [
                        136,
                        140,
                        128,
                        148,
                        132,
                        144
                    ],
                    "tx": []
                },
                "4": {
                    "polarity": 1,
                    "icec": 1,
                    "rx": [
                        276,
                        264
                    ],
                    "tx": [
                        258,
                        264,
                        268,
                        260
                    ]
                },
                "6": {
                    "polarity": 1,
                    "icec": 0,
                    "rx": [
                        384,
                        396
                    ],
                    "tx": []
                },
                "8": {
                    "polarity": 1,
                    "icec": 1,
                    "rx": [
                        532,
                        520
                    ],
                    "tx": [
                        514,
                        520,
                        516,
                        524
                    ]
                },
                "10": {
                    "polarity": 1,
                    "icec": 0,
                    "rx": [
                        640,
                        652
                    ],
                    "tx": []
                }
            }
        },
        "1": {
            "Links": {
                "0": {
                    "polarity": 1,
                    "icec": 1,
                    "rx": [
                        20,
                        8
                    ],
                    "tx": [
                        2,
                        8,
                        12,
                        4
                    ]
                },
                "2": {
                    "polarity": 1,
                    "icec": 0,
                    "rx": [
                        128,
                        140
                    ],
                    "tx": []
                },
                "4": {
                    "polarity": 1,
                    "icec": 1,
                    "rx": [
                        276,
                        264
                    ],
                    "tx": [
                        258,
                        264,
                        268,
                        260
                    ]
                },
                "6": {
                    "polarity": 1,
                    "icec": 0,
                    "rx": [
                        384,
                        396
                    ],
                    "tx": []
                },
                "8": {
                    "polarity": 1,
                    "icec": 1,
                    "rx": [
                        532,
                        528,
                        524
                    ],
                    "tx": [
                        520,
                        514,
                        522,
                        512,
                        524,
                        516
                    ]
                },
                "10": {
                    "polarity": 1,
                    "icec": 0,
                    "rx": [
                        640,
                        644,
                        648
                    ],
                    "tx": []
                }
            }
        }
    }
}