{
    "Card": 0,
    "Devices": {
        "0": {
            "Links": {
                "0": {
                    "polarity": 1,
                    "icec": 1,
                    "rx": [
                        12,
                        8,
                        20,
                        0,
                        16,
                        4
                    ],
                    "tx": [
                        4,
                        2,
                        6,
                        12,
                        8,
                        10,
                        0
                    ]
                },
                "1": {
                    "polarity": 1,
                    "icec": 1,
                    "rx": [
                        64,68,72,74,76,80
                    ],
                    "tx": [
                        64,68,72,74,76,80
                    ]
                },
                "2": {
                    "polarity": 1,
                    "icec": 0,
                    "rx": [
                        136,
                        140,
                        128,
                        148,
                        132,
                        144
                    ],
                    "tx": []
                },
                "3": {
                    "polarity": 1,
                    "icec": 0,
                    "rx": [
                        192, 196, 200, 204,208,212
                    ],
                    "tx": [192, 196, 200, 204,208,212]
                },

                "4": {
                    "polarity": 1,
                    "icec": 1,
                    "rx": [
                        268,
                        264,
                        276,
                        256,
                        272,
                        260
                    ],
                    "tx": [
                        260,
                        258,
                        262,
                        268,
                        264,
                        266,
                        256
                    ]
                },
                "5": {
                    "polarity": 1,
                    "icec": 1,
                    "rx": [
                        320,324,328,332,336,340
                    ],
                    "tx": [
                        320,324,328,332,336,340
                    ]
                },
                "6": {
                    "polarity": 1,
                    "icec": 0,
                    "rx": [
                        392,
                        396,
                        384,
                        404,
                        388,
                        400
                    ],
                    "tx": [392,
                    396,
                    384,
                    404,
                    388,
                    400]
                },
                "7": {
                    "polarity": 1,
                    "icec": 0,
                    "rx": [448, 452, 456, 460, 464, 470
                    ],
                    "tx": [448, 452, 456, 460, 464, 470]
                },

                "8": {
                    "polarity": 1,
                    "icec": 1,
                    "rx": [
                        524,
                        520,
                        532,
                        512,
                        528,
                        516
                    ],
                    "tx": [
                        516,
                        514,
                        518,
                        524,
                        520,
                        522,
                        512
                    ]
                },

                "9": {
                    "polarity": 1,
                    "icec": 1,
                    "rx": [576, 580, 584, 588, 592, 596
                    ],
                    "tx": [576, 580, 584, 588, 592, 596
                    ]
                },
                "10": {
                    "polarity": 1,
                    "icec": 0,
                    "rx": [
                        648,
                        652,
                        640,
                        660,
                        644,
                        656
                    ],
                    "tx": []
                }
            }
        },
        "1": {
            "Links": {
                "0": {
                    "polarity": 1,
                    "icec": 1,
                    "rx": [
                        12,
                        8,
                        20,
                        0,
                        16,
                        4
                    ],
                    "tx": [
                        4,
                        2,
                        6,
                        12,
                        8,
                        10,
                        0
                    ]
                },
                "1": {
                    "polarity": 1,
                    "icec": 1,
                    "rx": [
                        64,68,72,74,76,80
                    ],
                    "tx": [
                        64,68,72,74,76,80
                    ]
                },
                "2": {
                    "polarity": 1,
                    "icec": 0,
                    "rx": [
                        136,
                        140,
                        128,
                        148,
                        132,
                        144
                    ],
                    "tx": []
                },
                "3": {
                    "polarity": 1,
                    "icec": 0,
                    "rx": [
                        192, 196, 200, 204,208,212
                    ],
                    "tx": [192, 196, 200, 204,208,212]
                },

                "4": {
                    "polarity": 1,
                    "icec": 1,
                    "rx": [
                        268,
                        264,
                        276,
                        256,
                        272,
                        260
                    ],
                    "tx": [
                        260,
                        258,
                        262,
                        268,
                        264,
                        266,
                        256
                    ]
                },
                "5": {
                    "polarity": 1,
                    "icec": 1,
                    "rx": [
                        320,324,328,332,336,340
                    ],
                    "tx": [
                        320,324,328,332,336,340
                    ]
                },
                "6": {
                    "polarity": 1,
                    "icec": 0,
                    "rx": [
                        392,
                        396,
                        384,
                        404,
                        388,
                        400
                    ],
                    "tx": [392,
                    396,
                    384,
                    404,
                    388,
                    400]
                },
                "7": {
                    "polarity": 1,
                    "icec": 0,
                    "rx": [448, 452, 456, 460, 464, 470
                    ],
                    "tx": [448, 452, 456, 460, 464, 470]
                },

                "8": {
                    "polarity": 1,
                    "icec": 1,
                    "rx": [
                        524,
                        520,
                        532,
                        512,
                        528,
                        516
                    ],
                    "tx": [
                        516,
                        514,
                        518,
                        524,
                        520,
                        522,
                        512
                    ]
                },

                "9": {
                    "polarity": 1,
                    "icec": 1,
                    "rx": [576, 580, 584, 588, 592, 596
                    ],
                    "tx": [576, 580, 584, 588, 592, 596
                    ]
                },
                "10": {
                    "polarity": 1,
                    "icec": 0,
                    "rx": [
                        648,
                        652,
                        640,
                        660,
                        644,
                        656
                    ],
                    "tx": []
                }
            }
        }
    }
}