{
    "serial": 302,
    "vtrx_v": "1.3",
    "ConfigurationDB": "http://localhost:5000",
    "config_path": "/usr/local/lib/python3.9/site-packages/optoboard_felix/configs/optoboard2_lpgbtv1_gbcr2_vtrxv1_3_default.json",
    "debug": false,
    "flx_G": "0",
    "flx_d": "0",
    "configInDB": false,
    "test_mode": true,
    "commToolName": "ic-over-netio"
}