{
    "configs": [
        {"key": {"serial": 123}, "object_type": "felix", "config_type": "meta", "name":"", "check": true, "to_file": false, "to_env": true},
        {"key": {"serial": 124}, "object_type": "felix", "config_type": "meta", "name":"", "check": true, "to_file": false, "to_env": true}
    ],
    "path": "/config",
    "runkey": ""
}