{
	"Optoboard": {
		"serial": "V2_008",
		"version": 2,
		"config_mode": "IC",
		"FELIX": 1,
		"link_group": 0,
		"FPGA_USB_port": 0,
		"PSU_USB_port": 1,
		"debug": 0,
		"I2C_master": 2,
		"I2C_set": 1,
		"SCLDriveMode": 0,
		"FREQ": 2
	}
}