{
    "Card": 0,
    "Devices": {
        "0": {
            "Links": {
                "0": {
                    "polarity": 1,
                    "icec": 1,
                    "rx": [0],
                    "tx": [0]
                }
            }
        },
        "1": {
            "Links": {
                "0": {
                    "polarity": 1,
                    "icec": 1,
                    "rx": [0],
                    "tx": [0]
                }
            }
        }
    }
}