{
    "componentType": "OB_LOADED_LONGERON",
    "type": "DUMMY",
    "subproject": "PB",
    "amount": 1,
    "properties": {
        "PART_NUMBER": "0",
        "SHIFTER_NAME": "Jonas Schmeing",
        "MANUFACTURED_DATETIME": "05.03.2025"
    },
    "children": [{
        "componentType": "PP0_LONGERON",
        "type": "DUMMY",
        "subproject": "PB",
        "amount": 4,
        "properties": {
            "PP0_FLAT_MANUFACTURER": "DUMMY CORP",
            "PP0_FLAT_FLAVOR": "00",
            "PP0_FLAT_PROD_VERSION": 0,
            "PART_NUMBER": "0",
            "PANEL_TRACKING": "0"
        },
        "children": [{
            "componentType": "OB_VIRTUAL_HV_GROUP",
            "type": "DUMMY",
            "subproject": "PB",
            "amount": 2,
            "children": [{
                "componentType": "OB_LOADED_MODULE_CELL",
                "type": "DUMMY",
                "subproject": "PB",
                "serialNumber": "20UPBZS00",
                "amount": 3,
                "children": [{
                    "componentType": "MODULE",
                    "type": "TUTORIAL_MODULE",
                    "subproject": "PG",
                    "serialNumber": "20UPGXM00",
                    "amount": 1,
                    "properties": {
                        "ORIENTATION": true,
                        "FECHIP_VERSION": "1"
                    },
                    "children": [{
                        "componentType": "BARE_MODULE",
                        "type": "TUTORIAL_BARE_MODULE",
                        "subproject": "PG",
                        "serialNumber": "20UPGXB19",
                        "amount": 1,
                        "properties": {
                            "FECHIP_VERSION": "1",
                            "SENSOR_TYPE": "9",
                            "VENDOR": "9"
                        },
                        "children": [{
                            "componentType": "FE_CHIP",
                            "type": "TUTORIAL_CHIP",
                            "subproject": "PG",
                            "serialNumber": "20UPGXF00",
                            "amount": 4
                        }]
                    }]
                }]
            }]
        }]
    }]
}