Remote host         : 192.168.1.201:12345
Message size [Byte] : 2
Number of messages  : 536870912
Total transfer [GB] : 1
Time [s]            : 13.8542
Throughput [GB/s]   : 0.0721804
Throughput [Gb/s]   : 0.577443

Remote host         : 192.168.1.201:12345
Message size [Byte] : 4
Number of messages  : 268435456
Total transfer [GB] : 1
Time [s]            : 7.24097
Throughput [GB/s]   : 0.138103
Throughput [Gb/s]   : 1.10482

Remote host         : 192.168.1.201:12345
Message size [Byte] : 8
Number of messages  : 134217728
Total transfer [GB] : 1
Time [s]            : 3.55656
Throughput [GB/s]   : 0.28117
Throughput [Gb/s]   : 2.24936

Remote host         : 192.168.1.201:12345
Message size [Byte] : 16
Number of messages  : 67108864
Total transfer [GB] : 1
Time [s]            : 1.92062
Throughput [GB/s]   : 0.520666
Throughput [Gb/s]   : 4.16533

Remote host         : 192.168.1.201:12345
Message size [Byte] : 32
Number of messages  : 33554432
Total transfer [GB] : 1
Time [s]            : 1.10962
Throughput [GB/s]   : 0.901211
Throughput [Gb/s]   : 7.20969

Remote host         : 192.168.1.201:12345
Message size [Byte] : 64
Number of messages  : 16777216
Total transfer [GB] : 1
Time [s]            : 0.985608
Throughput [GB/s]   : 1.0146
Throughput [Gb/s]   : 8.11682

Remote host         : 192.168.1.201:12345
Message size [Byte] : 128
Number of messages  : 8388608
Total transfer [GB] : 1
Time [s]            : 0.791846
Throughput [GB/s]   : 1.26287
Throughput [Gb/s]   : 10.103

Remote host         : 192.168.1.201:12345
Message size [Byte] : 256
Number of messages  : 4194304
Total transfer [GB] : 1
Time [s]            : 0.745097
Throughput [GB/s]   : 1.34211
Throughput [Gb/s]   : 10.7369

Remote host         : 192.168.1.201:12345
Message size [Byte] : 512
Number of messages  : 2097152
Total transfer [GB] : 1
Time [s]            : 0.725148
Throughput [GB/s]   : 1.37903
Throughput [Gb/s]   : 11.0322

Remote host         : 192.168.1.201:12345
Message size [Byte] : 1024
Number of messages  : 1048576
Total transfer [GB] : 1
Time [s]            : 0.716523
Throughput [GB/s]   : 1.39563
Throughput [Gb/s]   : 11.165

Remote host         : 192.168.1.201:12345
Message size [Byte] : 2048
Number of messages  : 524288
Total transfer [GB] : 1
Time [s]            : 0.71499
Throughput [GB/s]   : 1.39862
Throughput [Gb/s]   : 11.189

Remote host         : 192.168.1.201:12345
Message size [Byte] : 4096
Number of messages  : 262144
Total transfer [GB] : 1
Time [s]            : 0.714437
Throughput [GB/s]   : 1.3997
Throughput [Gb/s]   : 11.1976

Remote host         : 192.168.1.201:12345
Message size [Byte] : 8192
Number of messages  : 131072
Total transfer [GB] : 1
Time [s]            : 0.719579
Throughput [GB/s]   : 1.3897
Throughput [Gb/s]   : 11.1176

Remote host         : 192.168.1.201:12345
Message size [Byte] : 16384
Number of messages  : 65536
Total transfer [GB] : 1
Time [s]            : 0.716899
Throughput [GB/s]   : 1.3949
Throughput [Gb/s]   : 11.1592

Remote host         : 192.168.1.201:12345
Message size [Byte] : 32768
Number of messages  : 32768
Total transfer [GB] : 1
Time [s]            : 0.713637
Throughput [GB/s]   : 1.40127
Throughput [Gb/s]   : 11.2102

Remote host         : 192.168.1.201:12345
Message size [Byte] : 65536
Number of messages  : 16384
Total transfer [GB] : 1
Time [s]            : 0.712502
Throughput [GB/s]   : 1.4035
Throughput [Gb/s]   : 11.228

Remote host         : 192.168.1.201:12345
Message size [Byte] : 131072
Number of messages  : 8192
Total transfer [GB] : 1
Time [s]            : 0.714082
Throughput [GB/s]   : 1.4004
Throughput [Gb/s]   : 11.2032



































