{
    "test":[
       {
          "author":"analysis_rk_script",
          "comment":"outer barrel longeron",
          "id":"9d5ed22de3904e118ef08a3fb28c7f64",
          "metadata":{
             "id":"LLS_OB_0001",
             "nMods":36
          },
          "name":"LLS_OB_0001",
          "time":"2024-07-31T14:51:51",
          "type":"longeron"
       },
       {
          "author":"analysis_rk_script",
          "comment":"outer barrel longeron",
          "id":"18af32172655455d9108a7df4469efc0",
          "metadata":{
             "id":"LLS_OB_0002",
             "nMods":36
          },
          "name":"LLS_OB_0002",
          "time":"2024-07-31T14:51:53",
          "type":"longeron"
       },
       {
          "author":"analysis_rk_script",
          "comment":"outer barrel half ring",
          "id":"853ad80c15bd4a6681ddf37e7424a6d5",
          "metadata":{
             "id":"LLS_OB_0003",
             "nMods":28
          },
          "name":"LLS_OB_0003",
          "time":"2024-07-31T14:51:50",
          "type":"Half-Ring-OB"
       },
       {
          "author":"analysis_rk_script",
          "comment":"end cap half ring",
          "id":"02b1165897c0487a8907c5479a171e31",
          "metadata":{
             "id":"LLS_EC_0001",
             "nMods":26
          },
          "name":"LLS_EC_0001",
          "time":"2024-07-31T14:51:49",
          "type":"Half-Ring-EC"
       }
    ]
 }