{
    "felix_app": 1,
    "felix_card_number": 0,
    "felix_device_number": 0,
    "felix_initialize": 3,
    "dryrun": 0,
    "noflx": 0,
    "felix_config_file": "felix_config.json",
    "felix_data_interface": "lo",
    "felix_toflx_ip": "localhost",
    "felix_tohost_ip": "localhost",
    "felix_tohost_dcs_pages": 256,
    "serial": 124
}