{
  "Devices": {
    "0": {
      "Tag": "Master OB2",
      "Links": {
        "0": {
          "Polarity": 0,
          "ICEC": 1,
          "RX": [
            0,
            4
          ],
          "TX": [
            0
          ],
          "Comment": "example comment"
        },
        "1": {
          "Polarity": 0,
          "ICEC": 1,
          "RX": [
            80,
            84
          ],
          "TX": [
            64,
            80
          ],
          "Comment": ""
        },
        "2": {
          "Polarity": 0,
          "ICEC": 1,
          "RX": [
            128
          ],
          "TX": [
            132,
            134
          ],
          "Comment": ""
        }
      }
    }
  }
}