{
  "FelixID": "01",
  "DeviceID": 0,
  "Links": {
    "0": {
      "polarity": 1,
      "icec": 1,
      "rx": [
        0
      ],
      "tx": [
        0
      ]
    },
    "2": {
      "polarity": 1,
      "icec": 1,
      "rx": [
        128
      ],
      "tx": [
        128
      ]
    }
  }
}
