{
    "Card": 0,
    "Devices": {
        "0": {
            "Links": {
                "0": {
                    "polarity": 1,
                    "icec": 1,
                    "rx": [],
                    "tx": []
                },
                "2": {
                    "polarity": 1,
                    "icec": 0,
                    "rx": [],
                    "tx": []
                },
                "4": {
                    "polarity": 1,
                    "icec": 1,
                    "rx": [],
                    "tx": []
                },
                "5": {
                    "polarity": 1,
                    "icec": 0,
                    "rx": [],
                    "tx": []
                },
                "6": {
                    "polarity": 1,
                    "icec": 0,
                    "rx": [],
                    "tx": []
                },
                "7": {
                    "polarity": 1,
                    "icec": 0,
                    "rx": [],
                    "tx": []
                },
                "8": {
                    "polarity": 1,
                    "icec": 1,
                    "rx": [],
                    "tx": []
                },
                "9": {
                    "polarity": 1,
                    "icec": 0,
                    "rx": [],
                    "tx": []
                },
                "10": {
                    "polarity": 1,
                    "icec": 0,
                    "rx": [],
                    "tx": []
                },
                "11": {
                    "polarity": 1,
                    "icec": 0,
                    "rx": [],
                    "tx": []
                }
            }
        },
        "1": {
            "Links": {
                "0": {
                    "polarity": 1,
                    "icec": 1,
                    "rx": [],
                    "tx": []
                },
                "1": {
                    "polarity": 1,
                    "icec": 0,
                    "rx": [],
                    "tx": []
                },
                "2": {
                    "polarity": 1,
                    "icec": 0,
                    "rx": [],
                    "tx": []
                },
                "3": {
                    "polarity": 1,
                    "icec": 0,
                    "rx": [],
                    "tx": []
                },
                "4": {
                    "polarity": 1,
                    "icec": 1,
                    "rx": [],
                    "tx": []
                },
                "5": {
                    "polarity": 1,
                    "icec": 0,
                    "rx": [],
                    "tx": []
                },
                "6": {
                    "polarity": 1,
                    "icec": 0,
                    "rx": [],
                    "tx": []
                },
                "7": {
                    "polarity": 1,
                    "icec": 0,
                    "rx": [],
                    "tx": []
                },
                "8": {
                    "polarity": 1,
                    "icec": 1,
                    "rx": [],
                    "tx": []
                },
                "10": {
                    "polarity": 1,
                    "icec": 0,
                    "rx": [],
                    "tx": []
                }
            }
        }
    }
}
