0x2180 [R  57:00]                   DECODING_LINK_ALIGNED_00   0x000000030000000  Every bit corresponds to an E-link on one (lp)GBT or FULL-mode 
0x2190 [R  57:00]                   DECODING_LINK_ALIGNED_01   0x000000030000000  Every bit corresponds to an E-link on one (lp)GBT or FULL-mode 
0x21a0 [R  57:00]                   DECODING_LINK_ALIGNED_02   0x000000030000000  Every bit corresponds to an E-link on one (lp)GBT or FULL-mode 
0x21b0 [R  57:00]                   DECODING_LINK_ALIGNED_03   0x000000030000000  Every bit corresponds to an E-link on one (lp)GBT or FULL-mode 
0x21c0 [R  57:00]                   DECODING_LINK_ALIGNED_04   0x000000030000000  Every bit corresponds to an E-link on one (lp)GBT or FULL-mode 
0x21d0 [R  57:00]                   DECODING_LINK_ALIGNED_05   0x000000030000000  Every bit corresponds to an E-link on one (lp)GBT or FULL-mode 
0x21e0 [R  57:00]                   DECODING_LINK_ALIGNED_06   0x000000030000000  Every bit corresponds to an E-link on one (lp)GBT or FULL-mode 
0x21f0 [R  57:00]                   DECODING_LINK_ALIGNED_07   0x000000030000000  Every bit corresponds to an E-link on one (lp)GBT or FULL-mode 
0x2200 [R  57:00]                   DECODING_LINK_ALIGNED_08   0x000000030000000  Every bit corresponds to an E-link on one (lp)GBT or FULL-mode 
0x2210 [R  57:00]                   DECODING_LINK_ALIGNED_09   0x000000030000000  Every bit corresponds to an E-link on one (lp)GBT or FULL-mode 
0x2220 [R  57:00]                   DECODING_LINK_ALIGNED_10   0x000000030000000  Every bit corresponds to an E-link on one (lp)GBT or FULL-mode 
0x2230 [R  57:00]                   DECODING_LINK_ALIGNED_11   0x000000030000000  Every bit corresponds to an E-link on one (lp)GBT or FULL-mode 
0x2240 [R  57:00]                   DECODING_LINK_ALIGNED_12   0x000000000000000  Every bit corresponds to an E-link on one (lp)GBT or FULL-mode 
0x2250 [R  57:00]                   DECODING_LINK_ALIGNED_13   0x000000000000000  Every bit corresponds to an E-link on one (lp)GBT or FULL-mode 
0x2260 [R  57:00]                   DECODING_LINK_ALIGNED_14   0x000000000000000  Every bit corresponds to an E-link on one (lp)GBT or FULL-mode 
0x2270 [R  57:00]                   DECODING_LINK_ALIGNED_15   0x000000000000000  Every bit corresponds to an E-link on one (lp)GBT or FULL-mode 
0x2280 [R  57:00]                   DECODING_LINK_ALIGNED_16   0x000000000000000  Every bit corresponds to an E-link on one (lp)GBT or FULL-mode 
0x2290 [R  57:00]                   DECODING_LINK_ALIGNED_17   0x000000000000000  Every bit corresponds to an E-link on one (lp)GBT or FULL-mode 
0x22a0 [R  57:00]                   DECODING_LINK_ALIGNED_18   0x000000000000000  Every bit corresponds to an E-link on one (lp)GBT or FULL-mode 
0x22b0 [R  57:00]                   DECODING_LINK_ALIGNED_19   0x000000000000000  Every bit corresponds to an E-link on one (lp)GBT or FULL-mode 
0x22c0 [R  57:00]                   DECODING_LINK_ALIGNED_20   0x000000000000000  Every bit corresponds to an E-link on one (lp)GBT or FULL-mode 
0x22d0 [R  57:00]                   DECODING_LINK_ALIGNED_21   0x000000000000000  Every bit corresponds to an E-link on one (lp)GBT or FULL-mode 
0x22e0 [R  57:00]                   DECODING_LINK_ALIGNED_22   0x000000000000000  Every bit corresponds to an E-link on one (lp)GBT or FULL-mode 
0x22f0 [R  57:00]                   DECODING_LINK_ALIGNED_23   0x000000000000000  Every bit corresponds to an E-link on one (lp)GBT or FULL-mode 
