{
    "author": "analysis_rk_script",
    "comment": "Outer Barrel Longeron",
    "id": "18af32172655455d9108a7df4469efc0",
    "metadata": {
        "id": "LLS_OB_0002",
        "nMods": 36
    },
    "name": "LLS_OB_0002",
    "time": "2024-07-31T14:51:53",
    "type": "Longeron",
    "objects": [
        {
            "type": "modules",
            "children": [
                {
                    "type": "module",
                    "name": "module_0",
                    "metadata": {
                        "serial": "20UPGM22110471",
                        "position": 1,
                        "paths": [
                            {
                                "type": "as",
                                "path": "20UPGM22110471/Jig1/010464"
                            },
                            {
                                "type": "ds",
                                "path": "20UPGM22110471/Jig1/010463"
                            },
                            {
                                "type": "ts",
                                "path": "20UPGM22110471/Jig1/010461"
                            }
                        ]
                    }
                },
                {
                    "type": "module",
                    "name": "module_1",
                    "metadata": {
                        "serial": "20UPGR92110514",
                        "position": 2,
                        "paths": [
                            {
                                "type": "as",
                                "path": "20UPGR92110514/DQ28_Jig1/000214"
                            },
                            {
                                "type": "ds",
                                "path": "20UPGR92110514/DQ28_Jig1/000213"
                            },
                            {
                                "type": "ts",
                                "path": "20UPGR92110514/DQ28_Jig1/000215"
                            },
                            {
                                "type": "as",
                                "path": "20UPGR92110514/DQ28_Jig2/000210"
                            },
                            {
                                "type": "ds",
                                "path": "20UPGR92110514/DQ28_Jig2/000209"
                            },
                            {
                                "type": "ts",
                                "path": "20UPGR92110514/DQ28_Jig2/000211"
                            },
                            {
                                "type": "as",
                                "path": "20UPGR92110514/DQ28_Jig3/000205"
                            },
                            {
                                "type": "ds",
                                "path": "20UPGR92110514/DQ28_Jig3/000203"
                            },
                            {
                                "type": "ts",
                                "path": "20UPGR92110514/DQ28_Jig3/000207"
                            },
                            {
                                "type": "as",
                                "path": "20UPGR92110514/DQ28_Jig4/000200"
                            },
                            {
                                "type": "ds",
                                "path": "20UPGR92110514/DQ28_Jig4/000199"
                            },
                            {
                                "type": "ts",
                                "path": "20UPGR92110514/DQ28_Jig4/000201"
                            }
                        ]
                    }
                },
                {
                    "type": "module",
                    "name": "module_2",
                    "metadata": {
                        "serial": "20UPGM22110471",
                        "position": 3,
                        "paths": [
                            {
                                "type": "as",
                                "path": "20UPGM22110471/Jig1/010464"
                            },
                            {
                                "type": "ds",
                                "path": "20UPGM22110471/Jig1/010463"
                            },
                            {
                                "type": "ts",
                                "path": "20UPGM22110471/Jig1/010461"
                            }
                        ]
                    }
                },
                {
                    "type": "module",
                    "name": "module_3",
                    "metadata": {
                        "serial": "20UPGR92110514",
                        "position": 4,
                        "paths": [
                            {
                                "type": "as",
                                "path": "20UPGR92110514/DQ28_Jig1/000214"
                            },
                            {
                                "type": "ds",
                                "path": "20UPGR92110514/DQ28_Jig1/000213"
                            },
                            {
                                "type": "ts",
                                "path": "20UPGR92110514/DQ28_Jig1/000215"
                            },
                            {
                                "type": "as",
                                "path": "20UPGR92110514/DQ28_Jig2/000210"
                            },
                            {
                                "type": "ds",
                                "path": "20UPGR92110514/DQ28_Jig2/000209"
                            },
                            {
                                "type": "ts",
                                "path": "20UPGR92110514/DQ28_Jig2/000211"
                            },
                            {
                                "type": "as",
                                "path": "20UPGR92110514/DQ28_Jig3/000205"
                            },
                            {
                                "type": "ds",
                                "path": "20UPGR92110514/DQ28_Jig3/000203"
                            },
                            {
                                "type": "ts",
                                "path": "20UPGR92110514/DQ28_Jig3/000207"
                            },
                            {
                                "type": "as",
                                "path": "20UPGR92110514/DQ28_Jig4/000200"
                            },
                            {
                                "type": "ds",
                                "path": "20UPGR92110514/DQ28_Jig4/000199"
                            },
                            {
                                "type": "ts",
                                "path": "20UPGR92110514/DQ28_Jig4/000201"
                            }
                        ]
                    }
                },
                {
                    "type": "module",
                    "name": "module_4",
                    "metadata": {
                        "serial": "20UPGM22110471",
                        "position": 5,
                        "paths": [
                            {
                                "type": "as",
                                "path": "20UPGM22110471/Jig1/010464"
                            },
                            {
                                "type": "ds",
                                "path": "20UPGM22110471/Jig1/010463"
                            },
                            {
                                "type": "ts",
                                "path": "20UPGM22110471/Jig1/010461"
                            }
                        ]
                    }
                },
                {
                    "type": "module",
                    "name": "module_5",
                    "metadata": {
                        "serial": "20UPGR92110514",
                        "position": 6,
                        "paths": [
                            {
                                "type": "as",
                                "path": "20UPGR92110514/DQ28_Jig1/000214"
                            },
                            {
                                "type": "ds",
                                "path": "20UPGR92110514/DQ28_Jig1/000213"
                            },
                            {
                                "type": "ts",
                                "path": "20UPGR92110514/DQ28_Jig1/000215"
                            },
                            {
                                "type": "as",
                                "path": "20UPGR92110514/DQ28_Jig2/000210"
                            },
                            {
                                "type": "ds",
                                "path": "20UPGR92110514/DQ28_Jig2/000209"
                            },
                            {
                                "type": "ts",
                                "path": "20UPGR92110514/DQ28_Jig2/000211"
                            },
                            {
                                "type": "as",
                                "path": "20UPGR92110514/DQ28_Jig3/000205"
                            },
                            {
                                "type": "ds",
                                "path": "20UPGR92110514/DQ28_Jig3/000203"
                            },
                            {
                                "type": "ts",
                                "path": "20UPGR92110514/DQ28_Jig3/000207"
                            },
                            {
                                "type": "as",
                                "path": "20UPGR92110514/DQ28_Jig4/000200"
                            },
                            {
                                "type": "ds",
                                "path": "20UPGR92110514/DQ28_Jig4/000199"
                            },
                            {
                                "type": "ts",
                                "path": "20UPGR92110514/DQ28_Jig4/000201"
                            }
                        ]
                    }
                },
                {
                    "type": "module",
                    "name": "module_6",
                    "metadata": {
                        "serial": "20UPGM22110471",
                        "position": 7,
                        "paths": [
                            {
                                "type": "as",
                                "path": "20UPGM22110471/Jig1/010464"
                            },
                            {
                                "type": "ds",
                                "path": "20UPGM22110471/Jig1/010463"
                            },
                            {
                                "type": "ts",
                                "path": "20UPGM22110471/Jig1/010461"
                            }
                        ]
                    }
                },
                {
                    "type": "module",
                    "name": "module_7",
                    "metadata": {
                        "serial": "20UPGR92110514",
                        "position": 8,
                        "paths": [
                            {
                                "type": "as",
                                "path": "20UPGR92110514/DQ28_Jig1/000214"
                            },
                            {
                                "type": "ds",
                                "path": "20UPGR92110514/DQ28_Jig1/000213"
                            },
                            {
                                "type": "ts",
                                "path": "20UPGR92110514/DQ28_Jig1/000215"
                            },
                            {
                                "type": "as",
                                "path": "20UPGR92110514/DQ28_Jig2/000210"
                            },
                            {
                                "type": "ds",
                                "path": "20UPGR92110514/DQ28_Jig2/000209"
                            },
                            {
                                "type": "ts",
                                "path": "20UPGR92110514/DQ28_Jig2/000211"
                            },
                            {
                                "type": "as",
                                "path": "20UPGR92110514/DQ28_Jig3/000205"
                            },
                            {
                                "type": "ds",
                                "path": "20UPGR92110514/DQ28_Jig3/000203"
                            },
                            {
                                "type": "ts",
                                "path": "20UPGR92110514/DQ28_Jig3/000207"
                            },
                            {
                                "type": "as",
                                "path": "20UPGR92110514/DQ28_Jig4/000200"
                            },
                            {
                                "type": "ds",
                                "path": "20UPGR92110514/DQ28_Jig4/000199"
                            },
                            {
                                "type": "ts",
                                "path": "20UPGR92110514/DQ28_Jig4/000201"
                            }
                        ]
                    }
                },
                {
                    "type": "module",
                    "name": "module_8",
                    "metadata": {
                        "serial": "20UPGM22110471",
                        "position": 9,
                        "paths": [
                            {
                                "type": "as",
                                "path": "20UPGM22110471/Jig1/010464"
                            },
                            {
                                "type": "ds",
                                "path": "20UPGM22110471/Jig1/010463"
                            },
                            {
                                "type": "ts",
                                "path": "20UPGM22110471/Jig1/010461"
                            }
                        ]
                    }
                },
                {
                    "type": "module",
                    "name": "module_9",
                    "metadata": {
                        "serial": "20UPGR92110514",
                        "position": 10,
                        "paths": [
                            {
                                "type": "as",
                                "path": "20UPGR92110514/DQ28_Jig1/000214"
                            },
                            {
                                "type": "ds",
                                "path": "20UPGR92110514/DQ28_Jig1/000213"
                            },
                            {
                                "type": "ts",
                                "path": "20UPGR92110514/DQ28_Jig1/000215"
                            },
                            {
                                "type": "as",
                                "path": "20UPGR92110514/DQ28_Jig2/000210"
                            },
                            {
                                "type": "ds",
                                "path": "20UPGR92110514/DQ28_Jig2/000209"
                            },
                            {
                                "type": "ts",
                                "path": "20UPGR92110514/DQ28_Jig2/000211"
                            },
                            {
                                "type": "as",
                                "path": "20UPGR92110514/DQ28_Jig3/000205"
                            },
                            {
                                "type": "ds",
                                "path": "20UPGR92110514/DQ28_Jig3/000203"
                            },
                            {
                                "type": "ts",
                                "path": "20UPGR92110514/DQ28_Jig3/000207"
                            },
                            {
                                "type": "as",
                                "path": "20UPGR92110514/DQ28_Jig4/000200"
                            },
                            {
                                "type": "ds",
                                "path": "20UPGR92110514/DQ28_Jig4/000199"
                            },
                            {
                                "type": "ts",
                                "path": "20UPGR92110514/DQ28_Jig4/000201"
                            }
                        ]
                    }
                },
                {
                    "type": "module",
                    "name": "module_10",
                    "metadata": {
                        "serial": "20UPGM22110471",
                        "position": 11,
                        "paths": [
                            {
                                "type": "as",
                                "path": "20UPGM22110471/Jig1/010464"
                            },
                            {
                                "type": "ds",
                                "path": "20UPGM22110471/Jig1/010463"
                            },
                            {
                                "type": "ts",
                                "path": "20UPGM22110471/Jig1/010461"
                            }
                        ]
                    }
                },
                {
                    "type": "module",
                    "name": "module_11",
                    "metadata": {
                        "serial": "20UPGR92110514",
                        "position": 12,
                        "paths": [
                            {
                                "type": "as",
                                "path": "20UPGR92110514/DQ28_Jig1/000214"
                            },
                            {
                                "type": "ds",
                                "path": "20UPGR92110514/DQ28_Jig1/000213"
                            },
                            {
                                "type": "ts",
                                "path": "20UPGR92110514/DQ28_Jig1/000215"
                            },
                            {
                                "type": "as",
                                "path": "20UPGR92110514/DQ28_Jig2/000210"
                            },
                            {
                                "type": "ds",
                                "path": "20UPGR92110514/DQ28_Jig2/000209"
                            },
                            {
                                "type": "ts",
                                "path": "20UPGR92110514/DQ28_Jig2/000211"
                            },
                            {
                                "type": "as",
                                "path": "20UPGR92110514/DQ28_Jig3/000205"
                            },
                            {
                                "type": "ds",
                                "path": "20UPGR92110514/DQ28_Jig3/000203"
                            },
                            {
                                "type": "ts",
                                "path": "20UPGR92110514/DQ28_Jig3/000207"
                            },
                            {
                                "type": "as",
                                "path": "20UPGR92110514/DQ28_Jig4/000200"
                            },
                            {
                                "type": "ds",
                                "path": "20UPGR92110514/DQ28_Jig4/000199"
                            },
                            {
                                "type": "ts",
                                "path": "20UPGR92110514/DQ28_Jig4/000201"
                            }
                        ]
                    }
                },
                {
                    "type": "module",
                    "name": "module_12",
                    "metadata": {
                        "serial": "20UPGM22110471",
                        "position": 13,
                        "paths": [
                            {
                                "type": "as",
                                "path": "20UPGM22110471/Jig1/010464"
                            },
                            {
                                "type": "ds",
                                "path": "20UPGM22110471/Jig1/010463"
                            },
                            {
                                "type": "ts",
                                "path": "20UPGM22110471/Jig1/010461"
                            }
                        ]
                    }
                },
                {
                    "type": "module",
                    "name": "module_13",
                    "metadata": {
                        "serial": "20UPGR92110514",
                        "position": 14,
                        "paths": [
                            {
                                "type": "as",
                                "path": "20UPGR92110514/DQ28_Jig1/000214"
                            },
                            {
                                "type": "ds",
                                "path": "20UPGR92110514/DQ28_Jig1/000213"
                            },
                            {
                                "type": "ts",
                                "path": "20UPGR92110514/DQ28_Jig1/000215"
                            },
                            {
                                "type": "as",
                                "path": "20UPGR92110514/DQ28_Jig2/000210"
                            },
                            {
                                "type": "ds",
                                "path": "20UPGR92110514/DQ28_Jig2/000209"
                            },
                            {
                                "type": "ts",
                                "path": "20UPGR92110514/DQ28_Jig2/000211"
                            },
                            {
                                "type": "as",
                                "path": "20UPGR92110514/DQ28_Jig3/000205"
                            },
                            {
                                "type": "ds",
                                "path": "20UPGR92110514/DQ28_Jig3/000203"
                            },
                            {
                                "type": "ts",
                                "path": "20UPGR92110514/DQ28_Jig3/000207"
                            },
                            {
                                "type": "as",
                                "path": "20UPGR92110514/DQ28_Jig4/000200"
                            },
                            {
                                "type": "ds",
                                "path": "20UPGR92110514/DQ28_Jig4/000199"
                            },
                            {
                                "type": "ts",
                                "path": "20UPGR92110514/DQ28_Jig4/000201"
                            }
                        ]
                    }
                },
                {
                    "type": "module",
                    "name": "module_14",
                    "metadata": {
                        "serial": "20UPGM22110471",
                        "position": 15,
                        "paths": [
                            {
                                "type": "as",
                                "path": "20UPGM22110471/Jig1/010464"
                            },
                            {
                                "type": "ds",
                                "path": "20UPGM22110471/Jig1/010463"
                            },
                            {
                                "type": "ts",
                                "path": "20UPGM22110471/Jig1/010461"
                            }
                        ]
                    }
                },
                {
                    "type": "module",
                    "name": "module_15",
                    "metadata": {
                        "serial": "20UPGR92110514",
                        "position": 16,
                        "paths": [
                            {
                                "type": "as",
                                "path": "20UPGR92110514/DQ28_Jig1/000214"
                            },
                            {
                                "type": "ds",
                                "path": "20UPGR92110514/DQ28_Jig1/000213"
                            },
                            {
                                "type": "ts",
                                "path": "20UPGR92110514/DQ28_Jig1/000215"
                            },
                            {
                                "type": "as",
                                "path": "20UPGR92110514/DQ28_Jig2/000210"
                            },
                            {
                                "type": "ds",
                                "path": "20UPGR92110514/DQ28_Jig2/000209"
                            },
                            {
                                "type": "ts",
                                "path": "20UPGR92110514/DQ28_Jig2/000211"
                            },
                            {
                                "type": "as",
                                "path": "20UPGR92110514/DQ28_Jig3/000205"
                            },
                            {
                                "type": "ds",
                                "path": "20UPGR92110514/DQ28_Jig3/000203"
                            },
                            {
                                "type": "ts",
                                "path": "20UPGR92110514/DQ28_Jig3/000207"
                            },
                            {
                                "type": "as",
                                "path": "20UPGR92110514/DQ28_Jig4/000200"
                            },
                            {
                                "type": "ds",
                                "path": "20UPGR92110514/DQ28_Jig4/000199"
                            },
                            {
                                "type": "ts",
                                "path": "20UPGR92110514/DQ28_Jig4/000201"
                            }
                        ]
                    }
                },
                {
                    "type": "module",
                    "name": "module_16",
                    "metadata": {
                        "serial": "20UPGM22110471",
                        "position": 17,
                        "paths": [
                            {
                                "type": "as",
                                "path": "20UPGM22110471/Jig1/010464"
                            },
                            {
                                "type": "ds",
                                "path": "20UPGM22110471/Jig1/010463"
                            },
                            {
                                "type": "ts",
                                "path": "20UPGM22110471/Jig1/010461"
                            }
                        ]
                    }
                },
                {
                    "type": "module",
                    "name": "module_17",
                    "metadata": {
                        "serial": "20UPGR92110514",
                        "position": 18,
                        "paths": [
                            {
                                "type": "as",
                                "path": "20UPGR92110514/DQ28_Jig1/000214"
                            },
                            {
                                "type": "ds",
                                "path": "20UPGR92110514/DQ28_Jig1/000213"
                            },
                            {
                                "type": "ts",
                                "path": "20UPGR92110514/DQ28_Jig1/000215"
                            },
                            {
                                "type": "as",
                                "path": "20UPGR92110514/DQ28_Jig2/000210"
                            },
                            {
                                "type": "ds",
                                "path": "20UPGR92110514/DQ28_Jig2/000209"
                            },
                            {
                                "type": "ts",
                                "path": "20UPGR92110514/DQ28_Jig2/000211"
                            },
                            {
                                "type": "as",
                                "path": "20UPGR92110514/DQ28_Jig3/000205"
                            },
                            {
                                "type": "ds",
                                "path": "20UPGR92110514/DQ28_Jig3/000203"
                            },
                            {
                                "type": "ts",
                                "path": "20UPGR92110514/DQ28_Jig3/000207"
                            },
                            {
                                "type": "as",
                                "path": "20UPGR92110514/DQ28_Jig4/000200"
                            },
                            {
                                "type": "ds",
                                "path": "20UPGR92110514/DQ28_Jig4/000199"
                            },
                            {
                                "type": "ts",
                                "path": "20UPGR92110514/DQ28_Jig4/000201"
                            }
                        ]
                    }
                },
                {
                    "type": "module",
                    "name": "module_18",
                    "metadata": {
                        "serial": "20UPGM22110471",
                        "position": 19,
                        "paths": [
                            {
                                "type": "as",
                                "path": "20UPGM22110471/Jig1/010464"
                            },
                            {
                                "type": "ds",
                                "path": "20UPGM22110471/Jig1/010463"
                            },
                            {
                                "type": "ts",
                                "path": "20UPGM22110471/Jig1/010461"
                            }
                        ]
                    }
                },
                {
                    "type": "module",
                    "name": "module_19",
                    "metadata": {
                        "serial": "20UPGR92110514",
                        "position": 20,
                        "paths": [
                            {
                                "type": "as",
                                "path": "20UPGR92110514/DQ28_Jig1/000214"
                            },
                            {
                                "type": "ds",
                                "path": "20UPGR92110514/DQ28_Jig1/000213"
                            },
                            {
                                "type": "ts",
                                "path": "20UPGR92110514/DQ28_Jig1/000215"
                            },
                            {
                                "type": "as",
                                "path": "20UPGR92110514/DQ28_Jig2/000210"
                            },
                            {
                                "type": "ds",
                                "path": "20UPGR92110514/DQ28_Jig2/000209"
                            },
                            {
                                "type": "ts",
                                "path": "20UPGR92110514/DQ28_Jig2/000211"
                            },
                            {
                                "type": "as",
                                "path": "20UPGR92110514/DQ28_Jig3/000205"
                            },
                            {
                                "type": "ds",
                                "path": "20UPGR92110514/DQ28_Jig3/000203"
                            },
                            {
                                "type": "ts",
                                "path": "20UPGR92110514/DQ28_Jig3/000207"
                            },
                            {
                                "type": "as",
                                "path": "20UPGR92110514/DQ28_Jig4/000200"
                            },
                            {
                                "type": "ds",
                                "path": "20UPGR92110514/DQ28_Jig4/000199"
                            },
                            {
                                "type": "ts",
                                "path": "20UPGR92110514/DQ28_Jig4/000201"
                            }
                        ]
                    }
                },
                {
                    "type": "module",
                    "name": "module_20",
                    "metadata": {
                        "serial": "20UPGM22110471",
                        "position": 21,
                        "paths": [
                            {
                                "type": "as",
                                "path": "20UPGM22110471/Jig1/010464"
                            },
                            {
                                "type": "ds",
                                "path": "20UPGM22110471/Jig1/010463"
                            },
                            {
                                "type": "ts",
                                "path": "20UPGM22110471/Jig1/010461"
                            }
                        ]
                    }
                },
                {
                    "type": "module",
                    "name": "module_21",
                    "metadata": {
                        "serial": "20UPGR92110514",
                        "position": 22,
                        "paths": [
                            {
                                "type": "as",
                                "path": "20UPGR92110514/DQ28_Jig1/000214"
                            },
                            {
                                "type": "ds",
                                "path": "20UPGR92110514/DQ28_Jig1/000213"
                            },
                            {
                                "type": "ts",
                                "path": "20UPGR92110514/DQ28_Jig1/000215"
                            },
                            {
                                "type": "as",
                                "path": "20UPGR92110514/DQ28_Jig2/000210"
                            },
                            {
                                "type": "ds",
                                "path": "20UPGR92110514/DQ28_Jig2/000209"
                            },
                            {
                                "type": "ts",
                                "path": "20UPGR92110514/DQ28_Jig2/000211"
                            },
                            {
                                "type": "as",
                                "path": "20UPGR92110514/DQ28_Jig3/000205"
                            },
                            {
                                "type": "ds",
                                "path": "20UPGR92110514/DQ28_Jig3/000203"
                            },
                            {
                                "type": "ts",
                                "path": "20UPGR92110514/DQ28_Jig3/000207"
                            },
                            {
                                "type": "as",
                                "path": "20UPGR92110514/DQ28_Jig4/000200"
                            },
                            {
                                "type": "ds",
                                "path": "20UPGR92110514/DQ28_Jig4/000199"
                            },
                            {
                                "type": "ts",
                                "path": "20UPGR92110514/DQ28_Jig4/000201"
                            }
                        ]
                    }
                },
                {
                    "type": "module",
                    "name": "module_22",
                    "metadata": {
                        "serial": "20UPGM22110471",
                        "position": 23,
                        "paths": [
                            {
                                "type": "as",
                                "path": "20UPGM22110471/Jig1/010464"
                            },
                            {
                                "type": "ds",
                                "path": "20UPGM22110471/Jig1/010463"
                            },
                            {
                                "type": "ts",
                                "path": "20UPGM22110471/Jig1/010461"
                            }
                        ]
                    }
                },
                {
                    "type": "module",
                    "name": "module_23",
                    "metadata": {
                        "serial": "20UPGR92110514",
                        "position": 24,
                        "paths": [
                            {
                                "type": "as",
                                "path": "20UPGR92110514/DQ28_Jig1/000214"
                            },
                            {
                                "type": "ds",
                                "path": "20UPGR92110514/DQ28_Jig1/000213"
                            },
                            {
                                "type": "ts",
                                "path": "20UPGR92110514/DQ28_Jig1/000215"
                            },
                            {
                                "type": "as",
                                "path": "20UPGR92110514/DQ28_Jig2/000210"
                            },
                            {
                                "type": "ds",
                                "path": "20UPGR92110514/DQ28_Jig2/000209"
                            },
                            {
                                "type": "ts",
                                "path": "20UPGR92110514/DQ28_Jig2/000211"
                            },
                            {
                                "type": "as",
                                "path": "20UPGR92110514/DQ28_Jig3/000205"
                            },
                            {
                                "type": "ds",
                                "path": "20UPGR92110514/DQ28_Jig3/000203"
                            },
                            {
                                "type": "ts",
                                "path": "20UPGR92110514/DQ28_Jig3/000207"
                            },
                            {
                                "type": "as",
                                "path": "20UPGR92110514/DQ28_Jig4/000200"
                            },
                            {
                                "type": "ds",
                                "path": "20UPGR92110514/DQ28_Jig4/000199"
                            },
                            {
                                "type": "ts",
                                "path": "20UPGR92110514/DQ28_Jig4/000201"
                            }
                        ]
                    }
                },
                {
                    "type": "module",
                    "name": "module_24",
                    "metadata": {
                        "serial": "20UPGM22110471",
                        "position": 25,
                        "paths": [
                            {
                                "type": "as",
                                "path": "20UPGM22110471/Jig1/010464"
                            },
                            {
                                "type": "ds",
                                "path": "20UPGM22110471/Jig1/010463"
                            },
                            {
                                "type": "ts",
                                "path": "20UPGM22110471/Jig1/010461"
                            }
                        ]
                    }
                },
                {
                    "type": "module",
                    "name": "module_25",
                    "metadata": {
                        "serial": "20UPGR92110514",
                        "position": 26,
                        "paths": [
                            {
                                "type": "as",
                                "path": "20UPGR92110514/DQ28_Jig1/000214"
                            },
                            {
                                "type": "ds",
                                "path": "20UPGR92110514/DQ28_Jig1/000213"
                            },
                            {
                                "type": "ts",
                                "path": "20UPGR92110514/DQ28_Jig1/000215"
                            },
                            {
                                "type": "as",
                                "path": "20UPGR92110514/DQ28_Jig2/000210"
                            },
                            {
                                "type": "ds",
                                "path": "20UPGR92110514/DQ28_Jig2/000209"
                            },
                            {
                                "type": "ts",
                                "path": "20UPGR92110514/DQ28_Jig2/000211"
                            },
                            {
                                "type": "as",
                                "path": "20UPGR92110514/DQ28_Jig3/000205"
                            },
                            {
                                "type": "ds",
                                "path": "20UPGR92110514/DQ28_Jig3/000203"
                            },
                            {
                                "type": "ts",
                                "path": "20UPGR92110514/DQ28_Jig3/000207"
                            },
                            {
                                "type": "as",
                                "path": "20UPGR92110514/DQ28_Jig4/000200"
                            },
                            {
                                "type": "ds",
                                "path": "20UPGR92110514/DQ28_Jig4/000199"
                            },
                            {
                                "type": "ts",
                                "path": "20UPGR92110514/DQ28_Jig4/000201"
                            }
                        ]
                    }
                },
                {
                    "type": "module",
                    "name": "module_26",
                    "metadata": {
                        "serial": "20UPGM22110471",
                        "position": 27,
                        "paths": [
                            {
                                "type": "as",
                                "path": "20UPGM22110471/Jig1/010464"
                            },
                            {
                                "type": "ds",
                                "path": "20UPGM22110471/Jig1/010463"
                            },
                            {
                                "type": "ts",
                                "path": "20UPGM22110471/Jig1/010461"
                            }
                        ]
                    }
                },
                {
                    "type": "module",
                    "name": "module_27",
                    "metadata": {
                        "serial": "20UPGR92110514",
                        "position": 28,
                        "paths": [
                            {
                                "type": "as",
                                "path": "20UPGR92110514/DQ28_Jig1/000214"
                            },
                            {
                                "type": "ds",
                                "path": "20UPGR92110514/DQ28_Jig1/000213"
                            },
                            {
                                "type": "ts",
                                "path": "20UPGR92110514/DQ28_Jig1/000215"
                            },
                            {
                                "type": "as",
                                "path": "20UPGR92110514/DQ28_Jig2/000210"
                            },
                            {
                                "type": "ds",
                                "path": "20UPGR92110514/DQ28_Jig2/000209"
                            },
                            {
                                "type": "ts",
                                "path": "20UPGR92110514/DQ28_Jig2/000211"
                            },
                            {
                                "type": "as",
                                "path": "20UPGR92110514/DQ28_Jig3/000205"
                            },
                            {
                                "type": "ds",
                                "path": "20UPGR92110514/DQ28_Jig3/000203"
                            },
                            {
                                "type": "ts",
                                "path": "20UPGR92110514/DQ28_Jig3/000207"
                            },
                            {
                                "type": "as",
                                "path": "20UPGR92110514/DQ28_Jig4/000200"
                            },
                            {
                                "type": "ds",
                                "path": "20UPGR92110514/DQ28_Jig4/000199"
                            },
                            {
                                "type": "ts",
                                "path": "20UPGR92110514/DQ28_Jig4/000201"
                            }
                        ]
                    }
                },
                {
                    "type": "module",
                    "name": "module_28",
                    "metadata": {
                        "serial": "20UPGM22110471",
                        "position": 29,
                        "paths": [
                            {
                                "type": "as",
                                "path": "20UPGM22110471/Jig1/010464"
                            },
                            {
                                "type": "ds",
                                "path": "20UPGM22110471/Jig1/010463"
                            },
                            {
                                "type": "ts",
                                "path": "20UPGM22110471/Jig1/010461"
                            }
                        ]
                    }
                },
                {
                    "type": "module",
                    "name": "module_29",
                    "metadata": {
                        "serial": "20UPGR92110514",
                        "position": 30,
                        "paths": [
                            {
                                "type": "as",
                                "path": "20UPGR92110514/DQ28_Jig1/000214"
                            },
                            {
                                "type": "ds",
                                "path": "20UPGR92110514/DQ28_Jig1/000213"
                            },
                            {
                                "type": "ts",
                                "path": "20UPGR92110514/DQ28_Jig1/000215"
                            },
                            {
                                "type": "as",
                                "path": "20UPGR92110514/DQ28_Jig2/000210"
                            },
                            {
                                "type": "ds",
                                "path": "20UPGR92110514/DQ28_Jig2/000209"
                            },
                            {
                                "type": "ts",
                                "path": "20UPGR92110514/DQ28_Jig2/000211"
                            },
                            {
                                "type": "as",
                                "path": "20UPGR92110514/DQ28_Jig3/000205"
                            },
                            {
                                "type": "ds",
                                "path": "20UPGR92110514/DQ28_Jig3/000203"
                            },
                            {
                                "type": "ts",
                                "path": "20UPGR92110514/DQ28_Jig3/000207"
                            },
                            {
                                "type": "as",
                                "path": "20UPGR92110514/DQ28_Jig4/000200"
                            },
                            {
                                "type": "ds",
                                "path": "20UPGR92110514/DQ28_Jig4/000199"
                            },
                            {
                                "type": "ts",
                                "path": "20UPGR92110514/DQ28_Jig4/000201"
                            }
                        ]
                    }
                },
                {
                    "type": "module",
                    "name": "module_30",
                    "metadata": {
                        "serial": "20UPGM22110471",
                        "position": 31,
                        "paths": [
                            {
                                "type": "as",
                                "path": "20UPGM22110471/Jig1/010464"
                            },
                            {
                                "type": "ds",
                                "path": "20UPGM22110471/Jig1/010463"
                            },
                            {
                                "type": "ts",
                                "path": "20UPGM22110471/Jig1/010461"
                            }
                        ]
                    }
                },
                {
                    "type": "module",
                    "name": "module_31",
                    "metadata": {
                        "serial": "20UPGR92110514",
                        "position": 32,
                        "paths": [
                            {
                                "type": "as",
                                "path": "20UPGR92110514/DQ28_Jig1/000214"
                            },
                            {
                                "type": "ds",
                                "path": "20UPGR92110514/DQ28_Jig1/000213"
                            },
                            {
                                "type": "ts",
                                "path": "20UPGR92110514/DQ28_Jig1/000215"
                            },
                            {
                                "type": "as",
                                "path": "20UPGR92110514/DQ28_Jig2/000210"
                            },
                            {
                                "type": "ds",
                                "path": "20UPGR92110514/DQ28_Jig2/000209"
                            },
                            {
                                "type": "ts",
                                "path": "20UPGR92110514/DQ28_Jig2/000211"
                            },
                            {
                                "type": "as",
                                "path": "20UPGR92110514/DQ28_Jig3/000205"
                            },
                            {
                                "type": "ds",
                                "path": "20UPGR92110514/DQ28_Jig3/000203"
                            },
                            {
                                "type": "ts",
                                "path": "20UPGR92110514/DQ28_Jig3/000207"
                            },
                            {
                                "type": "as",
                                "path": "20UPGR92110514/DQ28_Jig4/000200"
                            },
                            {
                                "type": "ds",
                                "path": "20UPGR92110514/DQ28_Jig4/000199"
                            },
                            {
                                "type": "ts",
                                "path": "20UPGR92110514/DQ28_Jig4/000201"
                            }
                        ]
                    }
                },
                {
                    "type": "module",
                    "name": "module_32",
                    "metadata": {
                        "serial": "20UPGM22110471",
                        "position": 33,
                        "paths": [
                            {
                                "type": "as",
                                "path": "20UPGM22110471/Jig1/010464"
                            },
                            {
                                "type": "ds",
                                "path": "20UPGM22110471/Jig1/010463"
                            },
                            {
                                "type": "ts",
                                "path": "20UPGM22110471/Jig1/010461"
                            }
                        ]
                    }
                },
                {
                    "type": "module",
                    "name": "module_33",
                    "metadata": {
                        "serial": "20UPGR92110514",
                        "position": 34,
                        "paths": [
                            {
                                "type": "as",
                                "path": "20UPGR92110514/DQ28_Jig1/000214"
                            },
                            {
                                "type": "ds",
                                "path": "20UPGR92110514/DQ28_Jig1/000213"
                            },
                            {
                                "type": "ts",
                                "path": "20UPGR92110514/DQ28_Jig1/000215"
                            },
                            {
                                "type": "as",
                                "path": "20UPGR92110514/DQ28_Jig2/000210"
                            },
                            {
                                "type": "ds",
                                "path": "20UPGR92110514/DQ28_Jig2/000209"
                            },
                            {
                                "type": "ts",
                                "path": "20UPGR92110514/DQ28_Jig2/000211"
                            },
                            {
                                "type": "as",
                                "path": "20UPGR92110514/DQ28_Jig3/000205"
                            },
                            {
                                "type": "ds",
                                "path": "20UPGR92110514/DQ28_Jig3/000203"
                            },
                            {
                                "type": "ts",
                                "path": "20UPGR92110514/DQ28_Jig3/000207"
                            },
                            {
                                "type": "as",
                                "path": "20UPGR92110514/DQ28_Jig4/000200"
                            },
                            {
                                "type": "ds",
                                "path": "20UPGR92110514/DQ28_Jig4/000199"
                            },
                            {
                                "type": "ts",
                                "path": "20UPGR92110514/DQ28_Jig4/000201"
                            }
                        ]
                    }
                },
                {
                    "type": "module",
                    "name": "module_34",
                    "metadata": {
                        "serial": "20UPGM22110471",
                        "position": 35,
                        "paths": [
                            {
                                "type": "as",
                                "path": "20UPGM22110471/Jig1/010464"
                            },
                            {
                                "type": "ds",
                                "path": "20UPGM22110471/Jig1/010463"
                            },
                            {
                                "type": "ts",
                                "path": "20UPGM22110471/Jig1/010461"
                            }
                        ]
                    }
                },
                {
                    "type": "module",
                    "name": "module_35",
                    "metadata": {
                        "serial": "20UPGR92110514",
                        "position": 36,
                        "paths": [
                            {
                                "type": "as",
                                "path": "20UPGR92110514/DQ28_Jig1/000214"
                            },
                            {
                                "type": "ds",
                                "path": "20UPGR92110514/DQ28_Jig1/000213"
                            },
                            {
                                "type": "ts",
                                "path": "20UPGR92110514/DQ28_Jig1/000215"
                            },
                            {
                                "type": "as",
                                "path": "20UPGR92110514/DQ28_Jig2/000210"
                            },
                            {
                                "type": "ds",
                                "path": "20UPGR92110514/DQ28_Jig2/000209"
                            },
                            {
                                "type": "ts",
                                "path": "20UPGR92110514/DQ28_Jig2/000211"
                            },
                            {
                                "type": "as",
                                "path": "20UPGR92110514/DQ28_Jig3/000205"
                            },
                            {
                                "type": "ds",
                                "path": "20UPGR92110514/DQ28_Jig3/000203"
                            },
                            {
                                "type": "ts",
                                "path": "20UPGR92110514/DQ28_Jig3/000207"
                            },
                            {
                                "type": "as",
                                "path": "20UPGR92110514/DQ28_Jig4/000200"
                            },
                            {
                                "type": "ds",
                                "path": "20UPGR92110514/DQ28_Jig4/000199"
                            },
                            {
                                "type": "ts",
                                "path": "20UPGR92110514/DQ28_Jig4/000201"
                            }
                        ]
                    }
                }
            ]
        }
    ]
}