{
    "commToolName": "ic-over-netio",
    "ConfigurationDB": "http://localhost:5000",
    "configure": 0,
    "config_path": "",
    "debug": false,
    "configInDB":false,
    "flx_G": "0",
    "flx_d": "0",
    "optoboard_serial": "4400072",
    "test_mode": false,
    "vtrx_v": "1.3"
}