{
  "name": "itk-demo-felix Development Container",
  //"image": "gitlab-registry.cern.ch/atlas-itk-pixel-systemtest/itk-demo-sw/containers/devcontainers/base-cc7:latest",
  // "build": { "dockerfile": "Dockerfile" },
  "dockerComposeFile": "docker-compose.yml",
	"service": "app",
	"workspaceFolder": "/workspace/${localWorkspaceFolderBasename}",

  // Use this environment variable if you need to bind mount your local source code into a new container.
	"remoteEnv": {
		"LOCAL_WORKSPACE_FOLDER": "${localWorkspaceFolder}"
	},

  // Features to add to the dev container. More info: https://containers.dev/features.
  // "features": {"ms-python.python"},

  // Use 'forwardPorts' to make a list of ports inside the container available locally.
  // "forwardPorts": [],

  // Configure tool-specific properties.
  "customizations": {
    "vscode": {
      "extensions": [
        "ms-azuretools.vscode-docker",
        "ms-python.python",
        "tamasfe.even-better-toml"]
    }
  }

  //use Docker volume instead of mounting local directory
  //"workspaceMount": "source=itk-demo-felix-volume,target=/workspace,type=volume",

  // Uncomment to connect as root instead. More info: https://aka.ms/dev-containers-non-root.
  // "remoteUser": "itkpix"
  // "containerUser": "root"

  // Use 'postCreateCommand' to run commands after the container is created.
  // "postCreateCommand": "docker ps",

}
