{
	"1": "Successfully executed",
	"2": "The sent type does not exist for the specified table, please check the type property and try again.",
	"3": "The requested table does not exist, please check the table property and try again.",
	"100": "Item [id] was not found in [table] table",
	"101": "Name [name] already in use",
	"103": "Task failed, one or more of the given datasets do not exist. See logging for details and try again.",
	"104": "Task failed, one or more of the given datasets were already in the runkey. See logging for details and try again.",
	"105": "The configuration [id] could not be deleted, because it is part of a runkey.",
	"106": "The chosen DAQ is not in the list of available DAQS, please check your input and try again.",
	"107": "The send configuration does not match the expected type.",
	"108": "The chosen parent-runkey does not exist.",
	"109": "To set a configuration-tag a type is required.",
	"110": "A configuration/connectivity dataset can not be added multiple times into a runkey.",
	"200": "The endpoint [url] expects a different kind of transporter-object",
	"201": "The endpoint [url] does not exist",
	"400": "The [url]-endpoint expects different data. Please refer to the documentation for the [url]-endpoint for additional information.",
	"404": "endpoint [url] not found, Please refer to the documentation for an overview of available endpoints",
	"500": "Internal server error, please contact the admin and report this problem."
}