%TF.GenerationSoftware,Altium Limited,Altium Designer,21.8.1 (53)*%
G04 Layer_Color=32896*
%FSLAX26Y26*%
%MOIN*%
%TF.SameCoordinates,05626266-558E-4A93-A1D1-DBCDE1204E88*%
%TF.FilePolarity,Positive*%
%TF.FileFunction,Other,Mechanical_8*%
%TF.Part,Single*%
G01*
G75*
%TA.AperFunction,NonConductor*%
%ADD60C,0.003937*%
%ADD61C,0.001968*%
D60*
X177165Y579428D02*
Y599113D01*
X157480Y579428D02*
X177165D01*
X196850D01*
X177165Y559742D02*
Y579428D01*
Y204427D02*
Y224112D01*
X157480Y204427D02*
X177165D01*
X196850D01*
X177165Y184742D02*
Y204427D01*
X152165Y266927D02*
Y286612D01*
X132480Y266927D02*
X152165D01*
X171850D01*
X152165Y247242D02*
Y266927D01*
X202165D02*
Y286612D01*
X182480Y266927D02*
X202165D01*
X221850D01*
X202165Y247242D02*
Y266927D01*
X152165Y316927D02*
Y336612D01*
X132480Y316927D02*
X152165D01*
X171850D01*
X152165Y297242D02*
Y316927D01*
X202165D02*
Y336612D01*
X182480Y316927D02*
X202165D01*
X221850D01*
X202165Y297242D02*
Y316927D01*
X152165Y366927D02*
Y386612D01*
X132480Y366927D02*
X152165D01*
X171850D01*
X152165Y347242D02*
Y366927D01*
X202165D02*
Y386612D01*
X182480Y366927D02*
X202165D01*
X221850D01*
X202165Y347242D02*
Y366927D01*
X152165Y516928D02*
Y536612D01*
X132480Y516928D02*
X152165D01*
X171850D01*
X152165Y497242D02*
Y516928D01*
X202165D02*
Y536612D01*
X182480Y516928D02*
X202165D01*
X221850D01*
X202165Y497242D02*
Y516928D01*
X152165Y466927D02*
Y486613D01*
X132480Y466927D02*
X152165D01*
X171850D01*
X152165Y447242D02*
Y466927D01*
X202165D02*
Y486613D01*
X182480Y466927D02*
X202165D01*
X221850D01*
X202165Y447242D02*
Y466927D01*
X152165Y416927D02*
Y436613D01*
X132480Y416927D02*
X152165D01*
X171850D01*
X152165Y397242D02*
Y416927D01*
X202165D02*
Y436613D01*
X182480Y416927D02*
X202165D01*
X221850D01*
X202165Y397242D02*
Y416927D01*
X177165Y391927D02*
X191085Y405847D01*
X163246D02*
X177165Y391927D01*
X191085Y378008D01*
X163246D02*
X177165Y391927D01*
X1202756Y193898D02*
X1234252D01*
X1202756Y249016D02*
X1234252D01*
X1202756Y193898D02*
X1234252D01*
X1202756Y170276D02*
Y193898D01*
Y170276D02*
X1234252D01*
Y193898D01*
X1202756Y249016D02*
Y272638D01*
X1234252D01*
Y249016D02*
Y272638D01*
X1202756Y249016D02*
X1234252D01*
X1198819Y260827D02*
X1218504D01*
X1238189D01*
X1218504Y162401D02*
Y182087D01*
X1198819D02*
X1218504D01*
X1238189D01*
X1206693Y209646D02*
X1230315D01*
Y233268D01*
X1206693D02*
X1230315D01*
X1206693Y209646D02*
Y233268D01*
X1181102Y209646D02*
Y233268D01*
X1206693D01*
Y209646D02*
Y233268D01*
X1181102Y209646D02*
X1206693D01*
X1230315D02*
Y233268D01*
X1255906D01*
Y209646D02*
Y233268D01*
X1230315Y209646D02*
X1255906D01*
X1193898Y201772D02*
Y221457D01*
X1174213D02*
X1193898D01*
Y241142D01*
X1243110Y221457D02*
Y241142D01*
Y221457D02*
X1262795D01*
X1243110Y201772D02*
Y221457D01*
X1218504Y260827D02*
Y280512D01*
X1198819Y221457D02*
X1218504D01*
X1238189D01*
X1218504D02*
Y241142D01*
Y201772D02*
Y221457D01*
X177165Y1427853D02*
Y1447538D01*
X157480Y1427853D02*
X177165D01*
X196850D01*
X177165Y1408168D02*
Y1427853D01*
Y1052852D02*
Y1072537D01*
X157480Y1052852D02*
X177165D01*
X196850D01*
X177165Y1033167D02*
Y1052852D01*
X152165Y1115352D02*
Y1135038D01*
X132480Y1115352D02*
X152165D01*
X171850D01*
X152165Y1095668D02*
Y1115352D01*
X202165D02*
Y1135038D01*
X182480Y1115352D02*
X202165D01*
X221850D01*
X202165Y1095668D02*
Y1115352D01*
X152165Y1165353D02*
Y1185038D01*
X132480Y1165353D02*
X152165D01*
X171850D01*
X152165Y1145668D02*
Y1165353D01*
X202165D02*
Y1185038D01*
X182480Y1165353D02*
X202165D01*
X221850D01*
X202165Y1145668D02*
Y1165353D01*
X152165Y1215353D02*
Y1235038D01*
X132480Y1215353D02*
X152165D01*
X171850D01*
X152165Y1195668D02*
Y1215353D01*
X202165D02*
Y1235038D01*
X182480Y1215353D02*
X202165D01*
X221850D01*
X202165Y1195668D02*
Y1215353D01*
X152165Y1365353D02*
Y1385038D01*
X132480Y1365353D02*
X152165D01*
X171850D01*
X152165Y1345668D02*
Y1365353D01*
X202165D02*
Y1385038D01*
X182480Y1365353D02*
X202165D01*
X221850D01*
X202165Y1345668D02*
Y1365353D01*
X152165Y1315353D02*
Y1335038D01*
X132480Y1315353D02*
X152165D01*
X171850D01*
X152165Y1295668D02*
Y1315353D01*
X202165D02*
Y1335038D01*
X182480Y1315353D02*
X202165D01*
X221850D01*
X202165Y1295668D02*
Y1315353D01*
X152165Y1265353D02*
Y1285038D01*
X132480Y1265353D02*
X152165D01*
X171850D01*
X152165Y1245668D02*
Y1265353D01*
X202165D02*
Y1285038D01*
X182480Y1265353D02*
X202165D01*
X221850D01*
X202165Y1245668D02*
Y1265353D01*
X177165Y1240353D02*
X191085Y1254272D01*
X163246D02*
X177165Y1240353D01*
X191085Y1226433D01*
X163246D02*
X177165Y1240353D01*
X730445Y833958D02*
X761941D01*
X730445Y889076D02*
X761941D01*
X730445Y833958D02*
X761941D01*
X730445Y810336D02*
Y833958D01*
Y810336D02*
X761941D01*
Y833958D01*
X730445Y889076D02*
Y912698D01*
X761941D01*
Y889076D02*
Y912698D01*
X730445Y889076D02*
X761941D01*
X726508Y900887D02*
X746193D01*
X765878D01*
X746193Y802462D02*
Y822147D01*
X726508D02*
X746193D01*
X765878D01*
X734382Y849706D02*
X758004D01*
Y873328D01*
X734382D02*
X758004D01*
X734382Y849706D02*
Y873328D01*
X708792Y849706D02*
Y873328D01*
X734382D01*
Y849706D02*
Y873328D01*
X708792Y849706D02*
X734382D01*
X758004D02*
Y873328D01*
X783595D01*
Y849706D02*
Y873328D01*
X758004Y849706D02*
X783595D01*
X721587Y841832D02*
Y861517D01*
X701902D02*
X721587D01*
Y881202D01*
X770799Y861517D02*
Y881202D01*
Y861517D02*
X790485D01*
X770799Y841832D02*
Y861517D01*
X746193Y900887D02*
Y920572D01*
X726508Y861517D02*
X746193D01*
X765878D01*
X746193D02*
Y881202D01*
Y841832D02*
Y861517D01*
X1154528Y1279529D02*
X1186024D01*
X1154528Y1334647D02*
X1186024D01*
X1154528Y1279529D02*
X1186024D01*
X1154528Y1255907D02*
Y1279529D01*
Y1255907D02*
X1186024D01*
Y1279529D01*
X1154528Y1334647D02*
Y1358269D01*
X1186024D01*
Y1334647D02*
Y1358269D01*
X1154528Y1334647D02*
X1186024D01*
X1150591Y1346458D02*
X1170276D01*
X1189961D01*
X1170276Y1248033D02*
Y1267718D01*
X1150591D02*
X1170276D01*
X1189961D01*
X1158465Y1295277D02*
X1182087D01*
Y1318899D01*
X1158465D02*
X1182087D01*
X1158465Y1295277D02*
Y1318899D01*
X1132874Y1295277D02*
Y1318899D01*
X1158465D01*
Y1295277D02*
Y1318899D01*
X1132874Y1295277D02*
X1158465D01*
X1182087D02*
Y1318899D01*
X1207677D01*
Y1295277D02*
Y1318899D01*
X1182087Y1295277D02*
X1207677D01*
X1145669Y1287403D02*
Y1307088D01*
X1125984D02*
X1145669D01*
Y1326773D01*
X1194882Y1307088D02*
Y1326773D01*
Y1307088D02*
X1214567D01*
X1194882Y1287403D02*
Y1307088D01*
X1170276Y1346458D02*
Y1366143D01*
X1150591Y1307088D02*
X1170276D01*
X1189961D01*
X1170276D02*
Y1326773D01*
Y1287403D02*
Y1307088D01*
X1696654Y873032D02*
X1716339D01*
Y892716D01*
Y873032D02*
X1736024D01*
X1716339Y853346D02*
Y873032D01*
X1696654Y922244D02*
X1716339D01*
Y941929D01*
Y922244D02*
X1736024D01*
X1716339Y902559D02*
Y922244D01*
X1696654Y823819D02*
X1716339D01*
Y843504D01*
Y823819D02*
X1736024D01*
X1716339Y804134D02*
Y823819D01*
D61*
X1390748Y191929D02*
Y211614D01*
X1371063D02*
X1390748D01*
X1410433D01*
X1390748D02*
Y231299D01*
X1385827Y105315D02*
Y132874D01*
X1375984D02*
X1385827D01*
X1375984Y105315D02*
Y132874D01*
Y105315D02*
X1385827D01*
Y290354D02*
Y317913D01*
X1375984Y290354D02*
X1385827D01*
X1375984D02*
Y317913D01*
X1385827D01*
X1366142Y105315D02*
Y132874D01*
X1356299D02*
X1366142D01*
X1356299Y105315D02*
Y132874D01*
Y105315D02*
X1366142D01*
Y290354D02*
Y317913D01*
X1356299Y290354D02*
X1366142D01*
X1356299D02*
Y317913D01*
X1366142D01*
X1346457Y105315D02*
Y132874D01*
X1336614D02*
X1346457D01*
X1336614Y105315D02*
Y132874D01*
Y105315D02*
X1346457D01*
Y290354D02*
Y317913D01*
X1336614Y290354D02*
X1346457D01*
X1336614D02*
Y317913D01*
X1346457D01*
X1326772Y105315D02*
Y132874D01*
X1316929D02*
X1326772D01*
X1316929Y105315D02*
Y132874D01*
Y105315D02*
X1326772D01*
Y290354D02*
Y317913D01*
X1316929Y290354D02*
X1326772D01*
X1316929D02*
Y317913D01*
X1326772D01*
X1405512Y105315D02*
Y132874D01*
X1395669D02*
X1405512D01*
X1395669Y105315D02*
Y132874D01*
Y105315D02*
X1405512D01*
Y290354D02*
Y317913D01*
X1395669Y290354D02*
X1405512D01*
X1395669D02*
Y317913D01*
X1405512D01*
X1425197Y105315D02*
Y132874D01*
X1415354D02*
X1425197D01*
X1415354Y105315D02*
Y132874D01*
Y105315D02*
X1425197D01*
Y290354D02*
Y317913D01*
X1415354Y290354D02*
X1425197D01*
X1415354D02*
Y317913D01*
X1425197D01*
X1444882Y105315D02*
Y132874D01*
X1435039D02*
X1444882D01*
X1435039Y105315D02*
Y132874D01*
Y105315D02*
X1444882D01*
Y290354D02*
Y317913D01*
X1435039Y290354D02*
X1444882D01*
X1435039D02*
Y317913D01*
X1444882D01*
X1464567Y105315D02*
Y132874D01*
X1454724D02*
X1464567D01*
X1454724Y105315D02*
Y132874D01*
Y105315D02*
X1464567D01*
Y290354D02*
Y317913D01*
X1454724Y290354D02*
X1464567D01*
X1454724D02*
Y317913D01*
X1464567D01*
X1469488Y206693D02*
X1497047D01*
X1469488Y196850D02*
Y206693D01*
Y196850D02*
X1497047D01*
Y206693D01*
X1284449D02*
X1312008D01*
Y196850D02*
Y206693D01*
X1284449Y196850D02*
X1312008D01*
X1284449D02*
Y206693D01*
X1469488Y187008D02*
X1497047D01*
X1469488Y177165D02*
Y187008D01*
Y177165D02*
X1497047D01*
Y187008D01*
X1284449D02*
X1312008D01*
Y177165D02*
Y187008D01*
X1284449Y177165D02*
X1312008D01*
X1284449D02*
Y187008D01*
X1469488Y167323D02*
X1497047D01*
X1469488Y157480D02*
Y167323D01*
Y157480D02*
X1497047D01*
Y167323D01*
X1284449D02*
X1312008D01*
Y157480D02*
Y167323D01*
X1284449Y157480D02*
X1312008D01*
X1284449D02*
Y167323D01*
X1469488Y147638D02*
X1497047D01*
X1469488Y137795D02*
Y147638D01*
Y137795D02*
X1497047D01*
Y147638D01*
X1284449D02*
X1312008D01*
Y137795D02*
Y147638D01*
X1284449Y137795D02*
X1312008D01*
X1284449D02*
Y147638D01*
X1469488Y226378D02*
X1497047D01*
X1469488Y216536D02*
Y226378D01*
Y216536D02*
X1497047D01*
Y226378D01*
X1284449D02*
X1312008D01*
Y216536D02*
Y226378D01*
X1284449Y216536D02*
X1312008D01*
X1284449D02*
Y226378D01*
X1469488Y246063D02*
X1497047D01*
X1469488Y236220D02*
Y246063D01*
Y236220D02*
X1497047D01*
Y246063D01*
X1284449D02*
X1312008D01*
Y236220D02*
Y246063D01*
X1284449Y236220D02*
X1312008D01*
X1284449D02*
Y246063D01*
X1469488Y265748D02*
X1497047D01*
X1469488Y255905D02*
Y265748D01*
Y255905D02*
X1497047D01*
Y265748D01*
X1284449D02*
X1312008D01*
Y255905D02*
Y265748D01*
X1284449Y255905D02*
X1312008D01*
X1284449D02*
Y265748D01*
X1469488Y285433D02*
X1497047D01*
X1469488Y275591D02*
Y285433D01*
Y275591D02*
X1497047D01*
Y285433D01*
X1284449D02*
X1312008D01*
Y275591D02*
Y285433D01*
X1284449Y275591D02*
X1312008D01*
X1284449D02*
Y285433D01*
X1319882Y140748D02*
Y282480D01*
X1461614D01*
Y140748D02*
Y282480D01*
X1319882Y140748D02*
X1461614D01*
X1321850Y119094D02*
X1326772Y105315D01*
X1316929D02*
X1321850Y119094D01*
X1284449Y137795D02*
X1298228Y142717D01*
X1284449Y147638D02*
X1298228Y142717D01*
X1321850Y304134D02*
X1326772Y317913D01*
X1316929D02*
X1321850Y304134D01*
X1483268Y142717D02*
X1497047Y147638D01*
X1483268Y142717D02*
X1497047Y137795D01*
X1284449Y157480D02*
X1298228Y162402D01*
X1284449Y167323D02*
X1298228Y162402D01*
X1284449Y177165D02*
X1298228Y182087D01*
X1284449Y187008D02*
X1298228Y182087D01*
X1284449Y196850D02*
X1298228Y201772D01*
X1284449Y206693D02*
X1298228Y201772D01*
X1284449Y216536D02*
X1298228Y221457D01*
X1284449Y226378D02*
X1298228Y221457D01*
X1284449Y236220D02*
X1298228Y241142D01*
X1284449Y246063D02*
X1298228Y241142D01*
X1284449Y255905D02*
X1298228Y260827D01*
X1284449Y265748D02*
X1298228Y260827D01*
X1284449Y275591D02*
X1298228Y280512D01*
X1284449Y285433D02*
X1298228Y280512D01*
X1341535Y119094D02*
X1346457Y105315D01*
X1336614D02*
X1341535Y119094D01*
X1361220D02*
X1366142Y105315D01*
X1356299D02*
X1361220Y119094D01*
X1380906D02*
X1385827Y105315D01*
X1375984D02*
X1380906Y119094D01*
X1400591D02*
X1405512Y105315D01*
X1395669D02*
X1400591Y119094D01*
X1420276D02*
X1425197Y105315D01*
X1415354D02*
X1420276Y119094D01*
X1439961D02*
X1444882Y105315D01*
X1435039D02*
X1439961Y119094D01*
X1459646D02*
X1464567Y105315D01*
X1454724D02*
X1459646Y119094D01*
X1341535Y304134D02*
X1346457Y317913D01*
X1336614D02*
X1341535Y304134D01*
X1361220D02*
X1366142Y317913D01*
X1356299D02*
X1361220Y304134D01*
X1380906D02*
X1385827Y317913D01*
X1375984D02*
X1380906Y304134D01*
X1400591D02*
X1405512Y317913D01*
X1395669D02*
X1400591Y304134D01*
X1420276D02*
X1425197Y317913D01*
X1415354D02*
X1420276Y304134D01*
X1439961D02*
X1444882Y317913D01*
X1435039D02*
X1439961Y304134D01*
X1459646D02*
X1464567Y317913D01*
X1454724D02*
X1459646Y304134D01*
X1483268Y162402D02*
X1497047Y167323D01*
X1483268Y162402D02*
X1497047Y157480D01*
X1483268Y182087D02*
X1497047Y187008D01*
X1483268Y182087D02*
X1497047Y177165D01*
X1483268Y201772D02*
X1497047Y206693D01*
X1483268Y201772D02*
X1497047Y196850D01*
X1483268Y221457D02*
X1497047Y226378D01*
X1483268Y221457D02*
X1497047Y216536D01*
X1483268Y241142D02*
X1497047Y246063D01*
X1483268Y241142D02*
X1497047Y236220D01*
X1483268Y260827D02*
X1497047Y265748D01*
X1483268Y260827D02*
X1497047Y255905D01*
X1483268Y280512D02*
X1497047Y285433D01*
X1483268Y280512D02*
X1497047Y275591D01*
X534452Y504214D02*
X554137D01*
X573822D01*
X554137Y484529D02*
Y504214D01*
Y523899D01*
X434255Y586694D02*
X564176D01*
Y536694D02*
Y586694D01*
X434255Y536694D02*
X564176D01*
X434255D02*
Y586694D01*
X544097Y421733D02*
X674019D01*
X544097D02*
Y471733D01*
X674019D01*
Y421733D02*
Y471733D01*
X589373Y446733D02*
X609058D01*
X628743D01*
X609058Y427048D02*
Y446733D01*
Y466418D01*
X479531Y561694D02*
X499216D01*
X518901D01*
X499216Y542009D02*
Y561694D01*
Y581379D01*
X929448Y825100D02*
Y844785D01*
X909763D02*
X929448D01*
X949133D01*
X929448D02*
Y864470D01*
X924527Y738486D02*
Y766045D01*
X914685D02*
X924527D01*
X914685Y738486D02*
Y766045D01*
Y738486D02*
X924527D01*
Y923525D02*
Y951084D01*
X914685Y923525D02*
X924527D01*
X914685D02*
Y951084D01*
X924527D01*
X904842Y738486D02*
Y766045D01*
X895000D02*
X904842D01*
X895000Y738486D02*
Y766045D01*
Y738486D02*
X904842D01*
Y923525D02*
Y951084D01*
X895000Y923525D02*
X904842D01*
X895000D02*
Y951084D01*
X904842D01*
X885157Y738486D02*
Y766045D01*
X875314D02*
X885157D01*
X875314Y738486D02*
Y766045D01*
Y738486D02*
X885157D01*
Y923525D02*
Y951084D01*
X875314Y923525D02*
X885157D01*
X875314D02*
Y951084D01*
X885157D01*
X865472Y738486D02*
Y766045D01*
X855630D02*
X865472D01*
X855630Y738486D02*
Y766045D01*
Y738486D02*
X865472D01*
Y923525D02*
Y951084D01*
X855630Y923525D02*
X865472D01*
X855630D02*
Y951084D01*
X865472D01*
X944212Y738486D02*
Y766045D01*
X934370D02*
X944212D01*
X934370Y738486D02*
Y766045D01*
Y738486D02*
X944212D01*
Y923525D02*
Y951084D01*
X934370Y923525D02*
X944212D01*
X934370D02*
Y951084D01*
X944212D01*
X963897Y738486D02*
Y766045D01*
X954055D02*
X963897D01*
X954055Y738486D02*
Y766045D01*
Y738486D02*
X963897D01*
Y923525D02*
Y951084D01*
X954055Y923525D02*
X963897D01*
X954055D02*
Y951084D01*
X963897D01*
X983582Y738486D02*
Y766045D01*
X973740D02*
X983582D01*
X973740Y738486D02*
Y766045D01*
Y738486D02*
X983582D01*
Y923525D02*
Y951084D01*
X973740Y923525D02*
X983582D01*
X973740D02*
Y951084D01*
X983582D01*
X1003267Y738486D02*
Y766045D01*
X993425D02*
X1003267D01*
X993425Y738486D02*
Y766045D01*
Y738486D02*
X1003267D01*
Y923525D02*
Y951084D01*
X993425Y923525D02*
X1003267D01*
X993425D02*
Y951084D01*
X1003267D01*
X1008189Y839864D02*
X1035748D01*
X1008189Y830021D02*
Y839864D01*
Y830021D02*
X1035748D01*
Y839864D01*
X823149D02*
X850708D01*
Y830021D02*
Y839864D01*
X823149Y830021D02*
X850708D01*
X823149D02*
Y839864D01*
X1008189Y820178D02*
X1035748D01*
X1008189Y810336D02*
Y820178D01*
Y810336D02*
X1035748D01*
Y820178D01*
X823149D02*
X850708D01*
Y810336D02*
Y820178D01*
X823149Y810336D02*
X850708D01*
X823149D02*
Y820178D01*
X1008189Y800494D02*
X1035748D01*
X1008189Y790651D02*
Y800494D01*
Y790651D02*
X1035748D01*
Y800494D01*
X823149D02*
X850708D01*
Y790651D02*
Y800494D01*
X823149Y790651D02*
X850708D01*
X823149D02*
Y800494D01*
X1008189Y780808D02*
X1035748D01*
X1008189Y770966D02*
Y780808D01*
Y770966D02*
X1035748D01*
Y780808D01*
X823149D02*
X850708D01*
Y770966D02*
Y780808D01*
X823149Y770966D02*
X850708D01*
X823149D02*
Y780808D01*
X1008189Y859549D02*
X1035748D01*
X1008189Y849706D02*
Y859549D01*
Y849706D02*
X1035748D01*
Y859549D01*
X823149D02*
X850708D01*
Y849706D02*
Y859549D01*
X823149Y849706D02*
X850708D01*
X823149D02*
Y859549D01*
X1008189Y879234D02*
X1035748D01*
X1008189Y869391D02*
Y879234D01*
Y869391D02*
X1035748D01*
Y879234D01*
X823149D02*
X850708D01*
Y869391D02*
Y879234D01*
X823149Y869391D02*
X850708D01*
X823149D02*
Y879234D01*
X1008189Y898919D02*
X1035748D01*
X1008189Y889076D02*
Y898919D01*
Y889076D02*
X1035748D01*
Y898919D01*
X823149D02*
X850708D01*
Y889076D02*
Y898919D01*
X823149Y889076D02*
X850708D01*
X823149D02*
Y898919D01*
X1008189Y918604D02*
X1035748D01*
X1008189Y908761D02*
Y918604D01*
Y908761D02*
X1035748D01*
Y918604D01*
X823149D02*
X850708D01*
Y908761D02*
Y918604D01*
X823149Y908761D02*
X850708D01*
X823149D02*
Y918604D01*
X858582Y773919D02*
Y915651D01*
X1000314D01*
Y773919D02*
Y915651D01*
X858582Y773919D02*
X1000314D01*
X860551Y752265D02*
X865472Y738486D01*
X855630D02*
X860551Y752265D01*
X823149Y770966D02*
X836929Y775887D01*
X823149Y780808D02*
X836929Y775887D01*
X860551Y937304D02*
X865472Y951084D01*
X855630D02*
X860551Y937304D01*
X1021968Y775887D02*
X1035748Y780808D01*
X1021968Y775887D02*
X1035748Y770966D01*
X823149Y790651D02*
X836929Y795572D01*
X823149Y800494D02*
X836929Y795572D01*
X823149Y810336D02*
X836929Y815257D01*
X823149Y820178D02*
X836929Y815257D01*
X823149Y830021D02*
X836929Y834942D01*
X823149Y839864D02*
X836929Y834942D01*
X823149Y849706D02*
X836929Y854627D01*
X823149Y859549D02*
X836929Y854627D01*
X823149Y869391D02*
X836929Y874312D01*
X823149Y879234D02*
X836929Y874312D01*
X823149Y889076D02*
X836929Y893997D01*
X823149Y898919D02*
X836929Y893997D01*
X823149Y908761D02*
X836929Y913682D01*
X823149Y918604D02*
X836929Y913682D01*
X880236Y752265D02*
X885157Y738486D01*
X875314D02*
X880236Y752265D01*
X899921D02*
X904842Y738486D01*
X895000D02*
X899921Y752265D01*
X919606D02*
X924527Y738486D01*
X914685D02*
X919606Y752265D01*
X939291D02*
X944212Y738486D01*
X934370D02*
X939291Y752265D01*
X958976D02*
X963897Y738486D01*
X954055D02*
X958976Y752265D01*
X978661D02*
X983582Y738486D01*
X973740D02*
X978661Y752265D01*
X998346D02*
X1003267Y738486D01*
X993425D02*
X998346Y752265D01*
X880236Y937304D02*
X885157Y951084D01*
X875314D02*
X880236Y937304D01*
X899921D02*
X904842Y951084D01*
X895000D02*
X899921Y937304D01*
X919606D02*
X924527Y951084D01*
X914685D02*
X919606Y937304D01*
X939291D02*
X944212Y951084D01*
X934370D02*
X939291Y937304D01*
X958976D02*
X963897Y951084D01*
X954055D02*
X958976Y937304D01*
X978661D02*
X983582Y951084D01*
X973740D02*
X978661Y937304D01*
X998346D02*
X1003267Y951084D01*
X993425D02*
X998346Y937304D01*
X1021968Y795572D02*
X1035748Y800494D01*
X1021968Y795572D02*
X1035748Y790651D01*
X1021968Y815257D02*
X1035748Y820178D01*
X1021968Y815257D02*
X1035748Y810336D01*
X1021968Y834942D02*
X1035748Y839864D01*
X1021968Y834942D02*
X1035748Y830021D01*
X1021968Y854627D02*
X1035748Y859549D01*
X1021968Y854627D02*
X1035748Y849706D01*
X1021968Y874312D02*
X1035748Y879234D01*
X1021968Y874312D02*
X1035748Y869391D01*
X1021968Y893997D02*
X1035748Y898919D01*
X1021968Y893997D02*
X1035748Y889076D01*
X1021968Y913682D02*
X1035748Y918604D01*
X1021968Y913682D02*
X1035748Y908761D01*
X1212598Y901575D02*
Y921260D01*
Y881890D02*
Y901575D01*
X1192913D02*
X1212598D01*
X1232283D01*
X1285433D02*
Y921260D01*
Y881890D02*
Y901575D01*
X1265748D02*
X1285433D01*
X1305118D01*
X1139764D02*
Y921260D01*
Y881890D02*
Y901575D01*
X1120079D02*
X1139764D01*
X1159449D01*
X1255906Y854331D02*
Y948819D01*
X1169291Y854331D02*
Y948819D01*
X1110236Y854331D02*
Y948819D01*
Y854331D02*
X1169291D01*
X1314961D02*
Y948819D01*
X1255906Y854331D02*
X1314961D01*
X1110236Y948819D02*
X1169291D01*
X1255906D02*
X1314961D01*
X554217Y1230451D02*
X579414D01*
Y1120215D02*
Y1230451D01*
X554217Y1120215D02*
X579414D01*
X554217D02*
Y1230451D01*
X611304D02*
X636500D01*
Y1120215D02*
Y1230451D01*
X611304Y1120215D02*
X636500D01*
X611304D02*
Y1230451D01*
X623902Y1175333D02*
X643587D01*
X566816Y1155648D02*
Y1175333D01*
Y1195018D01*
X547130Y1175333D02*
X566816D01*
X623902Y1155648D02*
Y1175333D01*
Y1195018D01*
X595359Y1175333D02*
X615044D01*
X595359Y1155648D02*
Y1175333D01*
Y1195018D01*
X575674Y1175333D02*
X595359D01*
X1543107Y573510D02*
Y593195D01*
Y612880D01*
X1523422Y593195D02*
X1543107D01*
X1562792D01*
X1433264Y688471D02*
Y708156D01*
Y727841D01*
X1413579Y708156D02*
X1433264D01*
X1452949D01*
X1368304Y683156D02*
Y733156D01*
Y683156D02*
X1498225D01*
Y733156D01*
X1368304D02*
X1498225D01*
X1608068Y568195D02*
Y618195D01*
X1478146D02*
X1608068D01*
X1478146Y568195D02*
Y618195D01*
Y568195D02*
X1608068D01*
X1488186Y630990D02*
Y650676D01*
Y670361D01*
X1468501Y650676D02*
X1488186D01*
X1507871D01*
X263860Y842862D02*
X283545D01*
Y862547D01*
Y823177D02*
Y842862D01*
X303230D01*
X312088D02*
Y862547D01*
Y823177D02*
Y842862D01*
X235316D02*
X255001D01*
Y862547D01*
Y823177D02*
Y842862D01*
X312088D02*
X331773D01*
X299490Y787744D02*
Y897980D01*
Y787744D02*
X324686D01*
Y897980D01*
X299490D02*
X324686D01*
X242403Y787744D02*
Y897980D01*
Y787744D02*
X267600D01*
Y897980D01*
X242403D02*
X267600D01*
X1587598Y1462598D02*
X1607283D01*
X1626968D01*
X1607283Y1442913D02*
Y1462598D01*
Y1482283D01*
X1587598Y1535433D02*
X1607283D01*
X1626968D01*
X1607283Y1515748D02*
Y1535433D01*
Y1555118D01*
X1587598Y1389764D02*
X1607283D01*
X1626968D01*
X1607283Y1370079D02*
Y1389764D01*
Y1409449D01*
X1560039Y1505906D02*
X1654527D01*
X1560039Y1419291D02*
X1654527D01*
X1560039Y1360236D02*
X1654527D01*
Y1419291D01*
X1560039Y1564961D02*
X1654527D01*
Y1505906D02*
Y1564961D01*
X1560039Y1360236D02*
Y1419291D01*
Y1505906D02*
Y1564961D01*
X1591535Y387795D02*
X1611220D01*
X1630905D01*
X1611220Y368110D02*
Y387795D01*
Y407480D01*
X1591535Y460630D02*
X1611220D01*
X1630905D01*
X1611220Y440945D02*
Y460630D01*
Y480315D01*
X1591535Y314961D02*
X1611220D01*
X1630905D01*
X1611220Y295276D02*
Y314961D01*
Y334646D01*
X1563976Y431102D02*
X1658465D01*
X1563976Y344488D02*
X1658465D01*
X1563976Y285433D02*
X1658465D01*
Y344488D01*
X1563976Y490158D02*
X1658465D01*
Y431102D02*
Y490158D01*
X1563976Y285433D02*
Y344488D01*
Y431102D02*
Y490158D01*
X1362205Y1277559D02*
Y1297244D01*
X1342520D02*
X1362205D01*
X1381890D01*
X1362205D02*
Y1316929D01*
X1357283Y1190945D02*
Y1218504D01*
X1347441D02*
X1357283D01*
X1347441Y1190945D02*
Y1218504D01*
Y1190945D02*
X1357283D01*
Y1375984D02*
Y1403543D01*
X1347441Y1375984D02*
X1357283D01*
X1347441D02*
Y1403543D01*
X1357283D01*
X1337598Y1190945D02*
Y1218504D01*
X1327756D02*
X1337598D01*
X1327756Y1190945D02*
Y1218504D01*
Y1190945D02*
X1337598D01*
Y1375984D02*
Y1403543D01*
X1327756Y1375984D02*
X1337598D01*
X1327756D02*
Y1403543D01*
X1337598D01*
X1317913Y1190945D02*
Y1218504D01*
X1308071D02*
X1317913D01*
X1308071Y1190945D02*
Y1218504D01*
Y1190945D02*
X1317913D01*
Y1375984D02*
Y1403543D01*
X1308071Y1375984D02*
X1317913D01*
X1308071D02*
Y1403543D01*
X1317913D01*
X1298228Y1190945D02*
Y1218504D01*
X1288386D02*
X1298228D01*
X1288386Y1190945D02*
Y1218504D01*
Y1190945D02*
X1298228D01*
Y1375984D02*
Y1403543D01*
X1288386Y1375984D02*
X1298228D01*
X1288386D02*
Y1403543D01*
X1298228D01*
X1376968Y1190945D02*
Y1218504D01*
X1367126D02*
X1376968D01*
X1367126Y1190945D02*
Y1218504D01*
Y1190945D02*
X1376968D01*
Y1375984D02*
Y1403543D01*
X1367126Y1375984D02*
X1376968D01*
X1367126D02*
Y1403543D01*
X1376968D01*
X1396653Y1190945D02*
Y1218504D01*
X1386811D02*
X1396653D01*
X1386811Y1190945D02*
Y1218504D01*
Y1190945D02*
X1396653D01*
Y1375984D02*
Y1403543D01*
X1386811Y1375984D02*
X1396653D01*
X1386811D02*
Y1403543D01*
X1396653D01*
X1416339Y1190945D02*
Y1218504D01*
X1406496D02*
X1416339D01*
X1406496Y1190945D02*
Y1218504D01*
Y1190945D02*
X1416339D01*
Y1375984D02*
Y1403543D01*
X1406496Y1375984D02*
X1416339D01*
X1406496D02*
Y1403543D01*
X1416339D01*
X1436024Y1190945D02*
Y1218504D01*
X1426181D02*
X1436024D01*
X1426181Y1190945D02*
Y1218504D01*
Y1190945D02*
X1436024D01*
Y1375984D02*
Y1403543D01*
X1426181Y1375984D02*
X1436024D01*
X1426181D02*
Y1403543D01*
X1436024D01*
X1440945Y1292323D02*
X1468504D01*
X1440945Y1282480D02*
Y1292323D01*
Y1282480D02*
X1468504D01*
Y1292323D01*
X1255906D02*
X1283465D01*
Y1282480D02*
Y1292323D01*
X1255906Y1282480D02*
X1283465D01*
X1255906D02*
Y1292323D01*
X1440945Y1272638D02*
X1468504D01*
X1440945Y1262795D02*
Y1272638D01*
Y1262795D02*
X1468504D01*
Y1272638D01*
X1255906D02*
X1283465D01*
Y1262795D02*
Y1272638D01*
X1255906Y1262795D02*
X1283465D01*
X1255906D02*
Y1272638D01*
X1440945Y1252953D02*
X1468504D01*
X1440945Y1243110D02*
Y1252953D01*
Y1243110D02*
X1468504D01*
Y1252953D01*
X1255906D02*
X1283465D01*
Y1243110D02*
Y1252953D01*
X1255906Y1243110D02*
X1283465D01*
X1255906D02*
Y1252953D01*
X1440945Y1233268D02*
X1468504D01*
X1440945Y1223425D02*
Y1233268D01*
Y1223425D02*
X1468504D01*
Y1233268D01*
X1255906D02*
X1283465D01*
Y1223425D02*
Y1233268D01*
X1255906Y1223425D02*
X1283465D01*
X1255906D02*
Y1233268D01*
X1440945Y1312008D02*
X1468504D01*
X1440945Y1302165D02*
Y1312008D01*
Y1302165D02*
X1468504D01*
Y1312008D01*
X1255906D02*
X1283465D01*
Y1302165D02*
Y1312008D01*
X1255906Y1302165D02*
X1283465D01*
X1255906D02*
Y1312008D01*
X1440945Y1331693D02*
X1468504D01*
X1440945Y1321850D02*
Y1331693D01*
Y1321850D02*
X1468504D01*
Y1331693D01*
X1255906D02*
X1283465D01*
Y1321850D02*
Y1331693D01*
X1255906Y1321850D02*
X1283465D01*
X1255906D02*
Y1331693D01*
X1440945Y1351378D02*
X1468504D01*
X1440945Y1341535D02*
Y1351378D01*
Y1341535D02*
X1468504D01*
Y1351378D01*
X1255906D02*
X1283465D01*
Y1341535D02*
Y1351378D01*
X1255906Y1341535D02*
X1283465D01*
X1255906D02*
Y1351378D01*
X1440945Y1371063D02*
X1468504D01*
X1440945Y1361220D02*
Y1371063D01*
Y1361220D02*
X1468504D01*
Y1371063D01*
X1255906D02*
X1283465D01*
Y1361220D02*
Y1371063D01*
X1255906Y1361220D02*
X1283465D01*
X1255906D02*
Y1371063D01*
X1291339Y1226378D02*
Y1368110D01*
X1433071D01*
Y1226378D02*
Y1368110D01*
X1291339Y1226378D02*
X1433071D01*
X1293307Y1204724D02*
X1298228Y1190945D01*
X1288386D02*
X1293307Y1204724D01*
X1255906Y1223425D02*
X1269685Y1228347D01*
X1255906Y1233268D02*
X1269685Y1228347D01*
X1293307Y1389764D02*
X1298228Y1403543D01*
X1288386D02*
X1293307Y1389764D01*
X1454724Y1228347D02*
X1468504Y1233268D01*
X1454724Y1228347D02*
X1468504Y1223425D01*
X1255906Y1243110D02*
X1269685Y1248032D01*
X1255906Y1252953D02*
X1269685Y1248032D01*
X1255906Y1262795D02*
X1269685Y1267716D01*
X1255906Y1272638D02*
X1269685Y1267716D01*
X1255906Y1282480D02*
X1269685Y1287402D01*
X1255906Y1292323D02*
X1269685Y1287402D01*
X1255906Y1302165D02*
X1269685Y1307087D01*
X1255906Y1312008D02*
X1269685Y1307087D01*
X1255906Y1321850D02*
X1269685Y1326772D01*
X1255906Y1331693D02*
X1269685Y1326772D01*
X1255906Y1341535D02*
X1269685Y1346457D01*
X1255906Y1351378D02*
X1269685Y1346457D01*
X1255906Y1361220D02*
X1269685Y1366142D01*
X1255906Y1371063D02*
X1269685Y1366142D01*
X1312992Y1204724D02*
X1317913Y1190945D01*
X1308071D02*
X1312992Y1204724D01*
X1332677D02*
X1337598Y1190945D01*
X1327756D02*
X1332677Y1204724D01*
X1352362D02*
X1357283Y1190945D01*
X1347441D02*
X1352362Y1204724D01*
X1372047D02*
X1376968Y1190945D01*
X1367126D02*
X1372047Y1204724D01*
X1391732D02*
X1396653Y1190945D01*
X1386811D02*
X1391732Y1204724D01*
X1411417D02*
X1416339Y1190945D01*
X1406496D02*
X1411417Y1204724D01*
X1431102D02*
X1436024Y1190945D01*
X1426181D02*
X1431102Y1204724D01*
X1312992Y1389764D02*
X1317913Y1403543D01*
X1308071D02*
X1312992Y1389764D01*
X1332677D02*
X1337598Y1403543D01*
X1327756D02*
X1332677Y1389764D01*
X1352362D02*
X1357283Y1403543D01*
X1347441D02*
X1352362Y1389764D01*
X1372047D02*
X1376968Y1403543D01*
X1367126D02*
X1372047Y1389764D01*
X1391732D02*
X1396653Y1403543D01*
X1386811D02*
X1391732Y1389764D01*
X1411417D02*
X1416339Y1403543D01*
X1406496D02*
X1411417Y1389764D01*
X1431102D02*
X1436024Y1403543D01*
X1426181D02*
X1431102Y1389764D01*
X1454724Y1248032D02*
X1468504Y1252953D01*
X1454724Y1248032D02*
X1468504Y1243110D01*
X1454724Y1267716D02*
X1468504Y1272638D01*
X1454724Y1267716D02*
X1468504Y1262795D01*
X1454724Y1287402D02*
X1468504Y1292323D01*
X1454724Y1287402D02*
X1468504Y1282480D01*
X1454724Y1307087D02*
X1468504Y1312008D01*
X1454724Y1307087D02*
X1468504Y1302165D01*
X1454724Y1326772D02*
X1468504Y1331693D01*
X1454724Y1326772D02*
X1468504Y1321850D01*
X1454724Y1346457D02*
X1468504Y1351378D01*
X1454724Y1346457D02*
X1468504Y1341535D01*
X1454724Y1366142D02*
X1468504Y1371063D01*
X1454724Y1366142D02*
X1468504Y1361220D01*
X425791Y1377168D02*
X445476D01*
X465161D01*
X445476D02*
Y1396854D01*
Y1357484D02*
Y1377168D01*
X540751Y1487011D02*
X560436D01*
X580121D01*
X560436D02*
Y1506696D01*
Y1467326D02*
Y1487011D01*
X535436Y1551972D02*
X585436D01*
X535436Y1422050D02*
Y1551972D01*
Y1422050D02*
X585436D01*
Y1551972D01*
X420476Y1312208D02*
X470476D01*
Y1442129D01*
X420476D02*
X470476D01*
X420476Y1312208D02*
Y1442129D01*
X483271Y1432090D02*
X502956D01*
X522641D01*
X502956D02*
Y1451775D01*
Y1412405D02*
Y1432090D01*
X632167Y299626D02*
X657364D01*
Y189390D02*
Y299626D01*
X632167Y189390D02*
X657364D01*
X632167D02*
Y299626D01*
X689253D02*
X714450D01*
Y189390D02*
Y299626D01*
X689253Y189390D02*
X714450D01*
X689253D02*
Y299626D01*
X701852Y244508D02*
X721537D01*
X644765Y224823D02*
Y244508D01*
Y264193D01*
X625080Y244508D02*
X644765D01*
X701852Y224823D02*
Y244508D01*
Y264193D01*
X673308Y244508D02*
X692993D01*
X673308Y224823D02*
Y244508D01*
Y264193D01*
X653623Y244508D02*
X673308D01*
%TF.MD5,245cf16361e12000db5fb49221bccab8*%
M02*
