%TF.GenerationSoftware,Altium Limited,Altium Designer,21.8.1 (53)*%
G04 Layer_Color=0*
%FSLAX26Y26*%
%MOIN*%
%TF.SameCoordinates,05626266-558E-4A93-A1D1-DBCDE1204E88*%
%TF.FilePolarity,Positive*%
%TF.FileFunction,NonPlated,1,12,NPTH,Drill*%
%TF.Part,Single*%
G01*
G75*
%TA.AperFunction,ComponentDrill*%
%ADD63C,0.055118*%
D63*
X177165Y579428D02*
D03*
Y204427D02*
D03*
Y1427853D02*
D03*
Y1052852D02*
D03*
%TF.MD5,3fc74d50137b53a955e6b9bc7e4a5f3f*%
M02*
