%TF.GenerationSoftware,Altium Limited,Altium Designer,21.8.1 (53)*%
G04 Layer_Color=8388736*
%FSLAX26Y26*%
%MOIN*%
%TF.SameCoordinates,05626266-558E-4A93-A1D1-DBCDE1204E88*%
%TF.FilePolarity,Negative*%
%TF.FileFunction,Soldermask,Top*%
%TF.Part,Single*%
G01*
G75*
%TA.AperFunction,SMDPad,CuDef*%
%ADD10R,0.039370X0.035433*%
G04:AMPARAMS|DCode=11|XSize=27.559mil|YSize=9.842mil|CornerRadius=1.476mil|HoleSize=0mil|Usage=FLASHONLY|Rotation=180.000|XOffset=0mil|YOffset=0mil|HoleType=Round|Shape=RoundedRectangle|*
%AMROUNDEDRECTD11*
21,1,0.027559,0.006890,0,0,180.0*
21,1,0.024606,0.009842,0,0,180.0*
1,1,0.002953,-0.012303,0.003445*
1,1,0.002953,0.012303,0.003445*
1,1,0.002953,0.012303,-0.003445*
1,1,0.002953,-0.012303,-0.003445*
%
%ADD11ROUNDEDRECTD11*%
G04:AMPARAMS|DCode=12|XSize=27.559mil|YSize=9.842mil|CornerRadius=1.476mil|HoleSize=0mil|Usage=FLASHONLY|Rotation=90.000|XOffset=0mil|YOffset=0mil|HoleType=Round|Shape=RoundedRectangle|*
%AMROUNDEDRECTD12*
21,1,0.027559,0.006890,0,0,90.0*
21,1,0.024606,0.009842,0,0,90.0*
1,1,0.002953,0.003445,0.012303*
1,1,0.002953,0.003445,-0.012303*
1,1,0.002953,-0.003445,-0.012303*
1,1,0.002953,-0.003445,0.012303*
%
%ADD12ROUNDEDRECTD12*%
%ADD13R,0.141732X0.141732*%
%ADD14R,0.129921X0.050000*%
%ADD15R,0.059055X0.094488*%
%ADD16R,0.045276X0.057087*%
%ADD17R,0.024409X0.024409*%
%ADD18R,0.025197X0.110236*%
%ADD19R,0.106299X0.045276*%
%ADD20R,0.035433X0.039370*%
%ADD21R,0.031496X0.023622*%
%ADD22R,0.025591X0.023622*%
%ADD23R,0.024409X0.022835*%
%ADD24R,0.022835X0.024409*%
%ADD25R,0.041339X0.055118*%
%ADD26R,0.045276X0.106299*%
%ADD27R,0.024409X0.024409*%
%ADD28R,0.057087X0.045276*%
%ADD29R,0.094488X0.059055*%
%ADD30R,0.050000X0.129921*%
%ADD31R,0.055118X0.041339*%
%TA.AperFunction,ComponentPad*%
%ADD37C,0.051181*%
G04:AMPARAMS|DCode=39|XSize=41.339mil|YSize=41.339mil|CornerRadius=10.335mil|HoleSize=0mil|Usage=FLASHONLY|Rotation=270.000|XOffset=0mil|YOffset=0mil|HoleType=Round|Shape=RoundedRectangle|*
%AMROUNDEDRECTD39*
21,1,0.041339,0.020669,0,0,270.0*
21,1,0.020669,0.041339,0,0,270.0*
1,1,0.020669,-0.010335,-0.010335*
1,1,0.020669,-0.010335,0.010335*
1,1,0.020669,0.010335,0.010335*
1,1,0.020669,0.010335,-0.010335*
%
%ADD39ROUNDEDRECTD39*%
%ADD40C,0.074803*%
%ADD41R,0.074803X0.074803*%
%TA.AperFunction,ViaPad*%
%ADD42C,0.025591*%
%ADD43C,0.023622*%
%ADD44C,0.019685*%
%TA.AperFunction,ComponentPad*%
%ADD56C,0.055118*%
D10*
X1670859Y1188403D02*
D03*
Y1251395D02*
D03*
X1250000Y1140884D02*
D03*
Y1077892D02*
D03*
X1648763Y111221D02*
D03*
Y174213D02*
D03*
X1705709Y156389D02*
D03*
Y219381D02*
D03*
X1229177Y665987D02*
D03*
Y602995D02*
D03*
D11*
X1483268Y162402D02*
D03*
Y182087D02*
D03*
Y201772D02*
D03*
Y221457D02*
D03*
Y241142D02*
D03*
Y260827D02*
D03*
Y280512D02*
D03*
X1298228D02*
D03*
Y260827D02*
D03*
Y241142D02*
D03*
Y221457D02*
D03*
Y201772D02*
D03*
Y182087D02*
D03*
Y162402D02*
D03*
Y142717D02*
D03*
X1483268D02*
D03*
X1021968Y775887D02*
D03*
Y795572D02*
D03*
Y815257D02*
D03*
Y834942D02*
D03*
Y854627D02*
D03*
Y874312D02*
D03*
Y893997D02*
D03*
Y913682D02*
D03*
X836929D02*
D03*
Y893997D02*
D03*
Y874312D02*
D03*
Y854627D02*
D03*
Y834942D02*
D03*
Y815257D02*
D03*
Y795572D02*
D03*
Y775887D02*
D03*
X1454724Y1228347D02*
D03*
Y1248032D02*
D03*
Y1267716D02*
D03*
Y1287402D02*
D03*
Y1307087D02*
D03*
Y1326772D02*
D03*
Y1346457D02*
D03*
Y1366142D02*
D03*
X1269685D02*
D03*
Y1346457D02*
D03*
Y1326772D02*
D03*
Y1307087D02*
D03*
Y1287402D02*
D03*
Y1267716D02*
D03*
Y1248032D02*
D03*
Y1228347D02*
D03*
D12*
X1459646Y304134D02*
D03*
X1439961D02*
D03*
X1420276D02*
D03*
X1400591D02*
D03*
X1380906D02*
D03*
X1361220D02*
D03*
X1341535D02*
D03*
X1321850D02*
D03*
Y119094D02*
D03*
X1341535D02*
D03*
X1361220D02*
D03*
X1380906D02*
D03*
X1400591D02*
D03*
X1420276D02*
D03*
X1439961D02*
D03*
X1459646D02*
D03*
X998346Y937304D02*
D03*
X978661D02*
D03*
X958976D02*
D03*
X939291D02*
D03*
X919606D02*
D03*
X899921D02*
D03*
X880236D02*
D03*
X860551D02*
D03*
Y752265D02*
D03*
X880236D02*
D03*
X899921D02*
D03*
X919606D02*
D03*
X939291D02*
D03*
X958976D02*
D03*
X978661D02*
D03*
X998346D02*
D03*
X1431102Y1389764D02*
D03*
X1411417D02*
D03*
X1391732D02*
D03*
X1372047D02*
D03*
X1352362D02*
D03*
X1332677D02*
D03*
X1312992D02*
D03*
X1293307D02*
D03*
Y1204724D02*
D03*
X1312992D02*
D03*
X1332677D02*
D03*
X1352362D02*
D03*
X1372047D02*
D03*
X1391732D02*
D03*
X1411417D02*
D03*
X1431102D02*
D03*
D13*
X1390748Y211614D02*
D03*
X929448Y844785D02*
D03*
X1362205Y1297244D02*
D03*
D14*
X609058Y446733D02*
D03*
X499216Y561694D02*
D03*
X1543107Y593195D02*
D03*
X1433264Y708156D02*
D03*
D15*
X1139764Y901575D02*
D03*
X1285433D02*
D03*
D16*
X1661220Y650676D02*
D03*
X1732087D02*
D03*
D17*
X1446850Y1159812D02*
D03*
X1411417D02*
D03*
X1478346Y78369D02*
D03*
X1442913D02*
D03*
X1011141Y708082D02*
D03*
X975708D02*
D03*
D18*
X566816Y1175333D02*
D03*
X623902D02*
D03*
X312088Y842862D02*
D03*
X255001D02*
D03*
X644765Y244508D02*
D03*
X701852D02*
D03*
D19*
X892050Y1338463D02*
D03*
Y1456573D02*
D03*
X364782Y1244093D02*
D03*
Y1125983D02*
D03*
X912632Y104397D02*
D03*
Y222508D02*
D03*
Y417389D02*
D03*
Y299279D02*
D03*
X1052396Y222508D02*
D03*
Y104397D02*
D03*
Y417389D02*
D03*
Y299279D02*
D03*
X583474Y1010212D02*
D03*
Y892102D02*
D03*
X583477Y812377D02*
D03*
Y694267D02*
D03*
X447648Y1010212D02*
D03*
Y892102D02*
D03*
X447645Y694267D02*
D03*
Y812377D02*
D03*
X1023937Y1338463D02*
D03*
Y1456573D02*
D03*
X1023940Y1260963D02*
D03*
Y1142852D02*
D03*
X892047Y1260963D02*
D03*
Y1142852D02*
D03*
X437992Y247386D02*
D03*
Y365496D02*
D03*
D20*
X1423228Y1505906D02*
D03*
X1360236D02*
D03*
X1456690Y1013336D02*
D03*
X1519682D02*
D03*
X1737205Y50394D02*
D03*
X1674213D02*
D03*
X751860Y681102D02*
D03*
X814852D02*
D03*
X1200787Y50394D02*
D03*
X1263780D02*
D03*
D21*
X1218504Y260827D02*
D03*
Y182087D02*
D03*
X746193Y900887D02*
D03*
Y822147D02*
D03*
X1170276Y1346458D02*
D03*
Y1267718D02*
D03*
D22*
X1193898Y221457D02*
D03*
X1243110D02*
D03*
X721587Y861517D02*
D03*
X770799D02*
D03*
X1145669Y1307088D02*
D03*
X1194882D02*
D03*
D23*
X411695Y459449D02*
D03*
Y422441D02*
D03*
X132480Y671615D02*
D03*
Y708622D02*
D03*
X1744984Y1228703D02*
D03*
Y1265711D02*
D03*
D24*
X1609252Y733156D02*
D03*
X1646260D02*
D03*
X1311268Y767029D02*
D03*
X1274260D02*
D03*
X46161Y709528D02*
D03*
X83169D02*
D03*
X308169Y1578134D02*
D03*
X271161D02*
D03*
X1705709Y109646D02*
D03*
X1742716D02*
D03*
D25*
X1511808Y807087D02*
D03*
X1440942D02*
D03*
X1511808Y881890D02*
D03*
X1440942D02*
D03*
D26*
X55315Y842862D02*
D03*
X173425D02*
D03*
D27*
X1067436Y796557D02*
D03*
Y831990D02*
D03*
X1502545Y1250000D02*
D03*
Y1285433D02*
D03*
X1534449Y199803D02*
D03*
Y164370D02*
D03*
D28*
X367438Y1491342D02*
D03*
Y1420476D02*
D03*
X330709Y483858D02*
D03*
Y412992D02*
D03*
D29*
X1607283Y1389764D02*
D03*
Y1535433D02*
D03*
X1611220Y314961D02*
D03*
Y460630D02*
D03*
D30*
X445476Y1377168D02*
D03*
X560436Y1487011D02*
D03*
D31*
X719488Y1602362D02*
D03*
Y1531496D02*
D03*
X643701Y1602362D02*
D03*
Y1531496D02*
D03*
X731102Y511106D02*
D03*
Y581973D02*
D03*
X812008Y511106D02*
D03*
Y581973D02*
D03*
D37*
X249984Y718919D02*
D03*
X1716339Y1071979D02*
D03*
X289665Y982466D02*
D03*
X518663Y109326D02*
D03*
X570866Y365496D02*
D03*
X326772Y604428D02*
D03*
X109665Y68866D02*
D03*
X244665Y126944D02*
D03*
X177165Y1578134D02*
D03*
X77982D02*
D03*
X790218Y1011169D02*
D03*
X721269Y97441D02*
D03*
X1207677Y1501784D02*
D03*
D39*
X152165Y266927D02*
D03*
Y316927D02*
D03*
Y416927D02*
D03*
Y466927D02*
D03*
Y366927D02*
D03*
Y516927D02*
D03*
X202165Y266927D02*
D03*
Y316927D02*
D03*
Y366927D02*
D03*
Y416927D02*
D03*
Y466927D02*
D03*
Y516927D02*
D03*
Y1365353D02*
D03*
X152165D02*
D03*
X202165Y1315353D02*
D03*
X152165D02*
D03*
X202165Y1265353D02*
D03*
X152165D02*
D03*
X202165Y1215352D02*
D03*
X152165D02*
D03*
X202165Y1165352D02*
D03*
X152165D02*
D03*
X202165Y1115352D02*
D03*
X152165D02*
D03*
D40*
X1716339Y922244D02*
D03*
D41*
Y823819D02*
D03*
D42*
X1648763Y211614D02*
D03*
X1705709Y262451D02*
D03*
X1107284Y1081853D02*
D03*
X963704Y996063D02*
D03*
X939291Y976378D02*
D03*
X1588293Y1071979D02*
D03*
X182480Y671615D02*
D03*
X320928Y718919D02*
D03*
X880236Y689971D02*
D03*
X793198Y731669D02*
D03*
X753740D02*
D03*
X324686Y1052852D02*
D03*
X1347441Y1451772D02*
D03*
X1372047Y1423228D02*
D03*
X1396653Y1451772D02*
D03*
X1420276Y399998D02*
D03*
X1439961Y369871D02*
D03*
X1400591D02*
D03*
X1472933Y1505906D02*
D03*
X1303150Y1109388D02*
D03*
X1212276Y421327D02*
D03*
X196850Y48056D02*
D03*
X319961Y68866D02*
D03*
X1240158Y107283D02*
D03*
X1326772Y46242D02*
D03*
D43*
X1415354Y187008D02*
D03*
Y236220D02*
D03*
X1439961Y162402D02*
D03*
X1386811Y1248032D02*
D03*
X1411417D02*
D03*
X1043625Y1182222D02*
D03*
X1106693Y1307088D02*
D03*
X683240Y827068D02*
D03*
X904842Y893997D02*
D03*
X171850Y709803D02*
D03*
X603162Y970842D02*
D03*
X563789D02*
D03*
X467147Y931472D02*
D03*
X427774D02*
D03*
X603162Y733637D02*
D03*
X563792D02*
D03*
X427960Y773007D02*
D03*
X467333D02*
D03*
X683240Y861517D02*
D03*
Y895966D02*
D03*
X94685Y823177D02*
D03*
Y862547D02*
D03*
X777470Y1612584D02*
D03*
X585436D02*
D03*
X390075D02*
D03*
Y1578134D02*
D03*
Y1544687D02*
D03*
X344800Y1612584D02*
D03*
Y1578134D02*
D03*
Y1544687D02*
D03*
X1106693Y1341537D02*
D03*
Y1272639D02*
D03*
X872365Y1377833D02*
D03*
X911735D02*
D03*
X1004252Y1417203D02*
D03*
X1043622D02*
D03*
X1004255Y1182222D02*
D03*
X872365Y1221592D02*
D03*
X911735D02*
D03*
X345097Y1204723D02*
D03*
X384467D02*
D03*
X929448Y893997D02*
D03*
X954055D02*
D03*
X978661D02*
D03*
X880236D02*
D03*
Y869391D02*
D03*
X904842D02*
D03*
X954055D02*
D03*
X929448D02*
D03*
X978661Y844785D02*
D03*
X954055D02*
D03*
X929448D02*
D03*
X880236Y820178D02*
D03*
X904842D02*
D03*
X978661D02*
D03*
X954055D02*
D03*
X929448D02*
D03*
X880236Y795572D02*
D03*
X904842D02*
D03*
X978661D02*
D03*
X954055D02*
D03*
X929448D02*
D03*
X978661Y869391D02*
D03*
X880236Y844785D02*
D03*
X904842Y844785D02*
D03*
X1362205Y1346457D02*
D03*
X1386811D02*
D03*
X1411417D02*
D03*
X1337598D02*
D03*
X1312992D02*
D03*
Y1321850D02*
D03*
X1337598D02*
D03*
X1386811D02*
D03*
X1362205D02*
D03*
X1411417Y1297244D02*
D03*
X1386811D02*
D03*
X1362205D02*
D03*
X1312992Y1272638D02*
D03*
X1337598D02*
D03*
X1411417D02*
D03*
X1386811D02*
D03*
X1362205D02*
D03*
X1312992Y1248032D02*
D03*
X1337598D02*
D03*
X1362205D02*
D03*
X1411417Y1321850D02*
D03*
X1312992Y1297244D02*
D03*
X1337598Y1297244D02*
D03*
X1366142Y211614D02*
D03*
X1341535Y211614D02*
D03*
X1439961Y236220D02*
D03*
X1390748Y162402D02*
D03*
X1415354D02*
D03*
X1366142D02*
D03*
X1341535D02*
D03*
X1390748Y187008D02*
D03*
X1439961D02*
D03*
X1366142D02*
D03*
X1341535D02*
D03*
X1390748Y211614D02*
D03*
X1415354D02*
D03*
X1439961D02*
D03*
X1390748Y236220D02*
D03*
X1366142D02*
D03*
X1341535D02*
D03*
Y260827D02*
D03*
X1366142D02*
D03*
X1439961D02*
D03*
X1415354D02*
D03*
X1390748D02*
D03*
X1155622Y255905D02*
D03*
Y221457D02*
D03*
X932317Y182567D02*
D03*
X892947D02*
D03*
X1072081Y143768D02*
D03*
X1032710D02*
D03*
Y378019D02*
D03*
X1072081D02*
D03*
X932317Y338649D02*
D03*
X892947D02*
D03*
X318898Y326126D02*
D03*
X353346D02*
D03*
X318136Y357659D02*
D03*
X353346Y357251D02*
D03*
X457677Y326126D02*
D03*
X418307D02*
D03*
X1155622Y187008D02*
D03*
D44*
X1552559Y100394D02*
D03*
X746122Y861517D02*
D03*
X712598Y630200D02*
D03*
X1732087Y604326D02*
D03*
Y573116D02*
D03*
X1560273Y960630D02*
D03*
Y929134D02*
D03*
Y791339D02*
D03*
Y822835D02*
D03*
Y866142D02*
D03*
Y897638D02*
D03*
X1182324Y602995D02*
D03*
X1124898Y712000D02*
D03*
Y741527D02*
D03*
X1154426D02*
D03*
Y712000D02*
D03*
X924527Y600672D02*
D03*
Y630200D02*
D03*
X895000D02*
D03*
Y600672D02*
D03*
X706103Y681102D02*
D03*
X1197835Y1078456D02*
D03*
X1562245Y1175787D02*
D03*
X1546260Y1204724D02*
D03*
X1530905Y1175787D02*
D03*
X1345454Y1132619D02*
D03*
X1567913Y129331D02*
D03*
X1583899Y100394D02*
D03*
X1361220Y50394D02*
D03*
Y79921D02*
D03*
X1332677Y1163386D02*
D03*
X1619990Y1251395D02*
D03*
X1670859Y1296687D02*
D03*
X1170276Y1307088D02*
D03*
X1218504Y221457D02*
D03*
X830709Y630200D02*
D03*
X801181D02*
D03*
X771654D02*
D03*
X742126D02*
D03*
D56*
X177165Y579428D02*
D03*
Y204427D02*
D03*
Y1427853D02*
D03*
Y1052852D02*
D03*
%TF.MD5,d49264aedc4b88783e4f39be52a410cf*%
M02*
