%TF.GenerationSoftware,Altium Limited,Altium Designer,21.8.1 (53)*%
G04 Layer_Physical_Order=5*
G04 Layer_Color=8388736*
%FSLAX26Y26*%
%MOIN*%
%TF.SameCoordinates,05626266-558E-4A93-A1D1-DBCDE1204E88*%
%TF.FilePolarity,Positive*%
%TF.FileFunction,Copper,L5,Inr,Signal*%
%TF.Part,Single*%
G01*
G75*
%TA.AperFunction,ComponentPad*%
%ADD37C,0.051181*%
%ADD38C,0.019685*%
G04:AMPARAMS|DCode=39|XSize=41.339mil|YSize=41.339mil|CornerRadius=10.335mil|HoleSize=0mil|Usage=FLASHONLY|Rotation=270.000|XOffset=0mil|YOffset=0mil|HoleType=Round|Shape=RoundedRectangle|*
%AMROUNDEDRECTD39*
21,1,0.041339,0.020669,0,0,270.0*
21,1,0.020669,0.041339,0,0,270.0*
1,1,0.020669,-0.010335,-0.010335*
1,1,0.020669,-0.010335,0.010335*
1,1,0.020669,0.010335,0.010335*
1,1,0.020669,0.010335,-0.010335*
%
%ADD39ROUNDEDRECTD39*%
%ADD40C,0.074803*%
%ADD41R,0.074803X0.074803*%
%TA.AperFunction,ViaPad*%
%ADD42C,0.025591*%
%ADD43C,0.023622*%
%ADD44C,0.019685*%
D37*
X249984Y718919D02*
D03*
X1716339Y1071979D02*
D03*
X289665Y982466D02*
D03*
X518663Y109326D02*
D03*
X570866Y365496D02*
D03*
X326772Y604428D02*
D03*
X109665Y68866D02*
D03*
X244665Y126944D02*
D03*
X177165Y1578134D02*
D03*
X77982D02*
D03*
X790218Y1011169D02*
D03*
X721269Y97441D02*
D03*
X1207677Y1501784D02*
D03*
D38*
X177165Y579428D02*
D03*
Y204427D02*
D03*
Y1427853D02*
D03*
Y1052852D02*
D03*
D39*
X152165Y266927D02*
D03*
Y316927D02*
D03*
Y416927D02*
D03*
Y466927D02*
D03*
Y366927D02*
D03*
Y516927D02*
D03*
X202165Y266927D02*
D03*
Y316927D02*
D03*
Y366927D02*
D03*
Y416927D02*
D03*
Y466927D02*
D03*
Y516927D02*
D03*
Y1365353D02*
D03*
X152165D02*
D03*
X202165Y1315353D02*
D03*
X152165D02*
D03*
X202165Y1265353D02*
D03*
X152165D02*
D03*
X202165Y1215352D02*
D03*
X152165D02*
D03*
X202165Y1165352D02*
D03*
X152165D02*
D03*
X202165Y1115352D02*
D03*
X152165D02*
D03*
D40*
X1716339Y922244D02*
D03*
D41*
Y823819D02*
D03*
D42*
X1648763Y211614D02*
D03*
X1705709Y262451D02*
D03*
X1107284Y1081853D02*
D03*
X963704Y996063D02*
D03*
X939291Y976378D02*
D03*
X1588293Y1071979D02*
D03*
X182480Y671615D02*
D03*
X320928Y718919D02*
D03*
X880236Y689971D02*
D03*
X793198Y731669D02*
D03*
X753740D02*
D03*
X324686Y1052852D02*
D03*
X1347441Y1451772D02*
D03*
X1372047Y1423228D02*
D03*
X1396653Y1451772D02*
D03*
X1420276Y399998D02*
D03*
X1439961Y369871D02*
D03*
X1400591D02*
D03*
X1472933Y1505906D02*
D03*
X1303150Y1109388D02*
D03*
X1212276Y421327D02*
D03*
X196850Y48056D02*
D03*
X319961Y68866D02*
D03*
X1240158Y107283D02*
D03*
X1326772Y46242D02*
D03*
D43*
X1415354Y187008D02*
D03*
Y236220D02*
D03*
X1439961Y162402D02*
D03*
X1386811Y1248032D02*
D03*
X1411417D02*
D03*
X1043625Y1182222D02*
D03*
X1106693Y1307088D02*
D03*
X683240Y827068D02*
D03*
X904842Y893997D02*
D03*
X171850Y709803D02*
D03*
X603162Y970842D02*
D03*
X563789D02*
D03*
X467147Y931472D02*
D03*
X427774D02*
D03*
X603162Y733637D02*
D03*
X563792D02*
D03*
X427960Y773007D02*
D03*
X467333D02*
D03*
X683240Y861517D02*
D03*
Y895966D02*
D03*
X94685Y823177D02*
D03*
Y862547D02*
D03*
X777470Y1612584D02*
D03*
X585436D02*
D03*
X390075D02*
D03*
Y1578134D02*
D03*
Y1544687D02*
D03*
X344800Y1612584D02*
D03*
Y1578134D02*
D03*
Y1544687D02*
D03*
X1106693Y1341537D02*
D03*
Y1272639D02*
D03*
X872365Y1377833D02*
D03*
X911735D02*
D03*
X1004252Y1417203D02*
D03*
X1043622D02*
D03*
X1004255Y1182222D02*
D03*
X872365Y1221592D02*
D03*
X911735D02*
D03*
X345097Y1204723D02*
D03*
X384467D02*
D03*
X929448Y893997D02*
D03*
X954055D02*
D03*
X978661D02*
D03*
X880236D02*
D03*
Y869391D02*
D03*
X904842D02*
D03*
X954055D02*
D03*
X929448D02*
D03*
X978661Y844785D02*
D03*
X954055D02*
D03*
X929448D02*
D03*
X880236Y820178D02*
D03*
X904842D02*
D03*
X978661D02*
D03*
X954055D02*
D03*
X929448D02*
D03*
X880236Y795572D02*
D03*
X904842D02*
D03*
X978661D02*
D03*
X954055D02*
D03*
X929448D02*
D03*
X978661Y869391D02*
D03*
X880236Y844785D02*
D03*
X904842Y844785D02*
D03*
X1362205Y1346457D02*
D03*
X1386811D02*
D03*
X1411417D02*
D03*
X1337598D02*
D03*
X1312992D02*
D03*
Y1321850D02*
D03*
X1337598D02*
D03*
X1386811D02*
D03*
X1362205D02*
D03*
X1411417Y1297244D02*
D03*
X1386811D02*
D03*
X1362205D02*
D03*
X1312992Y1272638D02*
D03*
X1337598D02*
D03*
X1411417D02*
D03*
X1386811D02*
D03*
X1362205D02*
D03*
X1312992Y1248032D02*
D03*
X1337598D02*
D03*
X1362205D02*
D03*
X1411417Y1321850D02*
D03*
X1312992Y1297244D02*
D03*
X1337598Y1297244D02*
D03*
X1366142Y211614D02*
D03*
X1341535Y211614D02*
D03*
X1439961Y236220D02*
D03*
X1390748Y162402D02*
D03*
X1415354D02*
D03*
X1366142D02*
D03*
X1341535D02*
D03*
X1390748Y187008D02*
D03*
X1439961D02*
D03*
X1366142D02*
D03*
X1341535D02*
D03*
X1390748Y211614D02*
D03*
X1415354D02*
D03*
X1439961D02*
D03*
X1390748Y236220D02*
D03*
X1366142D02*
D03*
X1341535D02*
D03*
Y260827D02*
D03*
X1366142D02*
D03*
X1439961D02*
D03*
X1415354D02*
D03*
X1390748D02*
D03*
X1155622Y255905D02*
D03*
Y221457D02*
D03*
X932317Y182567D02*
D03*
X892947D02*
D03*
X1072081Y143768D02*
D03*
X1032710D02*
D03*
Y378019D02*
D03*
X1072081D02*
D03*
X932317Y338649D02*
D03*
X892947D02*
D03*
X318898Y326126D02*
D03*
X353346D02*
D03*
X318136Y357659D02*
D03*
X353346Y357251D02*
D03*
X457677Y326126D02*
D03*
X418307D02*
D03*
X1155622Y187008D02*
D03*
D44*
X1552559Y100394D02*
D03*
X746122Y861517D02*
D03*
X712598Y630200D02*
D03*
X1732087Y604326D02*
D03*
Y573116D02*
D03*
X1560273Y960630D02*
D03*
Y929134D02*
D03*
Y791339D02*
D03*
Y822835D02*
D03*
Y866142D02*
D03*
Y897638D02*
D03*
X1182324Y602995D02*
D03*
X1124898Y712000D02*
D03*
Y741527D02*
D03*
X1154426D02*
D03*
Y712000D02*
D03*
X924527Y600672D02*
D03*
Y630200D02*
D03*
X895000D02*
D03*
Y600672D02*
D03*
X706103Y681102D02*
D03*
X1197835Y1078456D02*
D03*
X1562245Y1175787D02*
D03*
X1546260Y1204724D02*
D03*
X1530905Y1175787D02*
D03*
X1345454Y1132619D02*
D03*
X1567913Y129331D02*
D03*
X1583899Y100394D02*
D03*
X1361220Y50394D02*
D03*
Y79921D02*
D03*
X1332677Y1163386D02*
D03*
X1619990Y1251395D02*
D03*
X1670859Y1296687D02*
D03*
X1170276Y1307088D02*
D03*
X1218504Y221457D02*
D03*
X830709Y630200D02*
D03*
X801181D02*
D03*
X771654D02*
D03*
X742126D02*
D03*
%TF.MD5,099b241fd0b01dd4031c0df3a6ed4afd*%
M02*
