{
  "group": "dg",
  "email": "dg.office@cern.ch",
  "login": "",
  "fullname": "Fabiola Gianotti",
  "phonenumber": "72300 (+41 22 76 72300)",
  "faxnumber": "",
  "mobilenumber": "",
  "building": "60/5-015",
  "firstname": "Fabiola",
  "lastname": "Gianotti",
  "department": "DG",
  "homeinstitute": "European Organiz. for Nuclear Res.",
  "homedir": "",
  "personid": "395397",
  "preferredlanguage": "EN",
  "role": "CERN Users",
  "identityclass": "CERN Registered",
  "federation": "CERN",
  "authlevel": "Normal",
  "iat": 1474981967,
  "exp": 1475068367
}
