<?xml version="1.0" encoding="UTF-8" standalone="no"?>
<!DOCTYPE svg PUBLIC "-//W3C//DTD SVG 1.1//EN" "http://www.w3.org/Graphics/SVG/1.1/DTD/svg11.dtd">
<svg xmlns="http://www.w3.org/2000/svg" xmlns:xl="http://www.w3.org/1999/xlink" version="1.1" viewBox="18 12 1705 606" width="1705pt" height="606pt" xmlns:dc="http://purl.org/dc/elements/1.1/"><metadata> Produced by OmniGraffle 6.6.1 <dc:date>2016-10-06 17:44:43 +0000</dc:date></metadata><defs><font-face font-family="Helvetica Neue" font-size="32" panose-1="2 0 5 3 0 0 0 2 0 4" units-per-em="1000" underline-position="-100" underline-thickness="50" slope="0" x-height="517" cap-height="714" ascent="951.99585" descent="-212.99744" font-weight="500"><font-face-src><font-face-name name="HelveticaNeue"/></font-face-src></font-face><font-face font-family="Helvetica Neue" font-size="16" panose-1="2 0 5 3 0 0 0 2 0 4" units-per-em="1000" underline-position="-100" underline-thickness="50" slope="0" x-height="517" cap-height="714" ascent="951.99585" descent="-212.99744" font-weight="500"><font-face-src><font-face-name name="HelveticaNeue"/></font-face-src></font-face><marker orient="auto" overflow="visible" markerUnits="strokeWidth" id="FilledArrow_Marker" viewBox="-1 -2 3 4" markerWidth="3" markerHeight="4" color="black"><g><path d="M .8 0 L 0 -.3 L 0 .3 Z" fill="currentColor" stroke="currentColor" stroke-width="1"/></g></marker><marker orient="auto" overflow="visible" markerUnits="strokeWidth" id="FilledArrow_Marker_2" viewBox="-1 -2 3 4" markerWidth="3" markerHeight="4" color="#7800ff"><g><path d="M .8 0 L 0 -.3 L 0 .3 Z" fill="currentColor" stroke="currentColor" stroke-width="1"/></g></marker><font-face font-family="Helvetica Neue" font-size="12" panose-1="2 0 5 3 0 0 0 2 0 4" units-per-em="1000" underline-position="-100" underline-thickness="50" slope="0" x-height="517" cap-height="714" ascent="951.99585" descent="-212.99744" font-weight="500"><font-face-src><font-face-name name="HelveticaNeue"/></font-face-src></font-face><marker orient="auto" overflow="visible" markerUnits="strokeWidth" id="FilledArrow_Marker_3" viewBox="-1 -4 10 8" markerWidth="10" markerHeight="8" color="black"><g><path d="M 8 0 L 0 -3 L 0 3 Z" fill="currentColor" stroke="currentColor" stroke-width="1"/></g></marker><marker orient="auto" overflow="visible" markerUnits="strokeWidth" id="FilledArrow_Marker_4" viewBox="-1 -3 6 6" markerWidth="6" markerHeight="6" color="black"><g><path d="M 3.2 0 L 0 -1.2 L 0 1.2 Z" fill="currentColor" stroke="currentColor" stroke-width="1"/></g></marker></defs><g stroke="none" stroke-opacity="1" stroke-dasharray="none" fill="none" fill-opacity="1"><title>Canvas 1</title><g><title>Layer 1</title><circle cx="495" cy="57.09375" r="36.000058" fill="#68bc36"/><circle cx="495" cy="57.09375" r="36.000058" stroke="black" stroke-linecap="round" stroke-linejoin="round" stroke-width="1"/><text transform="translate(307.5625 17.052002)" fill="black"><tspan font-family="Helvetica Neue" font-size="32" font-weight="500" x=".6" y="30" textLength="98.4">master</tspan></text><text transform="translate(176.0625 65.052002)" fill="black"><tspan font-family="Helvetica Neue" font-size="16" font-weight="500" x=".576" y="15" textLength="115.888">only branch mer</tspan><tspan font-family="Helvetica Neue" font-size="16" font-weight="500" x="116.016" y="15" textLength="44.144">ges ar</tspan><tspan font-family="Helvetica Neue" font-size="16" font-weight="500" x="159.872" y="15" textLength="68.128">e allowed</tspan><tspan font-family="Helvetica Neue" font-size="16" font-weight="500" x="141.456" y="33.447998" textLength="86.544">commits fail</tspan></text><text transform="translate(35.5 143.052)" fill="black"><tspan font-family="Helvetica Neue" font-size="32" font-weight="500" x=".752" y="30" textLength="78.816">ticker</tspan><tspan font-family="Helvetica Neue" font-size="32" font-weight="500" x="80.144" y="30" textLength="28.448">nr</tspan><tspan font-family="Helvetica Neue" font-size="32" font-weight="500" x="106.832" y="30" textLength="263.168">-some-description</tspan></text><text transform="translate(23 191.104)" fill="black"><tspan font-family="Helvetica Neue" font-size="16" font-weight="500" x=".408" y="15" textLength="191.712">developers do not work dir</tspan><tspan font-family="Helvetica Neue" font-size="16" font-weight="500" x="191.832" y="15" textLength="191.168">ectly on the master branch</tspan><tspan font-family="Helvetica Neue" font-size="16" font-weight="500" x="36.856" y="33.447998" textLength="105.504">instead they cr</tspan><tspan font-family="Helvetica Neue" font-size="16" font-weight="500" x="142.072" y="33.447998" textLength="240.928">eate branches for them to work in</tspan><tspan font-family="Helvetica Neue" font-size="16" font-weight="500" x="230.664" y="51.895996" textLength="152.336">one branch per ticket</tspan><tspan font-family="Helvetica Neue" font-size="16" font-weight="500" x="53.112" y="70.343994" textLength="329.888">one ticket can be handled by multiple persons</tspan></text><circle cx="591" cy="201" r="36.000058" fill="#ff914d"/><circle cx="591" cy="201" r="36.000058" stroke="black" stroke-linecap="round" stroke-linejoin="round" stroke-width="1"/><line x1="514.98203" y1="87.04729" x2="563.41515" y2="159.64966" marker-end="url(#FilledArrow_Marker)" stroke="black" stroke-linecap="round" stroke-linejoin="round" stroke-width="6"/><circle cx="753" cy="201" r="36.000058" fill="#ff914d"/><circle cx="753" cy="201" r="36.000058" stroke="black" stroke-linecap="round" stroke-linejoin="round" stroke-width="1"/><line x1="627" y1="201" x2="703.3" y2="201" marker-end="url(#FilledArrow_Marker)" stroke="black" stroke-linecap="round" stroke-linejoin="round" stroke-width="6"/><circle cx="852" cy="57" r="36.000058" fill="#68bc36"/><circle cx="852" cy="57" r="36.000058" stroke="black" stroke-linecap="round" stroke-linejoin="round" stroke-width="1"/><line x1="773.39862" y1="171.32927" x2="823.83993" y2="97.9601" marker-end="url(#FilledArrow_Marker_2)" stroke="#7800ff" stroke-linecap="round" stroke-linejoin="round" stroke-width="6"/><circle cx="591" cy="336" r="36.000058" fill="#ff914d"/><circle cx="591" cy="336" r="36.000058" stroke="black" stroke-linecap="round" stroke-linejoin="round" stroke-width="1"/><path d="M 495 93.09377 L 495 198 L 562.6146 295.196" marker-end="url(#FilledArrow_Marker)" stroke="black" stroke-linecap="round" stroke-linejoin="round" stroke-width="6"/><circle cx="708" cy="336" r="36.000058" fill="#ff914d"/><circle cx="708" cy="336" r="36.000058" stroke="black" stroke-linecap="round" stroke-linejoin="round" stroke-width="1"/><circle cx="999" cy="336.09375" r="36.000058" fill="#ff914d"/><circle cx="999" cy="336.09375" r="36.000058" stroke="black" stroke-linecap="round" stroke-linejoin="round" stroke-width="1"/><line x1="627" y1="336" x2="658.3" y2="336" marker-end="url(#FilledArrow_Marker)" stroke="black" stroke-linecap="round" stroke-linejoin="round" stroke-width="6"/><circle cx="1107" cy="57.09375" r="36.000058" fill="#68bc36"/><circle cx="1107" cy="57.09375" r="36.000058" stroke="black" stroke-linecap="round" stroke-linejoin="round" stroke-width="1"/><line x1="1011.99905" y1="302.51288" x2="1089.05534" y2="103.4508" marker-end="url(#FilledArrow_Marker_2)" stroke="#7800ff" stroke-linecap="round" stroke-linejoin="round" stroke-width="6"/><line x1="531.00002" y1="57.084296" x2="802.3" y2="57.01305" marker-end="url(#FilledArrow_Marker)" stroke="black" stroke-linecap="round" stroke-linejoin="round" stroke-width="6"/><line x1="888" y1="57.013235" x2="1057.3" y2="57.075478" marker-end="url(#FilledArrow_Marker)" stroke="black" stroke-linecap="round" stroke-linejoin="round" stroke-width="6"/><text transform="translate(635 89.164)" fill="black"><tspan font-family="Helvetica Neue" font-size="12" font-weight="500" x="9.652" y="11" textLength="26.448">pull r</tspan><tspan font-family="Helvetica Neue" font-size="12" font-weight="500" x="35.884" y="11" textLength="66.468">equests mer</tspan><tspan font-family="Helvetica Neue" font-size="12" font-weight="500" x="102.016" y="11" textLength="19.332">ges</tspan><tspan font-family="Helvetica Neue" font-size="12" font-weight="500" x=".256" y="25.335999" textLength="130.488">branch back into master</tspan></text><path d="M 771 102 C 771 102 775.8557 104.108824 786.0547 106.65857 C 789.91914 107.624684 793.8622 108.481963 797.26944 109.17418" marker-end="url(#FilledArrow_Marker_3)" stroke="black" stroke-linecap="round" stroke-linejoin="round" stroke-width="1"/><text transform="translate(829.5 509.052)" fill="black"><tspan font-family="Helvetica Neue" font-size="32" font-weight="500" x=".368" y="30" textLength="61.632">tags</tspan></text><text transform="translate(608 557.328)" fill="black"><tspan font-family="Helvetica Neue" font-size="16" font-weight="500" x="31.504" y="15" textLength="210.416">triggers an automatic build pr</tspan><tspan font-family="Helvetica Neue" font-size="16" font-weight="500" x="241.632" y="15" textLength="42.368">ocess</tspan><tspan font-family="Helvetica Neue" font-size="16" font-weight="500" x=".112" y="33.447998" textLength="283.888">all RPMs needed for deployment will be</tspan><tspan font-family="Helvetica Neue" font-size="16" font-weight="500" x="99.104" y="51.895996" textLength="184.896">available as build artifacts</tspan></text><line x1="949.68885" y1="558" x2="950.0052" y2="522.8978" marker-end="url(#FilledArrow_Marker_4)" stroke="black" stroke-linecap="round" stroke-linejoin="round" stroke-width="4"/><path d="M 411.5625 55.579018 C 423.40717 58.22133 433.3129 59.311663 440.10066 59.749288" marker-end="url(#FilledArrow_Marker_3)" stroke="black" stroke-linecap="round" stroke-linejoin="round" stroke-width="1"/><path d="M 420 165 C 420 165 438.30357 157.350765 474 165 C 498.95264 170.34699 524.20195 181.41175 537.14047 187.58785" marker-end="url(#FilledArrow_Marker_3)" stroke="black" stroke-linecap="round" stroke-linejoin="round" stroke-width="1"/><circle cx="950.5" cy="468" r="36.000058" fill="#3a8eed"/><circle cx="950.5" cy="468" r="36.000058" stroke="black" stroke-linecap="round" stroke-linejoin="round" stroke-width="1"/><circle cx="495" cy="468" r="36.000058" fill="#3a8eed"/><circle cx="495" cy="468" r="36.000058" stroke="black" stroke-linecap="round" stroke-linejoin="round" stroke-width="1"/><line x1="531.00002" y1="468" x2="900.8" y2="468" marker-end="url(#FilledArrow_Marker)" stroke="black" stroke-linecap="round" stroke-linejoin="round" stroke-width="6"/><text transform="translate(743.5 260.164)" fill="black"><tspan font-family="Helvetica Neue" font-size="12" font-weight="500" x="15.212" y="11" textLength="63.576">tests run on</tspan><tspan font-family="Helvetica Neue" font-size="12" font-weight="500" x=".326" y="25.335999" textLength="93.348">every single push</tspan></text><path d="M 774 297 C 774 297 773.49915 300.90051 765 306 C 761.40114 308.15932 757.0848 310.10365 753.30382 311.62791" marker-end="url(#FilledArrow_Marker_3)" stroke="black" stroke-linecap="round" stroke-linejoin="round" stroke-width="1"/><circle cx="1152" cy="336.09375" r="36.000058" fill="#f26077"/><circle cx="1152" cy="336.09375" r="36.000058" stroke="black" stroke-linecap="round" stroke-linejoin="round" stroke-width="1"/><line x1="980.62624" y1="448.2787" x2="1110.41135" y2="363.31858" marker-end="url(#FilledArrow_Marker)" stroke="black" stroke-linecap="round" stroke-linejoin="round" stroke-width="6"/><circle cx="1269" cy="468" r="36.000058" fill="#3a8eed"/><circle cx="1269" cy="468" r="36.000058" stroke="black" stroke-linecap="round" stroke-linejoin="round" stroke-width="1"/><line x1="1175.8893" y1="363.02663" x2="1236.0198" y2="430.81798" marker-end="url(#FilledArrow_Marker)" stroke="black" stroke-linecap="round" stroke-linejoin="round" stroke-width="6"/><line x1="1269" y1="558" x2="1269" y2="522.90002" marker-end="url(#FilledArrow_Marker_4)" stroke="black" stroke-linecap="round" stroke-linejoin="round" stroke-width="4"/><circle cx="1314" cy="57.09375" r="36.000058" fill="#68bc36"/><circle cx="1314" cy="57.09375" r="36.000058" stroke="black" stroke-linecap="round" stroke-linejoin="round" stroke-width="1"/><line x1="1143" y1="57.09375" x2="1264.3" y2="57.09375" marker-end="url(#FilledArrow_Marker)" stroke="black" stroke-linecap="round" stroke-linejoin="round" stroke-width="6"/><line x1="1170.0813" y1="304.95369" x2="1289.0394" y2="100.08142" marker-end="url(#FilledArrow_Marker)" stroke="black" stroke-linecap="round" stroke-linejoin="round" stroke-width="6"/><text transform="translate(1256 268.052)" fill="black"><tspan font-family="Helvetica Neue" font-size="32" font-weight="500" x="0" y="30" textLength="78.816">ticker</tspan><tspan font-family="Helvetica Neue" font-size="32" font-weight="500" x="79.392" y="30" textLength="28.448">nr</tspan><tspan font-family="Helvetica Neue" font-size="32" font-weight="500" x="106.08" y="30" textLength="75.264">-hotfi</tspan><tspan font-family="Helvetica Neue" font-size="32" font-weight="500" x="181.344" y="30" textLength="279.744">x-some-description</tspan></text><text transform="translate(1256 316.38)" fill="black"><tspan font-family="Helvetica Neue" font-size="16" font-weight="500" x="0" y="15" textLength="16.88">Ur</tspan><tspan font-family="Helvetica Neue" font-size="16" font-weight="500" x="16.432" y="15" textLength="185.52">gent patches found after r</tspan><tspan font-family="Helvetica Neue" font-size="16" font-weight="500" x="201.664" y="15" textLength="207.2">eleasing can be branched off</tspan><tspan font-family="Helvetica Neue" font-size="16" font-weight="500" x="0" y="33.447998" textLength="18.368">dir</tspan><tspan font-family="Helvetica Neue" font-size="16" font-weight="500" x="18.08" y="33.447998" textLength="48.288">ectly fr</tspan><tspan font-family="Helvetica Neue" font-size="16" font-weight="500" x="66.08" y="33.447998" textLength="59.584">om the r</tspan><tspan font-family="Helvetica Neue" font-size="16" font-weight="500" x="125.376" y="33.447998" textLength="196.192">elease branch to save time.</tspan><tspan font-family="Helvetica Neue" font-size="16" font-weight="500" x="0" y="51.895996" textLength="178.096">This also stops further pr</tspan><tspan font-family="Helvetica Neue" font-size="16" font-weight="500" x="177.808" y="51.895996" textLength="23.696">ogr</tspan><tspan font-family="Helvetica Neue" font-size="16" font-weight="500" x="201.216" y="51.895996" textLength="195.024">ess in the master branch to</tspan><tspan font-family="Helvetica Neue" font-size="16" font-weight="500" x="0" y="70.343994" textLength="133.072">sneak into the curr</tspan><tspan font-family="Helvetica Neue" font-size="16" font-weight="500" x="132.784" y="70.343994" textLength="32.304">ent r</tspan><tspan font-family="Helvetica Neue" font-size="16" font-weight="500" x="164.8" y="70.343994" textLength="50.368">elease.</tspan><tspan font-family="Helvetica Neue" font-size="16" font-weight="500" x="0" y="88.79199" textLength="115.888">This branch mer</tspan><tspan font-family="Helvetica Neue" font-size="16" font-weight="500" x="115.44" y="88.79199" textLength="54.224">ges to r</tspan><tspan font-family="Helvetica Neue" font-size="16" font-weight="500" x="169.376" y="88.79199" textLength="137.2">elease AND master</tspan><tspan font-family="Helvetica Neue" font-size="16" font-weight="500" x="305.104" y="88.79199" textLength="4.448">.</tspan></text><path d="M 1242 288 C 1242 288 1230.2985 289.35076 1215 297 C 1207.35375 300.82312 1200.60604 305.3211 1195.76874 308.86431" marker-end="url(#FilledArrow_Marker_3)" stroke="black" stroke-linecap="round" stroke-linejoin="round" stroke-width="1"/><text transform="translate(304.5625 428.052)" fill="black"><tspan font-family="Helvetica Neue" font-size="32" font-weight="500" x=".08" y="30" textLength="10.656">r</tspan><tspan font-family="Helvetica Neue" font-size="32" font-weight="500" x="10.16" y="30" textLength="91.84">elease</tspan></text><text transform="translate(176.0625 476.052)" fill="black"><tspan font-family="Helvetica Neue" font-size="16" font-weight="500" x=".576" y="15" textLength="115.888">only branch mer</tspan><tspan font-family="Helvetica Neue" font-size="16" font-weight="500" x="116.016" y="15" textLength="44.144">ges ar</tspan><tspan font-family="Helvetica Neue" font-size="16" font-weight="500" x="159.872" y="15" textLength="68.128">e allowed</tspan><tspan font-family="Helvetica Neue" font-size="16" font-weight="500" x="141.456" y="33.447998" textLength="86.544">commits fail</tspan></text><path d="M 411.5625 449.07748 C 414.45375 449.34874 417.28322 449.65478 420 450 C 430.04343 451.2762 436.774 452.86252 441.2636 454.34628" marker-end="url(#FilledArrow_Marker_3)" stroke="black" stroke-linecap="round" stroke-linejoin="round" stroke-width="1"/><line x1="986.5" y1="468" x2="1219.3" y2="468" marker-end="url(#FilledArrow_Marker)" stroke="black" stroke-linecap="round" stroke-linejoin="round" stroke-width="6"/><rect x="463.5" y="558" width="63" height="41.90625" fill="#00bfc0"/><rect x="463.5" y="558" width="63" height="41.90625" stroke="black" stroke-linecap="round" stroke-linejoin="round" stroke-width="1"/><text transform="translate(468.5 569.72913)" fill="black"><tspan font-family="Helvetica Neue" font-size="16" font-weight="500" x="4.26" y="15" textLength="44.48">0.32.4</tspan></text><line x1="495" y1="558" x2="495" y2="522.90002" marker-end="url(#FilledArrow_Marker_4)" stroke="black" stroke-linecap="round" stroke-linejoin="round" stroke-width="4"/><rect x="918" y="558" width="63" height="41.90625" fill="#00bfc0"/><rect x="918" y="558" width="63" height="41.90625" stroke="black" stroke-linecap="round" stroke-linejoin="round" stroke-width="1"/><text transform="translate(923 569.72913)" fill="black"><tspan font-family="Helvetica Neue" font-size="16" font-weight="500" x="8.708" y="15" textLength="35.584">1.0.0</tspan></text><rect x="1237.5" y="558" width="63" height="41.90625" fill="#00bfc0"/><rect x="1237.5" y="558" width="63" height="41.90625" stroke="black" stroke-linecap="round" stroke-linejoin="round" stroke-width="1"/><text transform="translate(1242.5 569.72913)" fill="black"><tspan font-family="Helvetica Neue" font-size="16" font-weight="500" x="8.708" y="15" textLength="35.584">1.0.1</tspan></text><text transform="translate(1030 509.496)" fill="black"><tspan font-family="Helvetica Neue" font-size="12" font-weight="500" x=".366" y="11" textLength="134.268">tags must have a semver</tspan><tspan font-family="Helvetica Neue" font-size="12" font-weight="500" x="21.036" y="25.335999" textLength="92.928">compatible name</tspan><tspan font-family="Helvetica Neue" font-size="12" font-weight="500" x="8.028" y="39.671997" textLength="53.568">e.g. major</tspan><tspan font-family="Helvetica Neue" font-size="12" font-weight="500" x="60.492" y="39.671997" textLength="33.792">.minor</tspan><tspan font-family="Helvetica Neue" font-size="12" font-weight="500" x="93.18" y="39.671997" textLength="33.792">.patch</tspan></text><path d="M 1025 529.06548 C 1019.08224 529.48268 1013.33415 530.10743 1008 531 C 990.6115 533.90963 981.62056 538.9961 976.97235 543.43426" marker-end="url(#FilledArrow_Marker_3)" stroke="black" stroke-linecap="round" stroke-linejoin="round" stroke-width="1"/><path d="M 860.39134 92.01361 L 916.4341 325.85708 M 921.3284 346.2788 L 938.91574 419.66366" marker-end="url(#FilledArrow_Marker_2)" stroke="#7800ff" stroke-linecap="round" stroke-linejoin="round" stroke-width="6"/><line x1="744" y1="336.0116" x2="949.3" y2="336.07774" marker-end="url(#FilledArrow_Marker)" stroke="black" stroke-linecap="round" stroke-linejoin="round" stroke-width="6"/><text transform="translate(1325 143.164)" fill="black"><tspan font-family="Helvetica Neue" font-size="12" font-weight="500" x="22.702" y="11" textLength="91.356">this is not a pull r</tspan><tspan font-family="Helvetica Neue" font-size="12" font-weight="500" x="113.842" y="11" textLength="36.456">equest</tspan><tspan font-family="Helvetica Neue" font-size="12" font-weight="500" x=".262" y="25.335999" textLength="33.336">a hotfi</tspan><tspan font-family="Helvetica Neue" font-size="12" font-weight="500" x="33.598" y="25.335999" textLength="139.14">x needs to be applied fast</tspan></text><path d="M 1363.3618 177 C 1349.6573 181.7384 1334.5055 186.23298 1320 189 C 1294.75055 193.8165 1278.4442 192.06618 1269.297 189.80844" marker-end="url(#FilledArrow_Marker_3)" stroke="black" stroke-linecap="round" stroke-linejoin="round" stroke-width="1"/><text transform="translate(896.5 98.328)" fill="black"><tspan font-family="Helvetica Neue" font-size="12" font-weight="500" x="28.76" y="11" textLength="26.448">pull r</tspan><tspan font-family="Helvetica Neue" font-size="12" font-weight="500" x="54.992" y="11" textLength="47.34">equest fr</tspan><tspan font-family="Helvetica Neue" font-size="12" font-weight="500" x="102.116" y="11" textLength="17.124">om</tspan><tspan font-family="Helvetica Neue" font-size="12" font-weight="500" x="27.77" y="25.335999" textLength="58.236">master to r</tspan><tspan font-family="Helvetica Neue" font-size="12" font-weight="500" x="85.79" y="25.335999" textLength="34.44">elease</tspan><tspan font-family="Helvetica Neue" font-size="12" font-weight="500" x="11.888" y="39.671997" textLength="24.444">to cr</tspan><tspan font-family="Helvetica Neue" font-size="12" font-weight="500" x="36.116" y="39.671997" textLength="65.772">eate a new r</tspan><tspan font-family="Helvetica Neue" font-size="12" font-weight="500" x="101.672" y="39.671997" textLength="34.44">elease</tspan><tspan font-family="Helvetica Neue" font-size="12" font-weight="500" x=".218" y="54.007996" textLength="104.244">this implies a featur</tspan><tspan font-family="Helvetica Neue" font-size="12" font-weight="500" x="104.246" y="54.007996" textLength="18.66">e-fr</tspan><tspan font-family="Helvetica Neue" font-size="12" font-weight="500" x="122.69" y="54.007996" textLength="25.092">eeze</tspan></text><path d="M 938.1323 161 C 934.45467 164.48126 930.6981 167.88052 927 171 C 917.9713 178.61604 911.1321 183.0116 906.28107 185.54761" marker-end="url(#FilledArrow_Marker_3)" stroke="black" stroke-linecap="round" stroke-linejoin="round" stroke-width="1"/><rect x="783" y="289.54545" width="63" height="25.454545" id="path"/><clipPath id="clip_path"><use xl:href="#path"/></clipPath><g clip-path="url(#clip_path)"><image xl:href="image2.png" width="99" height="40" transform="translate(783 289.54545) scale(.63636364)"/></g><text transform="translate(1112 122.496)" fill="black"><tspan font-family="Helvetica Neue" font-size="12" font-weight="500" x=".1" y="11" textLength="115.8">this new code did not</tspan><tspan font-family="Helvetica Neue" font-size="12" font-weight="500" x="16.648" y="25.335999" textLength="82.704">make it into the</tspan><tspan font-family="Helvetica Neue" font-size="12" font-weight="500" x="24.106" y="39.671997" textLength="33.564">1.0.x r</tspan><tspan font-family="Helvetica Neue" font-size="12" font-weight="500" x="57.454" y="39.671997" textLength="34.44">elease</tspan></text><path d="M 1107 137.451926 C 1103.7588 137.304366 1101.0789 137.245715 1098.86897 137.24454" marker-end="url(#FilledArrow_Marker_3)" stroke="black" stroke-linecap="round" stroke-linejoin="round" stroke-width="1"/></g></g></svg>
