{
  "apps": [
    {
      "name": "l1page-api",
      "interpreter": "/opt/cactus/L1Page/node/bin/node",
      "script": "./main.js",
      "max_memory_restart": "512M",
      "error_file": "/var/log/l1page/error.log",
      "out_file": "/var/log/l1page/out.log",
      "combine_logs": true,
      "autorestart": true,
      "env": {},
      "log_date_format" : "YYYY-MM-DD HH:mm Z"
    }
  ]
}
