{
  "subsystems": {
    "TFM": {
      "apps": {
        "SUPERVISOR": {
          "uri": "http://cmsrc-trigger.cms:19000/rcms/gui/servlet/RunGroupChooserServlet/",
          "telemetry": {
            "dataSource": null,
            "healthCheck": "CHECK_HTTP_GET_RETURNS_200",
            "critical": true
          }
        }
      }
    },
    "XDAQ_Services": {
      "apps": {
        "TRG_SLASH": {
          "uri": "http://pc-c2e11-27-01.cms:9945/urn:xdaq-application:lid=16",
          "telemetry": {
            "critical": false,
            "dataSource": null,
            "healthCheck": "CHECK_HTTP_GET_RETURNS_200"
          }
        },
        "TRG_B2IN-EVENTING": {
          "uri": "http://pc-c2e11-27-01.cms:4002",
          "telemetry": {
            "critical": false,
            "dataSource": null,
            "healthCheck": "CHECK_HTTP_GET_RETURNS_200"
          }
        },
        "TRG-DIRECTORY-SERVICE": {
          "uri": "http://pc-c2e11-27-01.cms:9966",
          "telemetry": {
            "critical": false,
            "dataSource": null,
            "healthCheck": "CHECK_HTTP_GET_RETURNS_200"
          }
        }
      }
    },
    "CENTRAL": {
      "apps": {
        "SUPERVISOR": {
          "uri": "http://l1ts-central.cms:3333/urn:xdaq-application:lid=13",
          "telemetry": {
            "healthCheck": "CHECK_HTTP_GET_RETURNS_200",
            "critical": true,
            "dataSource": "CHECK_FLASHLIST"
          }
        },
        "TSTORE": {
          "uri": "http://l1ts-central.cms:7000",
          "telemetry": {
            "healthCheck": "CHECK_HTTP_GET_RETURNS_TSTORE",
            "dataSource": null,
            "critical": true
          }
        }
      }
    },
    "L1CE": {
      "apps": {
        "SUPERVISOR": {
          "uri": "http://l1ts-l1ce.cms:3333/urn:xdaq-application:lid=13",
          "telemetry": {
            "healthCheck": "CHECK_HTTP_GET_RETURNS_200",
            "critical": true,
            "dataSource": "CHECK_FLASHLIST"
          }
        },
        "TSTORE": {
          "uri": "http://l1ts-l1ce.cms:7000",
          "telemetry": {
            "healthCheck": "CHECK_HTTP_GET_RETURNS_TSTORE",
            "dataSource": null,
            "critical": true
          }
        }
      }
    },
    "UGT": {
      "apps": {
        "SUPERVISOR": {
          "uri": "http://l1ts-ugt.cms:3333/urn:xdaq-application:lid=13",
          "telemetry": {
            "healthCheck": "CHECK_HTTP_GET_RETURNS_200",
            "critical": true,
            "dataSource": "CHECK_FLASHLIST"
          }
        },
        "TCDS iCI": {
          "uri": "http://l1ts-ugt.cms:4500/urn:xdaq-application:lid=13",
          "telemetry": {
            "healthCheck": "CHECK_HTTP_GET_RETURNS_200",
            "critical": true,
            "dataSource": "CHECK_FLASHLIST"
          }
        },
        "TCDS PI": {
          "uri": "http://l1ts-ugt.cms:5500/urn:xdaq-application:lid=13",
          "telemetry": {
            "healthCheck": "CHECK_HTTP_GET_RETURNS_200",
            "critical": true,
            "dataSource": "CHECK_FLASHLIST"
          }
        },
        "TSTORE": {
          "uri": "http://l1ts-ugt.cms:7000",
          "telemetry": {
            "healthCheck": "CHECK_HTTP_GET_RETURNS_TSTORE",
            "dataSource": null,
            "critical": true
          }
        }
      }
    },
    "CALOL1": {
      "apps": {
        "SUPERVISOR": {
          "uri": "http://l1ts-calol1.cms:3333/urn:xdaq-application:lid=13",
          "telemetry": {
            "healthCheck": "CHECK_HTTP_GET_RETURNS_200",
            "critical": true,
            "dataSource": "CHECK_FLASHLIST"
          }
        },
        "TCDS iCI": {
          "uri": "http://l1ts-calol1.cms:4500/urn:xdaq-application:lid=13",
          "telemetry": {
            "healthCheck": "CHECK_HTTP_GET_RETURNS_200",
            "critical": true,
            "dataSource": "CHECK_FLASHLIST"
          }
        },
        "TCDS PI": {
          "uri": "http://l1ts-calol1.cms:5500/urn:xdaq-application:lid=13",
          "telemetry": {
            "healthCheck": "CHECK_HTTP_GET_RETURNS_200",
            "critical": true,
            "dataSource": "CHECK_FLASHLIST"
          }
        },
        "TSTORE": {
          "uri": "http://l1ts-calol1.cms:7000",
          "telemetry": {
            "healthCheck": "CHECK_HTTP_GET_RETURNS_TSTORE",
            "dataSource": null,
            "critical": true
          }
        }
      }
    },
    "CALOL2": {
      "apps": {
        "SUPERVISOR": {
          "uri": "http://l1ts-calol2.cms:3333/urn:xdaq-application:lid=13",
          "telemetry": {
            "healthCheck": "CHECK_HTTP_GET_RETURNS_200",
            "critical": true,
            "dataSource": "CHECK_FLASHLIST"
          }
        },
        "TCDS iCI": {
          "uri": "http://l1ts-calol2.cms:4500/urn:xdaq-application:lid=13",
          "telemetry": {
            "healthCheck": "CHECK_HTTP_GET_RETURNS_200",
            "critical": true,
            "dataSource": "CHECK_FLASHLIST"
          }
        },
        "TCDS PI": {
          "uri": "http://l1ts-calol2.cms:5500/urn:xdaq-application:lid=13",
          "telemetry": {
            "healthCheck": "CHECK_HTTP_GET_RETURNS_200",
            "critical": true,
            "dataSource": "CHECK_FLASHLIST"
          }
        },
        "TSTORE": {
          "uri": "http://l1ts-calol2.cms:7000",
          "telemetry": {
            "healthCheck": "CHECK_HTTP_GET_RETURNS_TSTORE",
            "dataSource": null,
            "critical": true
          }
        }
      }
    },
    "UGMT": {
      "apps": {
        "SUPERVISOR": {
          "uri": "http://l1ts-ugmt.cms:3333/urn:xdaq-application:lid=13",
          "telemetry": {
            "healthCheck": "CHECK_HTTP_GET_RETURNS_200",
            "critical": true,
            "dataSource": "CHECK_FLASHLIST"
          }
        },
        "TCDS iCI": {
          "uri": "http://l1ts-ugmt.cms:4500/urn:xdaq-application:lid=13",
          "telemetry": {
            "healthCheck": "CHECK_HTTP_GET_RETURNS_200",
            "critical": true,
            "dataSource": "CHECK_FLASHLIST"
          }
        },
        "TCDS PI": {
          "uri": "http://l1ts-ugmt.cms:5500/urn:xdaq-application:lid=13",
          "telemetry": {
            "healthCheck": "CHECK_HTTP_GET_RETURNS_200",
            "critical": true,
            "dataSource": "CHECK_FLASHLIST"
          }
        },
        "TSTORE": {
          "uri": "http://l1ts-ugmt.cms:7000",
          "telemetry": {
            "healthCheck": "CHECK_HTTP_GET_RETURNS_TSTORE",
            "dataSource": null,
            "critical": true
          }
        }
      }
    },
    "TWINMUX": {
      "apps": {
        "SUPERVISOR": {
          "uri": "http://l1ts-twinmux.cms:3333/urn:xdaq-application:lid=13",
          "telemetry": {
            "healthCheck": "CHECK_HTTP_GET_RETURNS_200",
            "critical": true,
            "dataSource": "CHECK_FLASHLIST"
          }
        },
        "TCDS iCI": {
          "uri": "http://l1ts-twinmux.cms:4500/urn:xdaq-application:lid=13",
          "telemetry": {
            "healthCheck": "CHECK_HTTP_GET_RETURNS_200",
            "critical": true,
            "dataSource": "CHECK_FLASHLIST"
          }
        },
        "TCDS PI": {
          "uri": "http://l1ts-twinmux.cms:5500/urn:xdaq-application:lid=13",
          "telemetry": {
            "healthCheck": "CHECK_HTTP_GET_RETURNS_200",
            "critical": true,
            "dataSource": "CHECK_FLASHLIST"
          }
        },
        "TSTORE": {
          "uri": "http://l1ts-twinmux.cms:7000",
          "telemetry": {
            "healthCheck": "CHECK_HTTP_GET_RETURNS_TSTORE",
            "dataSource": null,
            "critical": true
          }
        }
      }
    },
    "BMTF": {
      "apps": {
        "SUPERVISOR": {
          "uri": "http://l1ts-bmtf.cms:3333/urn:xdaq-application:lid=13",
          "telemetry": {
            "healthCheck": "CHECK_HTTP_GET_RETURNS_200",
            "critical": true,
            "dataSource": "CHECK_FLASHLIST"
          }
        }
      }
    },
    "EMTF": {
      "apps": {
        "SUPERVISOR": {
          "uri": "http://l1ts-emtf.cms:3333/urn:xdaq-application:lid=13",
          "telemetry": {
            "healthCheck": "CHECK_HTTP_GET_RETURNS_200",
            "critical": true,
            "dataSource": "CHECK_FLASHLIST"
          }
        }
      }
    },
    "OMTF": {
      "apps": {
        "SUPERVISOR": {
          "uri": "http://l1ts-omtf.cms:3333/urn:xdaq-application:lid=13",
          "telemetry": {
            "healthCheck": "CHECK_HTTP_GET_RETURNS_200",
            "critical": true,
            "dataSource": "CHECK_FLASHLIST"
          }
        }
      }
    },
    "CPPF": {
      "apps": {
        "SUPERVISOR": {
          "uri": "http://l1ts-cppf.cms:3333/urn:xdaq-application:lid=13",
          "telemetry": {
            "healthCheck": "CHECK_HTTP_GET_RETURNS_200",
            "critical": true,
            "dataSource": "CHECK_FLASHLIST"
          }
        }
      }
    }
  }
}
