<svg xmlns="http://www.w3.org/2000/svg" xmlns:ev="http://www.w3.org/2001/xml-events" xmlns:xlink="http://www.w3.org/1999/xlink" baseProfile="full" height="100%" version="1.1" viewBox="155 30 600 460" width="100%">
  <defs>
    <g id="error">
      <path d="M12 2C6.48 2 2 6.48 2 12s4.48 10 10 10 10-4.48 10-10S17.52 2 12 2zm1 15h-2v-2h2v2zm0-4h-2V7h2v6z"/>
    </g>
    <g id="warning">
      <path d="M1 21h22L12 2 1 21zm12-3h-2v-2h2v2zm0-4h-2v-4h2v4z"/>
    </g>
    <g id="info">
      <path d="M11 17h2v-6h-2v6zm1-15C6.48 2 2 6.48 2 12s4.48 10 10 10 10-4.48 10-10S17.52 2 12 2zm0 18c-4.41 0-8-3.59-8-8s3.59-8 8-8 8 3.59 8 8-3.59 8-8 8zM11 9h2V7h-2v2z"/>
    </g>
    <g id="dead">
      <path d="M122.855,335.491c3.514,11.463,7.147,23.318,8.96,35.258c0.741,4.866,3.647,40.261,5.218,59.707c0.602,7.451,6.252,13.508,13.643,14.626l25.821,3.904c3.723,0.563,6.692,3.402,7.417,7.097l3.402,17.401c1.479,7.563,8.108,13.018,15.814,13.014l200.241-0.119c7.572-0.005,14.118-5.283,15.726-12.682l3.896-17.915c0.86-3.536,3.782-6.193,7.383-6.717l31.437-4.566c7.554-1.097,13.3-7.344,13.759-14.964c1.206-20.008,3.457-56.434,4.155-61.425c1.653-11.784,5.131-23.432,8.49-34.764c4.709-15.857,9.578-32.225,9.578-49.248c0.006-108.709-86.402-197.132-192.608-197.132s-192.613,88.471-192.613,197.204C112.575,301.952,117.801,319.004,122.855,335.491z M330.285,325.459c1.221-30.877,28.91-38.641,59.787-37.421c30.877,1.221,53.249,10.965,52.028,41.842c-1.221,30.877-27.241,54.918-58.118,53.697C353.105,382.356,329.064,356.336,330.285,325.459z M312.119,386.048l20.042,29.679c1.778,2.632,2.021,6.011,0.639,8.871l-2.875,5.951c-1.489,3.081-4.609,5.038-8.03,5.038h-17.167h-17.167c-3.422,0-6.542-1.958-8.03-5.038l-2.875-5.951c-1.382-2.86-1.138-6.238,0.639-8.871l20.042-29.679C300.873,380.811,308.583,380.811,312.119,386.048z M220.299,288.039c30.877-1.221,58.566,6.543,59.787,37.421c1.221,30.877-22.82,56.897-53.697,58.118c-30.877,1.221-56.897-22.82-58.118-53.697C167.05,299.003,189.422,289.259,220.299,288.039z"/>
      <path d="M556.35,58.611c2.402-14.75-2.089-30.405-13.499-41.757c-18.326-18.234-48.224-18.566-66.929-0.721c-19.558,18.659-19.834,49.646-0.828,68.652l-17.47,17.47c-6.98,6.981-6.98,18.299,0,25.28l29.802,29.802c6.98,6.981,18.299,6.981,25.279,0l17.47-17.47c19.007,19.007,49.994,18.73,68.652-0.828c17.845-18.705,17.512-48.604-0.722-66.929C586.754,60.7,571.1,56.209,556.35,58.611z"/>
      <path d="M81.824,139.866l17.47,17.47c6.981,6.981,18.299,6.981,25.279,0l29.802-29.802c6.981-6.981,6.981-18.299,0-25.28l-17.47-17.47c19.007-19.006,18.73-49.993-0.828-68.652C117.372-1.712,87.474-1.38,69.148,16.854C57.739,28.206,53.248,43.861,55.65,58.611C40.9,56.209,25.246,60.7,13.893,72.109c-18.234,18.325-18.567,48.224-0.722,66.929C31.83,158.596,62.817,158.872,81.824,139.866z"/>
      <path d="M598.829,472.962c-18.659-19.559-49.646-19.834-68.652-0.828l-17.47-17.47c-6.981-6.981-18.299-6.981-25.279,0l-29.802,29.802c-6.98,6.981-6.98,18.299,0,25.28l17.47,17.47c-19.007,19.007-18.73,49.994,0.828,68.652c18.705,17.845,48.604,17.513,66.929-0.721c11.41-11.352,15.901-27.007,13.499-41.757c14.75,2.402,30.404-2.089,41.756-13.499C616.341,521.565,616.673,491.667,598.829,472.962z"/>
      <path d="M55.65,553.389c-2.402,14.75,2.089,30.405,13.499,41.757c18.326,18.234,48.224,18.566,66.929,0.721c19.558-18.659,19.834-49.646,0.828-68.652l17.47-17.47c6.981-6.98,6.981-18.299,0-25.28l-29.802-29.802c-6.981-6.981-18.299-6.981-25.279,0l-17.47,17.47c-19.007-19.007-49.994-18.731-68.652,0.828c-17.845,18.705-17.513,48.603,0.721,66.929C25.246,551.3,40.9,555.791,55.65,553.389z"/>
    </g>
    <marker id="FilledArrow_Marker" markerHeight="8" markerUnits="strokeWidth" markerWidth="10" orient="auto" overflow="visible" refX="9" viewBox="-1 -4 10 8">
      <g>
        <path d="M 8 0 L 0 -3 L 0 3 Z" fill="currentColor" stroke="currentColor" stroke-width="1"/>
      </g>
    </marker>
  </defs>
  <rect height="460" style="fill:rgb(255,255,255);stroke-width:1;stroke:rgb(0,0,0)" width="600" x="155" y="30"/>
  <g>
    <polyline fill="none" id="ugmt_ugt" marker-end="url(#FilledArrow_Marker)" points="552.5,155.0 552.5,132.5 428.333333333,132.5 428.333333333,110.0" style="stroke:rgb(128,128,128);stroke-width:1"/>
    <polyline fill="none" id="calol2_ugt" marker-end="url(#FilledArrow_Marker)" points="277.5,155.0 277.5,132.5 401.666666667,132.5 401.666666667,110.0" style="stroke:rgb(128,128,128);stroke-width:1"/>
    <polyline fill="none" id="calol1_calol2" marker-end="url(#FilledArrow_Marker)" points="277.5,282.5 277.5,238.75 277.5,238.75 277.5,195.0" style="stroke:rgb(128,128,128);stroke-width:1"/>
    <polyline fill="none" id="bmtf_ugmt" marker-end="url(#FilledArrow_Marker)" points="420.5,240.0 420.5,217.5 532.5,217.5 532.5,195.0" style="stroke:rgb(128,128,128);stroke-width:1"/>
    <polyline fill="none" id="omtf_ugmt" marker-end="url(#FilledArrow_Marker)" points="552.5,240.0 552.5,217.5 552.5,217.5 552.5,195.0" style="stroke:rgb(128,128,128);stroke-width:1"/>
    <polyline fill="none" id="emtf_ugmt" marker-end="url(#FilledArrow_Marker)" points="684.5,240.0 684.5,217.5 572.5,217.5 572.5,195.0" style="stroke:rgb(128,128,128);stroke-width:1"/>
    <polyline fill="none" id="twinmux_bmtf" marker-end="url(#FilledArrow_Marker)" points="475.3,325.0 475.3,302.5 420.5,302.5 420.5,280.0" style="stroke:rgb(128,128,128);stroke-width:1"/>
    <polyline fill="none" id="twinmux_omtf" marker-end="url(#FilledArrow_Marker)" points="497.7,325.0 497.7,302.5 532.5,302.5 532.5,280.0" style="stroke:rgb(128,128,128);stroke-width:1"/>
    <polyline fill="none" id="cppf_emtf" marker-end="url(#FilledArrow_Marker)" points="631.7,325.0 631.7,302.5 664.5,302.5 664.5,280.0" style="stroke:rgb(128,128,128);stroke-width:1"/>
    <polyline fill="none" id="ecal_calol1" marker-end="url(#FilledArrow_Marker)" points="222.5,431.25 222.5,398.625 264.166666667,398.625 264.166666667,322.5" style="stroke:rgb(128,128,128);stroke-width:1"/>
    <polyline fill="none" id="hcal_calol1" marker-end="url(#FilledArrow_Marker)" points="332.5,431.25 332.5,398.625 290.833333333,398.625 290.833333333,322.5" style="stroke:rgb(128,128,128);stroke-width:1"/>
    <polyline fill="none" id="dt_twinmux" marker-end="url(#FilledArrow_Marker)" points="442.5,431.25 442.5,398.125 475.3,398.125 475.3,365.0" style="stroke:rgb(128,128,128);stroke-width:1"/>
    <polyline fill="none" id="rpc_twinmux" marker-end="url(#FilledArrow_Marker)" points="532.5,431.25 532.5,398.125 497.7,398.125 497.7,365.0" style="stroke:rgb(128,128,128);stroke-width:1"/>
    <polyline fill="none" id="rpc_omtf" marker-end="url(#FilledArrow_Marker)" points="552.5,431.25 552.5,355.625 552.5,355.625 552.5,280.0" style="stroke:rgb(128,128,128);stroke-width:1"/>
    <polyline fill="none" id="rpc_cppf" marker-end="url(#FilledArrow_Marker)" points="572.5,431.25 572.5,398.125 631.7,398.125 631.7,365.0" style="stroke:rgb(128,128,128);stroke-width:1"/>
    <polyline fill="none" id="csc_omtf" marker-end="url(#FilledArrow_Marker)" points="642.5,431.25 642.5,385.875 572.5,385.875 572.5,280.0" style="stroke:rgb(128,128,128);stroke-width:1"/>
    <polyline fill="none" id="csc_emtf" marker-end="url(#FilledArrow_Marker)" points="682.5,431.25 682.5,431.25 684.5,431.25 684.5,280.0" style="stroke:rgb(128,128,128);stroke-width:1"/>
    <line stroke-dasharray="1,9" stroke-linecap="butt" style="stroke:rgb(128,128,128);stroke-width:1" x1="182.5" x2="724.5" y1="413.0" y2="413.0"/>
    <rect height="40" id="CENTRAL" rx="5" ry="5" style="fill:rgb(255,255,255);stroke-width:1;stroke:rgb(0,0,0)" width="104.0" x="166.5" y="50.0"/>
    <text for="CENTRAL" transform="translate(52.0 22)" x="166.5" y="50.0">
      <tspan alignment-baseline="middle" dominant-baseline="middle" text-anchor="middle">Central Cell</tspan>
    </text>
    <g for="CENTRAL" transform="translate(81.5 -22.5)">
      <svg x="166.5" y="50.0">
        <defs/>
      </svg>
    </g>
    <rect class="service" height="40" id="L1CE" rx="0" ry="0" style="fill:rgb(255,255,255);stroke-width:1;stroke:rgb(0,0,0)" width="88.0" x="652.5" y="50.0"/>
    <text class="service" for="L1CE" transform="translate(44.0 22)" x="652.5" y="50.0">
      <tspan alignment-baseline="middle" dominant-baseline="middle" text-anchor="middle">L1CE</tspan>
    </text>
    <g for="L1CE" transform="translate(65.5 -22.5)">
      <svg x="652.5" y="50.0">
        <defs/>
      </svg>
    </g>
    <rect class="service" height="40" id="XDAQ_Services" rx="0" ry="0" style="fill:rgb(255,255,255);stroke-width:1;stroke:rgb(0,0,0)" width="88.0" x="652.5" y="90.0"/>
    <text class="service" for="XDAQ_Services" transform="translate(44.0 22)" x="652.5" y="90.0">
      <tspan alignment-baseline="middle" dominant-baseline="middle" text-anchor="middle">Monitoring</tspan>
    </text>
    <g for="XDAQ_Services" transform="translate(65.5 -22.5)">
      <svg x="652.5" y="90.0">
        <defs/>
      </svg>
    </g>
    <rect height="40" id="UGT" rx="5" ry="5" style="fill:rgb(255,255,255);stroke-width:1;stroke:rgb(0,0,0)" width="80" x="375.0" y="70.0"/>
    <text for="UGT" transform="translate(40 22)" x="375.0" y="70.0">
      <tspan alignment-baseline="middle" dominant-baseline="middle" text-anchor="middle">μGT</tspan>
    </text>
    <g for="UGT" transform="translate(57.5 -22.5)">
      <svg x="375.0" y="70.0">
        <defs/>
      </svg>
    </g>
    <rect height="40" id="UGMT" rx="5" ry="5" style="fill:rgb(255,255,255);stroke-width:1;stroke:rgb(0,0,0)" width="80" x="512.5" y="155.0"/>
    <text for="UGMT" transform="translate(40 22)" x="512.5" y="155.0">
      <tspan alignment-baseline="middle" dominant-baseline="middle" text-anchor="middle">μGMT</tspan>
    </text>
    <g for="UGMT" transform="translate(57.5 -22.5)">
      <svg x="512.5" y="155.0">
        <defs/>
      </svg>
    </g>
    <rect height="40" id="CALOL2" rx="5" ry="5" style="fill:rgb(255,255,255);stroke-width:1;stroke:rgb(0,0,0)" width="80" x="237.5" y="155.0"/>
    <text for="CALOL2" transform="translate(40 22)" x="237.5" y="155.0">
      <tspan alignment-baseline="middle" dominant-baseline="middle" text-anchor="middle">Calo L2</tspan>
    </text>
    <g for="CALOL2" transform="translate(57.5 -22.5)">
      <svg x="237.5" y="155.0">
        <defs/>
      </svg>
    </g>
    <rect height="40" id="CALOL1" rx="5" ry="5" style="fill:rgb(255,255,255);stroke-width:1;stroke:rgb(0,0,0)" width="80" x="237.5" y="282.5"/>
    <text for="CALOL1" transform="translate(40 22)" x="237.5" y="282.5">
      <tspan alignment-baseline="middle" dominant-baseline="middle" text-anchor="middle">Calo L1</tspan>
    </text>
    <g for="CALOL1" transform="translate(57.5 -22.5)">
      <svg x="237.5" y="282.5">
        <defs/>
      </svg>
    </g>
    <rect height="40" id="BMTF" rx="5" ry="5" style="fill:rgb(255,255,255);stroke-width:1;stroke:rgb(0,0,0)" width="80" x="380.5" y="240.0"/>
    <text for="BMTF" transform="translate(40 22)" x="380.5" y="240.0">
      <tspan alignment-baseline="middle" dominant-baseline="middle" text-anchor="middle">BMTF</tspan>
    </text>
    <g for="BMTF" transform="translate(57.5 -22.5)">
      <svg x="380.5" y="240.0">
        <defs/>
      </svg>
    </g>
    <rect height="40" id="OMTF" rx="5" ry="5" style="fill:rgb(255,255,255);stroke-width:1;stroke:rgb(0,0,0)" width="80" x="512.5" y="240.0"/>
    <text for="OMTF" transform="translate(40 22)" x="512.5" y="240.0">
      <tspan alignment-baseline="middle" dominant-baseline="middle" text-anchor="middle">OMTF</tspan>
    </text>
    <g for="OMTF" transform="translate(57.5 -22.5)">
      <svg x="512.5" y="240.0">
        <defs/>
      </svg>
    </g>
    <rect height="40" id="EMTF" rx="5" ry="5" style="fill:rgb(255,255,255);stroke-width:1;stroke:rgb(0,0,0)" width="80" x="644.5" y="240.0"/>
    <text for="EMTF" transform="translate(40 22)" x="644.5" y="240.0">
      <tspan alignment-baseline="middle" dominant-baseline="middle" text-anchor="middle">EMTF</tspan>
    </text>
    <g for="EMTF" transform="translate(57.5 -22.5)">
      <svg x="644.5" y="240.0">
        <defs/>
      </svg>
    </g>
    <rect height="40" id="TWINMUX" rx="5" ry="5" style="fill:rgb(255,255,255);stroke-width:1;stroke:rgb(0,0,0)" width="112.0" x="430.5" y="325.0"/>
    <text for="TWINMUX" transform="translate(56.0 22)" x="430.5" y="325.0">
      <tspan alignment-baseline="middle" dominant-baseline="middle" text-anchor="middle">TWINMUX</tspan>
    </text>
    <g for="TWINMUX" transform="translate(89.5 -22.5)">
      <svg x="430.5" y="325.0">
        <defs/>
      </svg>
    </g>
    <rect height="40" id="CPPF" rx="5" ry="5" style="fill:rgb(255,255,255);stroke-width:1;stroke:rgb(0,0,0)" width="80" x="591.7" y="325.0"/>
    <text for="CPPF" transform="translate(40 22)" x="591.7" y="325.0">
      <tspan alignment-baseline="middle" dominant-baseline="middle" text-anchor="middle">CPPF</tspan>
    </text>
    <g for="CPPF" transform="translate(57.5 -22.5)">
      <svg x="591.7" y="325.0">
        <defs/>
      </svg>
    </g>
    <rect height="40" id="ECAL" rx="5" ry="5" style="fill:rgb(255,255,255);stroke-width:1;stroke:rgb(0,0,0)" width="80" x="182.5" y="431.25"/>
    <text for="ECAL" transform="translate(40 22)" x="182.5" y="431.25">
      <tspan alignment-baseline="middle" dominant-baseline="middle" text-anchor="middle">ECAL</tspan>
    </text>
    <g for="ECAL" transform="translate(57.5 -22.5)">
      <svg x="182.5" y="431.25">
        <defs/>
      </svg>
    </g>
    <rect height="40" id="HCAL" rx="5" ry="5" style="fill:rgb(255,255,255);stroke-width:1;stroke:rgb(0,0,0)" width="80" x="292.5" y="431.25"/>
    <text for="HCAL" transform="translate(40 22)" x="292.5" y="431.25">
      <tspan alignment-baseline="middle" dominant-baseline="middle" text-anchor="middle">HCAL</tspan>
    </text>
    <g for="HCAL" transform="translate(57.5 -22.5)">
      <svg x="292.5" y="431.25">
        <defs/>
      </svg>
    </g>
    <rect height="40" id="DT" rx="5" ry="5" style="fill:rgb(255,255,255);stroke-width:1;stroke:rgb(0,0,0)" width="80" x="402.5" y="431.25"/>
    <text for="DT" transform="translate(40 22)" x="402.5" y="431.25">
      <tspan alignment-baseline="middle" dominant-baseline="middle" text-anchor="middle">DT</tspan>
    </text>
    <g for="DT" transform="translate(57.5 -22.5)">
      <svg x="402.5" y="431.25">
        <defs/>
      </svg>
    </g>
    <rect height="40" id="RPC" rx="5" ry="5" style="fill:rgb(255,255,255);stroke-width:1;stroke:rgb(0,0,0)" width="80" x="512.5" y="431.25"/>
    <text for="RPC" transform="translate(40 22)" x="512.5" y="431.25">
      <tspan alignment-baseline="middle" dominant-baseline="middle" text-anchor="middle">RPC</tspan>
    </text>
    <g for="RPC" transform="translate(57.5 -22.5)">
      <svg x="512.5" y="431.25">
        <defs/>
      </svg>
    </g>
    <rect height="40" id="CSC" rx="5" ry="5" style="fill:rgb(255,255,255);stroke-width:1;stroke:rgb(0,0,0)" width="80" x="622.5" y="431.25"/>
    <text for="CSC" transform="translate(40 22)" x="622.5" y="431.25">
      <tspan alignment-baseline="middle" dominant-baseline="middle" text-anchor="middle">CSC</tspan>
    </text>
    <g for="CSC" transform="translate(57.5 -22.5)">
      <svg x="622.5" y="431.25">
        <defs/>
      </svg>
    </g>
  </g>
</svg>
