<?xml version="1.0" standalone="no"?>
<!DOCTYPE svg PUBLIC "-//W3C//DTD SVG 20010904//EN"
 "http://www.w3.org/TR/2001/REC-SVG-20010904/DTD/svg10.dtd">
<svg version="1.0" xmlns="http://www.w3.org/2000/svg"
 width="600.000000pt" height="600.000000pt" viewBox="0 0 600.000000 600.000000"
 preserveAspectRatio="xMidYMid meet">
<metadata>
Created by potrace 1.11, written by Peter Selinger 2001-2013
</metadata>
<g transform="translate(0.000000,600.000000) scale(0.100000,-0.100000)"
fill="#000000" stroke="none">
<path d="M0 3000 l0 -3000 894 0 894 0 69 72 c37 40 108 115 158 168 49 52
132 140 185 195 52 56 122 130 155 165 122 130 411 437 494 525 47 50 145 153
216 230 72 77 164 176 206 220 202 214 279 298 275 302 -2 2 -24 -10 -49 -27
-78 -52 -256 -136 -367 -173 -376 -125 -806 -127 -1178 -6 -419 136 -776 408
-1006 768 -26 40 -49 71 -51 69 -4 -4 34 -144 74 -273 68 -218 281 -942 281
-955 0 -11 -70 -14 -85 -2 -6 4 -18 32 -27 62 -8 30 -93 325 -188 655 -274
955 -317 1144 -327 1425 -11 301 40 558 168 843 249 558 766 979 1344 1096
211 43 257 44 2050 37 941 -4 1734 -9 1763 -12 l52 -6 0 311 0 311 -3000 0
-3000 0 0 -3000z m2029 -1444 c47 -14 95 -35 110 -48 103 -94 332 -234 499
-304 48 -21 91 -41 96 -46 15 -12 -53 -78 -73 -71 -66 22 -297 145 -396 211
-140 93 -360 282 -328 282 5 0 46 -11 92 -24z"/>
<path d="M3115 5312 l-30 -7 45 -15 c158 -50 346 -140 490 -234 99 -65 225
-165 217 -172 -2 -3 -42 4 -88 14 -72 16 -95 27 -163 75 -223 162 -543 283
-838 317 -130 15 -407 8 -523 -13 -584 -109 -1058 -463 -1314 -982 -130 -264
-191 -520 -191 -805 0 -521 233 -1034 620 -1365 243 -208 538 -353 845 -416
154 -31 457 -38 610 -14 390 61 723 226 998 494 325 316 509 709 548 1167 20
224 -14 478 -93 703 -36 103 -143 325 -192 399 -20 30 -36 56 -36 58 0 11 31
1 89 -29 60 -31 68 -39 109 -112 119 -213 221 -517 312 -935 17 -80 65 -296
105 -480 41 -184 97 -438 124 -565 28 -126 53 -239 56 -250 3 -11 20 -92 39
-180 20 -88 44 -198 55 -245 19 -84 146 -648 195 -870 14 -63 63 -280 108
-482 l82 -368 353 0 353 0 0 2649 0 2648 -1377 7 c-758 4 -1400 8 -1428 11
-27 2 -63 0 -80 -3z m2410 -434 c-3 -29 -21 -217 -41 -418 -55 -581 -61 -636
-99 -995 -89 -843 -157 -1144 -331 -1475 -75 -141 -79 -145 -93 -81 -15 71
-17 62 38 175 178 366 226 770 140 1189 -82 399 -288 768 -565 1011 -153 135
-243 195 -409 277 -293 143 -626 207 -942 181 -262 -23 -435 -71 -668 -187
-171 -85 -308 -183 -457 -324 l-97 -92 -36 26 -35 27 31 37 c86 100 263 245
412 338 197 121 410 202 662 250 115 22 513 25 620 5 366 -69 627 -184 890
-392 371 -294 610 -702 695 -1185 12 -70 19 -93 24 -75 3 14 42 401 86 860 44
459 82 850 85 868 6 31 8 32 51 32 l45 0 -6 -52z m-3890 -963 c33 -9 72 -20
88 -27 29 -11 29 -14 5 -77 l-9 -24 -27 26 c-47 45 -118 70 -202 71 -66 1 -84
-3 -142 -32 -73 -36 -114 -79 -151 -159 -19 -41 -22 -65 -22 -158 0 -99 3
-115 28 -167 53 -107 146 -169 270 -176 93 -6 155 10 211 53 68 52 68 52 61 8
-8 -47 -29 -66 -102 -93 -80 -30 -201 -37 -280 -16 -166 42 -266 143 -300 301
-17 80 -12 140 18 232 35 106 145 206 261 237 71 19 220 20 293 1z m1628 -8
c12 -12 130 -134 262 -271 132 -137 246 -255 253 -262 33 -34 35 -17 28 266
l-7 280 47 0 47 0 -7 -77 c-3 -42 -6 -219 -6 -395 0 -258 -3 -318 -13 -318 -8
0 -45 35 -83 77 -93 104 -476 507 -484 511 -20 8 -22 -283 -4 -505 l5 -63 -45
0 -45 0 4 388 c1 213 3 388 4 390 4 9 25 -1 44 -21z m-913 -25 l0 -34 -173 7
-174 8 -6 -131 c-4 -72 -5 -137 -2 -144 5 -12 32 -14 145 -10 l140 5 0 -37 0
-36 -139 0 -138 0 -7 -46 c-8 -60 -8 -148 1 -209 l6 -47 106 6 c58 3 138 7
176 8 l70 2 3 -37 3 -37 -235 0 c-147 0 -236 4 -238 10 -1 5 -2 178 0 383 l2
372 230 0 230 0 0 -33z m572 10 c28 -14 56 -38 69 -59 29 -47 30 -125 3 -178
-24 -46 -99 -101 -160 -116 -24 -6 -44 -14 -44 -17 0 -9 49 -71 177 -224 l124
-148 -65 0 -65 0 -38 56 c-97 142 -228 306 -251 315 -51 20 -53 13 -52 -173 0
-95 1 -179 0 -185 0 -9 -17 -13 -52 -13 l-53 0 0 383 0 384 180 -1 c167 -1
183 -3 227 -24z m-1378 -1061 c4 -5 11 -56 16 -113 23 -224 90 -461 189 -659
32 -66 54 -119 49 -119 -22 0 -131 65 -145 87 -31 46 -93 205 -127 320 -40
139 -64 272 -73 401 l-6 92 46 0 c25 0 48 -4 51 -9z"/>
<path d="M2627 3863 c-3 -5 -6 -72 -6 -150 -2 -141 -2 -142 21 -148 36 -9 151
11 195 34 102 51 97 213 -7 255 -42 16 -195 23 -203 9z"/>
<path d="M4427 3308 c-25 -414 -211 -820 -556 -1214 -20 -22 -63 -72 -96 -110
-61 -70 -78 -88 -365 -394 -153 -164 -203 -216 -420 -446 -154 -162 -362 -383
-719 -764 l-353 -375 1633 -3 c898 -1 1634 0 1636 2 3 2 -7 60 -22 128 -43
200 -149 683 -250 1138 -52 234 -108 490 -125 570 -17 80 -83 379 -146 665
-63 286 -126 572 -140 635 -37 173 -57 254 -64 263 -4 4 -10 -38 -13 -95z
m321 -1690 c10 -53 10 -53 -28 -94 -248 -270 -643 -477 -1045 -550 -135 -24
-404 -29 -548 -10 -158 21 -162 24 -111 74 l40 40 49 -10 c74 -16 435 -16 525
0 278 50 526 146 735 284 94 63 251 195 311 262 27 30 52 55 55 55 4 1 11 -23
17 -51z"/>
</g>
</svg>
