Change Component Footprint: Designator=J3 Old Footprint=FCI_D37S24A4GV00LF New Footprint=3M_N3433-6302RB
Change Component Comment : Designator=J3 Old Comment=D-Sub 37F New Comment=Header 50
Change Component Designator: OldDesignator=J2 NewDesignator=J1
Change component parameters: Designator = "J3"; Footprint = "3M_N3433-6302RB"; UniqueID = "\WSDSCKFZ"
Change component parameters. Clean all parameters for all variants
Change component parameters (AddParameter): Name = "Author"; Value = "CERN DEM BC"; VariantName = "[No Variations]"
Change component parameters (AddParameter): Name = "ComponentHeight"; Value = "27.2mm"; VariantName = "[No Variations]"
Change component parameters (AddParameter): Name = "Component Type"; Value = "Standard"; VariantName = "[No Variations]"
Change component parameters (AddParameter): Name = "CreateDate"; Value = "24/09/2019"; VariantName = "[No Variations]"
Change component parameters (AddParameter): Name = "Family"; Value = "Header 50"; VariantName = "[No Variations]"
Change component parameters (AddParameter): Name = "HelpURL"; Value = "\\cern.ch\dfs\Applications\Altium\Datasheets\3M_N3433-6302RB.pdf"; VariantName = "[No Variations]"
Change component parameters (AddParameter): Name = "LatestRevisionDate"; Value = "24/09/2019"; VariantName = "[No Variations]"
Change component parameters (AddParameter): Name = "Manufacturer"; Value = "3M"; VariantName = "[No Variations]"
Change component parameters (AddParameter): Name = "Manufacturer Part Number"; Value = "N3433-6302RB"; VariantName = "[No Variations]"
Change component parameters (AddParameter): Name = "Mounted"; Value = "Yes"; VariantName = "[No Variations]"
Change component parameters (AddParameter): Name = "Part Description"; Value = "50 Contacts - Straight .100'' x .100'' Low Profile Black Four-Wall Header (Long Roll Pin Latch/Ejectors), 3000 Series"; VariantName = "[No Variations]"
Change component parameters (AddParameter): Name = "Part Number"; Value = "3M_N3433-6302RB"; VariantName = "[No Variations]"
Change component parameters (AddParameter): Name = "Pin Count"; Value = "50"; VariantName = "[No Variations]"
Change component parameters (AddParameter): Name = "PressFit"; Value = "No"; VariantName = "[No Variations]"
Change component parameters (AddParameter): Name = "Sense"; Value = "No"; VariantName = "[No Variations]"
Change component parameters (AddParameter): Name = "SMD"; Value = "No"; VariantName = "[No Variations]"
Change component parameters (AddParameter): Name = "Socket"; Value = "No"; VariantName = "[No Variations]"
Change component parameters (AddParameter): Name = "Status"; Value = "None"; VariantName = "[No Variations]"
Added Component: Designator=J2(3M_N3433-6302RB)
Add component. Clean all parameters for all variants
Add component (AddParameter): Name = "Author"; Value = "CERN DEM BC"; VariantName = "[No Variations]"
Add component (AddParameter): Name = "ComponentHeight"; Value = "27.2mm"; VariantName = "[No Variations]"
Add component (AddParameter): Name = "Component Type"; Value = "Standard"; VariantName = "[No Variations]"
Add component (AddParameter): Name = "CreateDate"; Value = "24/09/2019"; VariantName = "[No Variations]"
Add component (AddParameter): Name = "Family"; Value = "Header 50"; VariantName = "[No Variations]"
Add component (AddParameter): Name = "HelpURL"; Value = "\\cern.ch\dfs\Applications\Altium\Datasheets\3M_N3433-6302RB.pdf"; VariantName = "[No Variations]"
Add component (AddParameter): Name = "LatestRevisionDate"; Value = "24/09/2019"; VariantName = "[No Variations]"
Add component (AddParameter): Name = "Manufacturer"; Value = "3M"; VariantName = "[No Variations]"
Add component (AddParameter): Name = "Manufacturer Part Number"; Value = "N3433-6302RB"; VariantName = "[No Variations]"
Add component (AddParameter): Name = "Mounted"; Value = "Yes"; VariantName = "[No Variations]"
Add component (AddParameter): Name = "Part Description"; Value = "50 Contacts - Straight .100'' x .100'' Low Profile Black Four-Wall Header (Long Roll Pin Latch/Ejectors), 3000 Series"; VariantName = "[No Variations]"
Add component (AddParameter): Name = "Part Number"; Value = "3M_N3433-6302RB"; VariantName = "[No Variations]"
Add component (AddParameter): Name = "Pin Count"; Value = "50"; VariantName = "[No Variations]"
Add component (AddParameter): Name = "PressFit"; Value = "No"; VariantName = "[No Variations]"
Add component (AddParameter): Name = "Sense"; Value = "No"; VariantName = "[No Variations]"
Add component (AddParameter): Name = "SMD"; Value = "No"; VariantName = "[No Variations]"
Add component (AddParameter): Name = "Socket"; Value = "No"; VariantName = "[No Variations]"
Add component (AddParameter): Name = "Status"; Value = "None"; VariantName = "[No Variations]"
Added Component: Designator=J4(PHOENIX_1843363)
Add component. Clean all parameters for all variants
Added Component: Designator=J100(3M_N3433-6302RB)
Add component. Clean all parameters for all variants
Add component (AddParameter): Name = "Author"; Value = "CERN DEM BC"; VariantName = "[No Variations]"
Add component (AddParameter): Name = "ComponentHeight"; Value = "27.2mm"; VariantName = "[No Variations]"
Add component (AddParameter): Name = "Component Type"; Value = "Standard"; VariantName = "[No Variations]"
Add component (AddParameter): Name = "CreateDate"; Value = "24/09/2019"; VariantName = "[No Variations]"
Add component (AddParameter): Name = "Family"; Value = "Header 50"; VariantName = "[No Variations]"
Add component (AddParameter): Name = "HelpURL"; Value = "\\cern.ch\dfs\Applications\Altium\Datasheets\3M_N3433-6302RB.pdf"; VariantName = "[No Variations]"
Add component (AddParameter): Name = "LatestRevisionDate"; Value = "24/09/2019"; VariantName = "[No Variations]"
Add component (AddParameter): Name = "Manufacturer"; Value = "3M"; VariantName = "[No Variations]"
Add component (AddParameter): Name = "Manufacturer Part Number"; Value = "N3433-6302RB"; VariantName = "[No Variations]"
Add component (AddParameter): Name = "Mounted"; Value = "Yes"; VariantName = "[No Variations]"
Add component (AddParameter): Name = "Part Description"; Value = "50 Contacts - Straight .100'' x .100'' Low Profile Black Four-Wall Header (Long Roll Pin Latch/Ejectors), 3000 Series"; VariantName = "[No Variations]"
Add component (AddParameter): Name = "Part Number"; Value = "3M_N3433-6302RB"; VariantName = "[No Variations]"
Add component (AddParameter): Name = "Pin Count"; Value = "50"; VariantName = "[No Variations]"
Add component (AddParameter): Name = "PressFit"; Value = "No"; VariantName = "[No Variations]"
Add component (AddParameter): Name = "Sense"; Value = "No"; VariantName = "[No Variations]"
Add component (AddParameter): Name = "SMD"; Value = "No"; VariantName = "[No Variations]"
Add component (AddParameter): Name = "Socket"; Value = "No"; VariantName = "[No Variations]"
Add component (AddParameter): Name = "Status"; Value = "None"; VariantName = "[No Variations]"
Added Component: Designator=SW0+(JUMPER_BLACK_INSULATED_2.54MM)
Add component. Clean all parameters for all variants
Add component (AddParameter): Name = "Author"; Value = "CERN DEM JLC"; VariantName = "[No Variations]"
Add component (AddParameter): Name = "ClassName"; Value = "Overlapping"; VariantName = "[No Variations]"
Add component (AddParameter): Name = "ComponentHeight"; Value = "6.5mm"; VariantName = "[No Variations]"
Add component (AddParameter): Name = "Component Type"; Value = "Standard"; VariantName = "[No Variations]"
Add component (AddParameter): Name = "CreateDate"; Value = "09/04/2008"; VariantName = "[No Variations]"
Add component (AddParameter): Name = "Family"; Value = "Jumper"; VariantName = "[No Variations]"
Add component (AddParameter): Name = "HelpURL"; Value = "\\cern.ch\dfs\Applications\Altium\Datasheets\COMATEL_313.1730.0.00.40.0.pdf"; VariantName = "[No Variations]"
Add component (AddParameter): Name = "LatestRevisionDate"; Value = "30/06/2010"; VariantName = "[No Variations]"
Add component (AddParameter): Name = "Manufacturer"; Value = "KONTEK COMATEL"; VariantName = "[No Variations]"
Add component (AddParameter): Name = "Manufacturer Part Number"; Value = "313.1730.0.00.40.0"; VariantName = "[No Variations]"
Add component (AddParameter): Name = "Mounted"; Value = "Yes"; VariantName = "[No Variations]"
Add component (AddParameter): Name = "Part Description"; Value = "Closed Insulated Black Jumper Pitch 2.54mm"; VariantName = "[No Variations]"
Add component (AddParameter): Name = "Part Number"; Value = "COMATEL_313.1730.0.00.40.0"; VariantName = "[No Variations]"
Add component (AddParameter): Name = "Pin Count"; Value = "1"; VariantName = "[No Variations]"
Add component (AddParameter): Name = "SCEM"; Value = "09.55.10.960.9"; VariantName = "[No Variations]"
Add component (AddParameter): Name = "SMD"; Value = "No"; VariantName = "[No Variations]"
Add component (AddParameter): Name = "Socket"; Value = "No"; VariantName = "[No Variations]"
Add component (AddParameter): Name = "Status"; Value = "None"; VariantName = "[No Variations]"
Add component (AddParameter): Name = "Table"; Value = "STELVIO-KONTEK COMATEL"; VariantName = "[No Variations]"
Added Component: Designator=SW0-(JUMPER_BLACK_INSULATED_2.54MM)
Add component. Clean all parameters for all variants
Add component (AddParameter): Name = "Author"; Value = "CERN DEM JLC"; VariantName = "[No Variations]"
Add component (AddParameter): Name = "ClassName"; Value = "Overlapping"; VariantName = "[No Variations]"
Add component (AddParameter): Name = "ComponentHeight"; Value = "6.5mm"; VariantName = "[No Variations]"
Add component (AddParameter): Name = "Component Type"; Value = "Standard"; VariantName = "[No Variations]"
Add component (AddParameter): Name = "CreateDate"; Value = "09/04/2008"; VariantName = "[No Variations]"
Add component (AddParameter): Name = "Family"; Value = "Jumper"; VariantName = "[No Variations]"
Add component (AddParameter): Name = "HelpURL"; Value = "\\cern.ch\dfs\Applications\Altium\Datasheets\COMATEL_313.1730.0.00.40.0.pdf"; VariantName = "[No Variations]"
Add component (AddParameter): Name = "LatestRevisionDate"; Value = "30/06/2010"; VariantName = "[No Variations]"
Add component (AddParameter): Name = "Manufacturer"; Value = "KONTEK COMATEL"; VariantName = "[No Variations]"
Add component (AddParameter): Name = "Manufacturer Part Number"; Value = "313.1730.0.00.40.0"; VariantName = "[No Variations]"
Add component (AddParameter): Name = "Mounted"; Value = "Yes"; VariantName = "[No Variations]"
Add component (AddParameter): Name = "Part Description"; Value = "Closed Insulated Black Jumper Pitch 2.54mm"; VariantName = "[No Variations]"
Add component (AddParameter): Name = "Part Number"; Value = "COMATEL_313.1730.0.00.40.0"; VariantName = "[No Variations]"
Add component (AddParameter): Name = "Pin Count"; Value = "1"; VariantName = "[No Variations]"
Add component (AddParameter): Name = "SCEM"; Value = "09.55.10.960.9"; VariantName = "[No Variations]"
Add component (AddParameter): Name = "SMD"; Value = "No"; VariantName = "[No Variations]"
Add component (AddParameter): Name = "Socket"; Value = "No"; VariantName = "[No Variations]"
Add component (AddParameter): Name = "Status"; Value = "None"; VariantName = "[No Variations]"
Add component (AddParameter): Name = "Table"; Value = "STELVIO-KONTEK COMATEL"; VariantName = "[No Variations]"
Added Component: Designator=SW1+(JUMPER_BLACK_INSULATED_2.54MM)
Add component. Clean all parameters for all variants
Add component (AddParameter): Name = "Author"; Value = "CERN DEM JLC"; VariantName = "[No Variations]"
Add component (AddParameter): Name = "ClassName"; Value = "Overlapping"; VariantName = "[No Variations]"
Add component (AddParameter): Name = "ComponentHeight"; Value = "6.5mm"; VariantName = "[No Variations]"
Add component (AddParameter): Name = "Component Type"; Value = "Standard"; VariantName = "[No Variations]"
Add component (AddParameter): Name = "CreateDate"; Value = "09/04/2008"; VariantName = "[No Variations]"
Add component (AddParameter): Name = "Family"; Value = "Jumper"; VariantName = "[No Variations]"
Add component (AddParameter): Name = "HelpURL"; Value = "\\cern.ch\dfs\Applications\Altium\Datasheets\COMATEL_313.1730.0.00.40.0.pdf"; VariantName = "[No Variations]"
Add component (AddParameter): Name = "LatestRevisionDate"; Value = "30/06/2010"; VariantName = "[No Variations]"
Add component (AddParameter): Name = "Manufacturer"; Value = "KONTEK COMATEL"; VariantName = "[No Variations]"
Add component (AddParameter): Name = "Manufacturer Part Number"; Value = "313.1730.0.00.40.0"; VariantName = "[No Variations]"
Add component (AddParameter): Name = "Mounted"; Value = "Yes"; VariantName = "[No Variations]"
Add component (AddParameter): Name = "Part Description"; Value = "Closed Insulated Black Jumper Pitch 2.54mm"; VariantName = "[No Variations]"
Add component (AddParameter): Name = "Part Number"; Value = "COMATEL_313.1730.0.00.40.0"; VariantName = "[No Variations]"
Add component (AddParameter): Name = "Pin Count"; Value = "1"; VariantName = "[No Variations]"
Add component (AddParameter): Name = "SCEM"; Value = "09.55.10.960.9"; VariantName = "[No Variations]"
Add component (AddParameter): Name = "SMD"; Value = "No"; VariantName = "[No Variations]"
Add component (AddParameter): Name = "Socket"; Value = "No"; VariantName = "[No Variations]"
Add component (AddParameter): Name = "Status"; Value = "None"; VariantName = "[No Variations]"
Add component (AddParameter): Name = "Table"; Value = "STELVIO-KONTEK COMATEL"; VariantName = "[No Variations]"
Added Component: Designator=SW1-(JUMPER_BLACK_INSULATED_2.54MM)
Add component. Clean all parameters for all variants
Add component (AddParameter): Name = "Author"; Value = "CERN DEM JLC"; VariantName = "[No Variations]"
Add component (AddParameter): Name = "ClassName"; Value = "Overlapping"; VariantName = "[No Variations]"
Add component (AddParameter): Name = "ComponentHeight"; Value = "6.5mm"; VariantName = "[No Variations]"
Add component (AddParameter): Name = "Component Type"; Value = "Standard"; VariantName = "[No Variations]"
Add component (AddParameter): Name = "CreateDate"; Value = "09/04/2008"; VariantName = "[No Variations]"
Add component (AddParameter): Name = "Family"; Value = "Jumper"; VariantName = "[No Variations]"
Add component (AddParameter): Name = "HelpURL"; Value = "\\cern.ch\dfs\Applications\Altium\Datasheets\COMATEL_313.1730.0.00.40.0.pdf"; VariantName = "[No Variations]"
Add component (AddParameter): Name = "LatestRevisionDate"; Value = "30/06/2010"; VariantName = "[No Variations]"
Add component (AddParameter): Name = "Manufacturer"; Value = "KONTEK COMATEL"; VariantName = "[No Variations]"
Add component (AddParameter): Name = "Manufacturer Part Number"; Value = "313.1730.0.00.40.0"; VariantName = "[No Variations]"
Add component (AddParameter): Name = "Mounted"; Value = "Yes"; VariantName = "[No Variations]"
Add component (AddParameter): Name = "Part Description"; Value = "Closed Insulated Black Jumper Pitch 2.54mm"; VariantName = "[No Variations]"
Add component (AddParameter): Name = "Part Number"; Value = "COMATEL_313.1730.0.00.40.0"; VariantName = "[No Variations]"
Add component (AddParameter): Name = "Pin Count"; Value = "1"; VariantName = "[No Variations]"
Add component (AddParameter): Name = "SCEM"; Value = "09.55.10.960.9"; VariantName = "[No Variations]"
Add component (AddParameter): Name = "SMD"; Value = "No"; VariantName = "[No Variations]"
Add component (AddParameter): Name = "Socket"; Value = "No"; VariantName = "[No Variations]"
Add component (AddParameter): Name = "Status"; Value = "None"; VariantName = "[No Variations]"
Add component (AddParameter): Name = "Table"; Value = "STELVIO-KONTEK COMATEL"; VariantName = "[No Variations]"
Added Component: Designator=SW2+(JUMPER_BLACK_INSULATED_2.54MM)
Add component. Clean all parameters for all variants
Add component (AddParameter): Name = "Author"; Value = "CERN DEM JLC"; VariantName = "[No Variations]"
Add component (AddParameter): Name = "ClassName"; Value = "Overlapping"; VariantName = "[No Variations]"
Add component (AddParameter): Name = "ComponentHeight"; Value = "6.5mm"; VariantName = "[No Variations]"
Add component (AddParameter): Name = "Component Type"; Value = "Standard"; VariantName = "[No Variations]"
Add component (AddParameter): Name = "CreateDate"; Value = "09/04/2008"; VariantName = "[No Variations]"
Add component (AddParameter): Name = "Family"; Value = "Jumper"; VariantName = "[No Variations]"
Add component (AddParameter): Name = "HelpURL"; Value = "\\cern.ch\dfs\Applications\Altium\Datasheets\COMATEL_313.1730.0.00.40.0.pdf"; VariantName = "[No Variations]"
Add component (AddParameter): Name = "LatestRevisionDate"; Value = "30/06/2010"; VariantName = "[No Variations]"
Add component (AddParameter): Name = "Manufacturer"; Value = "KONTEK COMATEL"; VariantName = "[No Variations]"
Add component (AddParameter): Name = "Manufacturer Part Number"; Value = "313.1730.0.00.40.0"; VariantName = "[No Variations]"
Add component (AddParameter): Name = "Mounted"; Value = "Yes"; VariantName = "[No Variations]"
Add component (AddParameter): Name = "Part Description"; Value = "Closed Insulated Black Jumper Pitch 2.54mm"; VariantName = "[No Variations]"
Add component (AddParameter): Name = "Part Number"; Value = "COMATEL_313.1730.0.00.40.0"; VariantName = "[No Variations]"
Add component (AddParameter): Name = "Pin Count"; Value = "1"; VariantName = "[No Variations]"
Add component (AddParameter): Name = "SCEM"; Value = "09.55.10.960.9"; VariantName = "[No Variations]"
Add component (AddParameter): Name = "SMD"; Value = "No"; VariantName = "[No Variations]"
Add component (AddParameter): Name = "Socket"; Value = "No"; VariantName = "[No Variations]"
Add component (AddParameter): Name = "Status"; Value = "None"; VariantName = "[No Variations]"
Add component (AddParameter): Name = "Table"; Value = "STELVIO-KONTEK COMATEL"; VariantName = "[No Variations]"
Added Component: Designator=SW2-(JUMPER_BLACK_INSULATED_2.54MM)
Add component. Clean all parameters for all variants
Add component (AddParameter): Name = "Author"; Value = "CERN DEM JLC"; VariantName = "[No Variations]"
Add component (AddParameter): Name = "ClassName"; Value = "Overlapping"; VariantName = "[No Variations]"
Add component (AddParameter): Name = "ComponentHeight"; Value = "6.5mm"; VariantName = "[No Variations]"
Add component (AddParameter): Name = "Component Type"; Value = "Standard"; VariantName = "[No Variations]"
Add component (AddParameter): Name = "CreateDate"; Value = "09/04/2008"; VariantName = "[No Variations]"
Add component (AddParameter): Name = "Family"; Value = "Jumper"; VariantName = "[No Variations]"
Add component (AddParameter): Name = "HelpURL"; Value = "\\cern.ch\dfs\Applications\Altium\Datasheets\COMATEL_313.1730.0.00.40.0.pdf"; VariantName = "[No Variations]"
Add component (AddParameter): Name = "LatestRevisionDate"; Value = "30/06/2010"; VariantName = "[No Variations]"
Add component (AddParameter): Name = "Manufacturer"; Value = "KONTEK COMATEL"; VariantName = "[No Variations]"
Add component (AddParameter): Name = "Manufacturer Part Number"; Value = "313.1730.0.00.40.0"; VariantName = "[No Variations]"
Add component (AddParameter): Name = "Mounted"; Value = "Yes"; VariantName = "[No Variations]"
Add component (AddParameter): Name = "Part Description"; Value = "Closed Insulated Black Jumper Pitch 2.54mm"; VariantName = "[No Variations]"
Add component (AddParameter): Name = "Part Number"; Value = "COMATEL_313.1730.0.00.40.0"; VariantName = "[No Variations]"
Add component (AddParameter): Name = "Pin Count"; Value = "1"; VariantName = "[No Variations]"
Add component (AddParameter): Name = "SCEM"; Value = "09.55.10.960.9"; VariantName = "[No Variations]"
Add component (AddParameter): Name = "SMD"; Value = "No"; VariantName = "[No Variations]"
Add component (AddParameter): Name = "Socket"; Value = "No"; VariantName = "[No Variations]"
Add component (AddParameter): Name = "Status"; Value = "None"; VariantName = "[No Variations]"
Add component (AddParameter): Name = "Table"; Value = "STELVIO-KONTEK COMATEL"; VariantName = "[No Variations]"
Added Component: Designator=SW3+(JUMPER_BLACK_INSULATED_2.54MM)
Add component. Clean all parameters for all variants
Add component (AddParameter): Name = "Author"; Value = "CERN DEM JLC"; VariantName = "[No Variations]"
Add component (AddParameter): Name = "ClassName"; Value = "Overlapping"; VariantName = "[No Variations]"
Add component (AddParameter): Name = "ComponentHeight"; Value = "6.5mm"; VariantName = "[No Variations]"
Add component (AddParameter): Name = "Component Type"; Value = "Standard"; VariantName = "[No Variations]"
Add component (AddParameter): Name = "CreateDate"; Value = "09/04/2008"; VariantName = "[No Variations]"
Add component (AddParameter): Name = "Family"; Value = "Jumper"; VariantName = "[No Variations]"
Add component (AddParameter): Name = "HelpURL"; Value = "\\cern.ch\dfs\Applications\Altium\Datasheets\COMATEL_313.1730.0.00.40.0.pdf"; VariantName = "[No Variations]"
Add component (AddParameter): Name = "LatestRevisionDate"; Value = "30/06/2010"; VariantName = "[No Variations]"
Add component (AddParameter): Name = "Manufacturer"; Value = "KONTEK COMATEL"; VariantName = "[No Variations]"
Add component (AddParameter): Name = "Manufacturer Part Number"; Value = "313.1730.0.00.40.0"; VariantName = "[No Variations]"
Add component (AddParameter): Name = "Mounted"; Value = "Yes"; VariantName = "[No Variations]"
Add component (AddParameter): Name = "Part Description"; Value = "Closed Insulated Black Jumper Pitch 2.54mm"; VariantName = "[No Variations]"
Add component (AddParameter): Name = "Part Number"; Value = "COMATEL_313.1730.0.00.40.0"; VariantName = "[No Variations]"
Add component (AddParameter): Name = "Pin Count"; Value = "1"; VariantName = "[No Variations]"
Add component (AddParameter): Name = "SCEM"; Value = "09.55.10.960.9"; VariantName = "[No Variations]"
Add component (AddParameter): Name = "SMD"; Value = "No"; VariantName = "[No Variations]"
Add component (AddParameter): Name = "Socket"; Value = "No"; VariantName = "[No Variations]"
Add component (AddParameter): Name = "Status"; Value = "None"; VariantName = "[No Variations]"
Add component (AddParameter): Name = "Table"; Value = "STELVIO-KONTEK COMATEL"; VariantName = "[No Variations]"
Added Component: Designator=SW3-(JUMPER_BLACK_INSULATED_2.54MM)
Add component. Clean all parameters for all variants
Add component (AddParameter): Name = "Author"; Value = "CERN DEM JLC"; VariantName = "[No Variations]"
Add component (AddParameter): Name = "ClassName"; Value = "Overlapping"; VariantName = "[No Variations]"
Add component (AddParameter): Name = "ComponentHeight"; Value = "6.5mm"; VariantName = "[No Variations]"
Add component (AddParameter): Name = "Component Type"; Value = "Standard"; VariantName = "[No Variations]"
Add component (AddParameter): Name = "CreateDate"; Value = "09/04/2008"; VariantName = "[No Variations]"
Add component (AddParameter): Name = "Family"; Value = "Jumper"; VariantName = "[No Variations]"
Add component (AddParameter): Name = "HelpURL"; Value = "\\cern.ch\dfs\Applications\Altium\Datasheets\COMATEL_313.1730.0.00.40.0.pdf"; VariantName = "[No Variations]"
Add component (AddParameter): Name = "LatestRevisionDate"; Value = "30/06/2010"; VariantName = "[No Variations]"
Add component (AddParameter): Name = "Manufacturer"; Value = "KONTEK COMATEL"; VariantName = "[No Variations]"
Add component (AddParameter): Name = "Manufacturer Part Number"; Value = "313.1730.0.00.40.0"; VariantName = "[No Variations]"
Add component (AddParameter): Name = "Mounted"; Value = "Yes"; VariantName = "[No Variations]"
Add component (AddParameter): Name = "Part Description"; Value = "Closed Insulated Black Jumper Pitch 2.54mm"; VariantName = "[No Variations]"
Add component (AddParameter): Name = "Part Number"; Value = "COMATEL_313.1730.0.00.40.0"; VariantName = "[No Variations]"
Add component (AddParameter): Name = "Pin Count"; Value = "1"; VariantName = "[No Variations]"
Add component (AddParameter): Name = "SCEM"; Value = "09.55.10.960.9"; VariantName = "[No Variations]"
Add component (AddParameter): Name = "SMD"; Value = "No"; VariantName = "[No Variations]"
Add component (AddParameter): Name = "Socket"; Value = "No"; VariantName = "[No Variations]"
Add component (AddParameter): Name = "Status"; Value = "None"; VariantName = "[No Variations]"
Add component (AddParameter): Name = "Table"; Value = "STELVIO-KONTEK COMATEL"; VariantName = "[No Variations]"
Added Component: Designator=SW4+(JUMPER_BLACK_INSULATED_2.54MM)
Add component. Clean all parameters for all variants
Add component (AddParameter): Name = "Author"; Value = "CERN DEM JLC"; VariantName = "[No Variations]"
Add component (AddParameter): Name = "ClassName"; Value = "Overlapping"; VariantName = "[No Variations]"
Add component (AddParameter): Name = "ComponentHeight"; Value = "6.5mm"; VariantName = "[No Variations]"
Add component (AddParameter): Name = "Component Type"; Value = "Standard"; VariantName = "[No Variations]"
Add component (AddParameter): Name = "CreateDate"; Value = "09/04/2008"; VariantName = "[No Variations]"
Add component (AddParameter): Name = "Family"; Value = "Jumper"; VariantName = "[No Variations]"
Add component (AddParameter): Name = "HelpURL"; Value = "\\cern.ch\dfs\Applications\Altium\Datasheets\COMATEL_313.1730.0.00.40.0.pdf"; VariantName = "[No Variations]"
Add component (AddParameter): Name = "LatestRevisionDate"; Value = "30/06/2010"; VariantName = "[No Variations]"
Add component (AddParameter): Name = "Manufacturer"; Value = "KONTEK COMATEL"; VariantName = "[No Variations]"
Add component (AddParameter): Name = "Manufacturer Part Number"; Value = "313.1730.0.00.40.0"; VariantName = "[No Variations]"
Add component (AddParameter): Name = "Mounted"; Value = "Yes"; VariantName = "[No Variations]"
Add component (AddParameter): Name = "Part Description"; Value = "Closed Insulated Black Jumper Pitch 2.54mm"; VariantName = "[No Variations]"
Add component (AddParameter): Name = "Part Number"; Value = "COMATEL_313.1730.0.00.40.0"; VariantName = "[No Variations]"
Add component (AddParameter): Name = "Pin Count"; Value = "1"; VariantName = "[No Variations]"
Add component (AddParameter): Name = "SCEM"; Value = "09.55.10.960.9"; VariantName = "[No Variations]"
Add component (AddParameter): Name = "SMD"; Value = "No"; VariantName = "[No Variations]"
Add component (AddParameter): Name = "Socket"; Value = "No"; VariantName = "[No Variations]"
Add component (AddParameter): Name = "Status"; Value = "None"; VariantName = "[No Variations]"
Add component (AddParameter): Name = "Table"; Value = "STELVIO-KONTEK COMATEL"; VariantName = "[No Variations]"
Added Component: Designator=SW4-(JUMPER_BLACK_INSULATED_2.54MM)
Add component. Clean all parameters for all variants
Add component (AddParameter): Name = "Author"; Value = "CERN DEM JLC"; VariantName = "[No Variations]"
Add component (AddParameter): Name = "ClassName"; Value = "Overlapping"; VariantName = "[No Variations]"
Add component (AddParameter): Name = "ComponentHeight"; Value = "6.5mm"; VariantName = "[No Variations]"
Add component (AddParameter): Name = "Component Type"; Value = "Standard"; VariantName = "[No Variations]"
Add component (AddParameter): Name = "CreateDate"; Value = "09/04/2008"; VariantName = "[No Variations]"
Add component (AddParameter): Name = "Family"; Value = "Jumper"; VariantName = "[No Variations]"
Add component (AddParameter): Name = "HelpURL"; Value = "\\cern.ch\dfs\Applications\Altium\Datasheets\COMATEL_313.1730.0.00.40.0.pdf"; VariantName = "[No Variations]"
Add component (AddParameter): Name = "LatestRevisionDate"; Value = "30/06/2010"; VariantName = "[No Variations]"
Add component (AddParameter): Name = "Manufacturer"; Value = "KONTEK COMATEL"; VariantName = "[No Variations]"
Add component (AddParameter): Name = "Manufacturer Part Number"; Value = "313.1730.0.00.40.0"; VariantName = "[No Variations]"
Add component (AddParameter): Name = "Mounted"; Value = "Yes"; VariantName = "[No Variations]"
Add component (AddParameter): Name = "Part Description"; Value = "Closed Insulated Black Jumper Pitch 2.54mm"; VariantName = "[No Variations]"
Add component (AddParameter): Name = "Part Number"; Value = "COMATEL_313.1730.0.00.40.0"; VariantName = "[No Variations]"
Add component (AddParameter): Name = "Pin Count"; Value = "1"; VariantName = "[No Variations]"
Add component (AddParameter): Name = "SCEM"; Value = "09.55.10.960.9"; VariantName = "[No Variations]"
Add component (AddParameter): Name = "SMD"; Value = "No"; VariantName = "[No Variations]"
Add component (AddParameter): Name = "Socket"; Value = "No"; VariantName = "[No Variations]"
Add component (AddParameter): Name = "Status"; Value = "None"; VariantName = "[No Variations]"
Add component (AddParameter): Name = "Table"; Value = "STELVIO-KONTEK COMATEL"; VariantName = "[No Variations]"
Added Component: Designator=SW5+(JUMPER_BLACK_INSULATED_2.54MM)
Add component. Clean all parameters for all variants
Add component (AddParameter): Name = "Author"; Value = "CERN DEM JLC"; VariantName = "[No Variations]"
Add component (AddParameter): Name = "ClassName"; Value = "Overlapping"; VariantName = "[No Variations]"
Add component (AddParameter): Name = "ComponentHeight"; Value = "6.5mm"; VariantName = "[No Variations]"
Add component (AddParameter): Name = "Component Type"; Value = "Standard"; VariantName = "[No Variations]"
Add component (AddParameter): Name = "CreateDate"; Value = "09/04/2008"; VariantName = "[No Variations]"
Add component (AddParameter): Name = "Family"; Value = "Jumper"; VariantName = "[No Variations]"
Add component (AddParameter): Name = "HelpURL"; Value = "\\cern.ch\dfs\Applications\Altium\Datasheets\COMATEL_313.1730.0.00.40.0.pdf"; VariantName = "[No Variations]"
Add component (AddParameter): Name = "LatestRevisionDate"; Value = "30/06/2010"; VariantName = "[No Variations]"
Add component (AddParameter): Name = "Manufacturer"; Value = "KONTEK COMATEL"; VariantName = "[No Variations]"
Add component (AddParameter): Name = "Manufacturer Part Number"; Value = "313.1730.0.00.40.0"; VariantName = "[No Variations]"
Add component (AddParameter): Name = "Mounted"; Value = "Yes"; VariantName = "[No Variations]"
Add component (AddParameter): Name = "Part Description"; Value = "Closed Insulated Black Jumper Pitch 2.54mm"; VariantName = "[No Variations]"
Add component (AddParameter): Name = "Part Number"; Value = "COMATEL_313.1730.0.00.40.0"; VariantName = "[No Variations]"
Add component (AddParameter): Name = "Pin Count"; Value = "1"; VariantName = "[No Variations]"
Add component (AddParameter): Name = "SCEM"; Value = "09.55.10.960.9"; VariantName = "[No Variations]"
Add component (AddParameter): Name = "SMD"; Value = "No"; VariantName = "[No Variations]"
Add component (AddParameter): Name = "Socket"; Value = "No"; VariantName = "[No Variations]"
Add component (AddParameter): Name = "Status"; Value = "None"; VariantName = "[No Variations]"
Add component (AddParameter): Name = "Table"; Value = "STELVIO-KONTEK COMATEL"; VariantName = "[No Variations]"
Added Component: Designator=SW5-(JUMPER_BLACK_INSULATED_2.54MM)
Add component. Clean all parameters for all variants
Add component (AddParameter): Name = "Author"; Value = "CERN DEM JLC"; VariantName = "[No Variations]"
Add component (AddParameter): Name = "ClassName"; Value = "Overlapping"; VariantName = "[No Variations]"
Add component (AddParameter): Name = "ComponentHeight"; Value = "6.5mm"; VariantName = "[No Variations]"
Add component (AddParameter): Name = "Component Type"; Value = "Standard"; VariantName = "[No Variations]"
Add component (AddParameter): Name = "CreateDate"; Value = "09/04/2008"; VariantName = "[No Variations]"
Add component (AddParameter): Name = "Family"; Value = "Jumper"; VariantName = "[No Variations]"
Add component (AddParameter): Name = "HelpURL"; Value = "\\cern.ch\dfs\Applications\Altium\Datasheets\COMATEL_313.1730.0.00.40.0.pdf"; VariantName = "[No Variations]"
Add component (AddParameter): Name = "LatestRevisionDate"; Value = "30/06/2010"; VariantName = "[No Variations]"
Add component (AddParameter): Name = "Manufacturer"; Value = "KONTEK COMATEL"; VariantName = "[No Variations]"
Add component (AddParameter): Name = "Manufacturer Part Number"; Value = "313.1730.0.00.40.0"; VariantName = "[No Variations]"
Add component (AddParameter): Name = "Mounted"; Value = "Yes"; VariantName = "[No Variations]"
Add component (AddParameter): Name = "Part Description"; Value = "Closed Insulated Black Jumper Pitch 2.54mm"; VariantName = "[No Variations]"
Add component (AddParameter): Name = "Part Number"; Value = "COMATEL_313.1730.0.00.40.0"; VariantName = "[No Variations]"
Add component (AddParameter): Name = "Pin Count"; Value = "1"; VariantName = "[No Variations]"
Add component (AddParameter): Name = "SCEM"; Value = "09.55.10.960.9"; VariantName = "[No Variations]"
Add component (AddParameter): Name = "SMD"; Value = "No"; VariantName = "[No Variations]"
Add component (AddParameter): Name = "Socket"; Value = "No"; VariantName = "[No Variations]"
Add component (AddParameter): Name = "Status"; Value = "None"; VariantName = "[No Variations]"
Add component (AddParameter): Name = "Table"; Value = "STELVIO-KONTEK COMATEL"; VariantName = "[No Variations]"
Added Component: Designator=SW6+(JUMPER_BLACK_INSULATED_2.54MM)
Add component. Clean all parameters for all variants
Add component (AddParameter): Name = "Author"; Value = "CERN DEM JLC"; VariantName = "[No Variations]"
Add component (AddParameter): Name = "ClassName"; Value = "Overlapping"; VariantName = "[No Variations]"
Add component (AddParameter): Name = "ComponentHeight"; Value = "6.5mm"; VariantName = "[No Variations]"
Add component (AddParameter): Name = "Component Type"; Value = "Standard"; VariantName = "[No Variations]"
Add component (AddParameter): Name = "CreateDate"; Value = "09/04/2008"; VariantName = "[No Variations]"
Add component (AddParameter): Name = "Family"; Value = "Jumper"; VariantName = "[No Variations]"
Add component (AddParameter): Name = "HelpURL"; Value = "\\cern.ch\dfs\Applications\Altium\Datasheets\COMATEL_313.1730.0.00.40.0.pdf"; VariantName = "[No Variations]"
Add component (AddParameter): Name = "LatestRevisionDate"; Value = "30/06/2010"; VariantName = "[No Variations]"
Add component (AddParameter): Name = "Manufacturer"; Value = "KONTEK COMATEL"; VariantName = "[No Variations]"
Add component (AddParameter): Name = "Manufacturer Part Number"; Value = "313.1730.0.00.40.0"; VariantName = "[No Variations]"
Add component (AddParameter): Name = "Mounted"; Value = "Yes"; VariantName = "[No Variations]"
Add component (AddParameter): Name = "Part Description"; Value = "Closed Insulated Black Jumper Pitch 2.54mm"; VariantName = "[No Variations]"
Add component (AddParameter): Name = "Part Number"; Value = "COMATEL_313.1730.0.00.40.0"; VariantName = "[No Variations]"
Add component (AddParameter): Name = "Pin Count"; Value = "1"; VariantName = "[No Variations]"
Add component (AddParameter): Name = "SCEM"; Value = "09.55.10.960.9"; VariantName = "[No Variations]"
Add component (AddParameter): Name = "SMD"; Value = "No"; VariantName = "[No Variations]"
Add component (AddParameter): Name = "Socket"; Value = "No"; VariantName = "[No Variations]"
Add component (AddParameter): Name = "Status"; Value = "None"; VariantName = "[No Variations]"
Add component (AddParameter): Name = "Table"; Value = "STELVIO-KONTEK COMATEL"; VariantName = "[No Variations]"
Added Component: Designator=SW6-(JUMPER_BLACK_INSULATED_2.54MM)
Add component. Clean all parameters for all variants
Add component (AddParameter): Name = "Author"; Value = "CERN DEM JLC"; VariantName = "[No Variations]"
Add component (AddParameter): Name = "ClassName"; Value = "Overlapping"; VariantName = "[No Variations]"
Add component (AddParameter): Name = "ComponentHeight"; Value = "6.5mm"; VariantName = "[No Variations]"
Add component (AddParameter): Name = "Component Type"; Value = "Standard"; VariantName = "[No Variations]"
Add component (AddParameter): Name = "CreateDate"; Value = "09/04/2008"; VariantName = "[No Variations]"
Add component (AddParameter): Name = "Family"; Value = "Jumper"; VariantName = "[No Variations]"
Add component (AddParameter): Name = "HelpURL"; Value = "\\cern.ch\dfs\Applications\Altium\Datasheets\COMATEL_313.1730.0.00.40.0.pdf"; VariantName = "[No Variations]"
Add component (AddParameter): Name = "LatestRevisionDate"; Value = "30/06/2010"; VariantName = "[No Variations]"
Add component (AddParameter): Name = "Manufacturer"; Value = "KONTEK COMATEL"; VariantName = "[No Variations]"
Add component (AddParameter): Name = "Manufacturer Part Number"; Value = "313.1730.0.00.40.0"; VariantName = "[No Variations]"
Add component (AddParameter): Name = "Mounted"; Value = "Yes"; VariantName = "[No Variations]"
Add component (AddParameter): Name = "Part Description"; Value = "Closed Insulated Black Jumper Pitch 2.54mm"; VariantName = "[No Variations]"
Add component (AddParameter): Name = "Part Number"; Value = "COMATEL_313.1730.0.00.40.0"; VariantName = "[No Variations]"
Add component (AddParameter): Name = "Pin Count"; Value = "1"; VariantName = "[No Variations]"
Add component (AddParameter): Name = "SCEM"; Value = "09.55.10.960.9"; VariantName = "[No Variations]"
Add component (AddParameter): Name = "SMD"; Value = "No"; VariantName = "[No Variations]"
Add component (AddParameter): Name = "Socket"; Value = "No"; VariantName = "[No Variations]"
Add component (AddParameter): Name = "Status"; Value = "None"; VariantName = "[No Variations]"
Add component (AddParameter): Name = "Table"; Value = "STELVIO-KONTEK COMATEL"; VariantName = "[No Variations]"
Added Component: Designator=SW7+(JUMPER_BLACK_INSULATED_2.54MM)
Add component. Clean all parameters for all variants
Add component (AddParameter): Name = "Author"; Value = "CERN DEM JLC"; VariantName = "[No Variations]"
Add component (AddParameter): Name = "ClassName"; Value = "Overlapping"; VariantName = "[No Variations]"
Add component (AddParameter): Name = "ComponentHeight"; Value = "6.5mm"; VariantName = "[No Variations]"
Add component (AddParameter): Name = "Component Type"; Value = "Standard"; VariantName = "[No Variations]"
Add component (AddParameter): Name = "CreateDate"; Value = "09/04/2008"; VariantName = "[No Variations]"
Add component (AddParameter): Name = "Family"; Value = "Jumper"; VariantName = "[No Variations]"
Add component (AddParameter): Name = "HelpURL"; Value = "\\cern.ch\dfs\Applications\Altium\Datasheets\COMATEL_313.1730.0.00.40.0.pdf"; VariantName = "[No Variations]"
Add component (AddParameter): Name = "LatestRevisionDate"; Value = "30/06/2010"; VariantName = "[No Variations]"
Add component (AddParameter): Name = "Manufacturer"; Value = "KONTEK COMATEL"; VariantName = "[No Variations]"
Add component (AddParameter): Name = "Manufacturer Part Number"; Value = "313.1730.0.00.40.0"; VariantName = "[No Variations]"
Add component (AddParameter): Name = "Mounted"; Value = "Yes"; VariantName = "[No Variations]"
Add component (AddParameter): Name = "Part Description"; Value = "Closed Insulated Black Jumper Pitch 2.54mm"; VariantName = "[No Variations]"
Add component (AddParameter): Name = "Part Number"; Value = "COMATEL_313.1730.0.00.40.0"; VariantName = "[No Variations]"
Add component (AddParameter): Name = "Pin Count"; Value = "1"; VariantName = "[No Variations]"
Add component (AddParameter): Name = "SCEM"; Value = "09.55.10.960.9"; VariantName = "[No Variations]"
Add component (AddParameter): Name = "SMD"; Value = "No"; VariantName = "[No Variations]"
Add component (AddParameter): Name = "Socket"; Value = "No"; VariantName = "[No Variations]"
Add component (AddParameter): Name = "Status"; Value = "None"; VariantName = "[No Variations]"
Add component (AddParameter): Name = "Table"; Value = "STELVIO-KONTEK COMATEL"; VariantName = "[No Variations]"
Added Component: Designator=SW7-(JUMPER_BLACK_INSULATED_2.54MM)
Add component. Clean all parameters for all variants
Add component (AddParameter): Name = "Author"; Value = "CERN DEM JLC"; VariantName = "[No Variations]"
Add component (AddParameter): Name = "ClassName"; Value = "Overlapping"; VariantName = "[No Variations]"
Add component (AddParameter): Name = "ComponentHeight"; Value = "6.5mm"; VariantName = "[No Variations]"
Add component (AddParameter): Name = "Component Type"; Value = "Standard"; VariantName = "[No Variations]"
Add component (AddParameter): Name = "CreateDate"; Value = "09/04/2008"; VariantName = "[No Variations]"
Add component (AddParameter): Name = "Family"; Value = "Jumper"; VariantName = "[No Variations]"
Add component (AddParameter): Name = "HelpURL"; Value = "\\cern.ch\dfs\Applications\Altium\Datasheets\COMATEL_313.1730.0.00.40.0.pdf"; VariantName = "[No Variations]"
Add component (AddParameter): Name = "LatestRevisionDate"; Value = "30/06/2010"; VariantName = "[No Variations]"
Add component (AddParameter): Name = "Manufacturer"; Value = "KONTEK COMATEL"; VariantName = "[No Variations]"
Add component (AddParameter): Name = "Manufacturer Part Number"; Value = "313.1730.0.00.40.0"; VariantName = "[No Variations]"
Add component (AddParameter): Name = "Mounted"; Value = "Yes"; VariantName = "[No Variations]"
Add component (AddParameter): Name = "Part Description"; Value = "Closed Insulated Black Jumper Pitch 2.54mm"; VariantName = "[No Variations]"
Add component (AddParameter): Name = "Part Number"; Value = "COMATEL_313.1730.0.00.40.0"; VariantName = "[No Variations]"
Add component (AddParameter): Name = "Pin Count"; Value = "1"; VariantName = "[No Variations]"
Add component (AddParameter): Name = "SCEM"; Value = "09.55.10.960.9"; VariantName = "[No Variations]"
Add component (AddParameter): Name = "SMD"; Value = "No"; VariantName = "[No Variations]"
Add component (AddParameter): Name = "Socket"; Value = "No"; VariantName = "[No Variations]"
Add component (AddParameter): Name = "Status"; Value = "None"; VariantName = "[No Variations]"
Add component (AddParameter): Name = "Table"; Value = "STELVIO-KONTEK COMATEL"; VariantName = "[No Variations]"
Added Component: Designator=W0+(SAMTEC_MTLW-102-07-L-S-250)
Add component. Clean all parameters for all variants
Add component (AddParameter): Name = "Author"; Value = "CERN DEM JLC"; VariantName = "[No Variations]"
Add component (AddParameter): Name = "ClassName"; Value = "Overlapping"; VariantName = "[No Variations]"
Add component (AddParameter): Name = "ComponentHeight"; Value = "7.87mm"; VariantName = "[No Variations]"
Add component (AddParameter): Name = "Component Type"; Value = "Standard"; VariantName = "[No Variations]"
Add component (AddParameter): Name = "CreateDate"; Value = "13/12/2012"; VariantName = "[No Variations]"
Add component (AddParameter): Name = "Family"; Value = "Header 2"; VariantName = "[No Variations]"
Add component (AddParameter): Name = "HelpURL"; Value = "\\cern.ch\dfs\Applications\Altium\Datasheets\SAMTEC_MTLW-102-07-L-S-250.pdf"; VariantName = "[No Variations]"
Add component (AddParameter): Name = "LatestRevisionDate"; Value = "13/12/2012"; VariantName = "[No Variations]"
Add component (AddParameter): Name = "Manufacturer"; Value = "SAMTEC"; VariantName = "[No Variations]"
Add component (AddParameter): Name = "Manufacturer Part Number"; Value = "MTLW-102-07-L-S-250"; VariantName = "[No Variations]"
Add component (AddParameter): Name = "Mounted"; Value = "Yes"; VariantName = "[No Variations]"
Add component (AddParameter): Name = "Part Description"; Value = "2 Contacts - Pitch 2.54mm - Single Row Through Mount Straight Header (Post Lead = 6.35mm, Tail Lead 3.05mm, Insulator 1.52mm)"; VariantName = "[No Variations]"
Add component (AddParameter): Name = "Part Number"; Value = "SAMTEC_MTLW-102-07-L-S-250"; VariantName = "[No Variations]"
Add component (AddParameter): Name = "Pin Count"; Value = "2"; VariantName = "[No Variations]"
Add component (AddParameter): Name = "SMD"; Value = "No"; VariantName = "[No Variations]"
Add component (AddParameter): Name = "Socket"; Value = "No"; VariantName = "[No Variations]"
Add component (AddParameter): Name = "Status"; Value = "None"; VariantName = "[No Variations]"
Add component (AddParameter): Name = "Table"; Value = "SAMTEC"; VariantName = "[No Variations]"
Added Component: Designator=W0-(SAMTEC_MTLW-102-07-L-S-250)
Add component. Clean all parameters for all variants
Add component (AddParameter): Name = "Author"; Value = "CERN DEM JLC"; VariantName = "[No Variations]"
Add component (AddParameter): Name = "ClassName"; Value = "Overlapping"; VariantName = "[No Variations]"
Add component (AddParameter): Name = "ComponentHeight"; Value = "7.87mm"; VariantName = "[No Variations]"
Add component (AddParameter): Name = "Component Type"; Value = "Standard"; VariantName = "[No Variations]"
Add component (AddParameter): Name = "CreateDate"; Value = "13/12/2012"; VariantName = "[No Variations]"
Add component (AddParameter): Name = "Family"; Value = "Header 2"; VariantName = "[No Variations]"
Add component (AddParameter): Name = "HelpURL"; Value = "\\cern.ch\dfs\Applications\Altium\Datasheets\SAMTEC_MTLW-102-07-L-S-250.pdf"; VariantName = "[No Variations]"
Add component (AddParameter): Name = "LatestRevisionDate"; Value = "13/12/2012"; VariantName = "[No Variations]"
Add component (AddParameter): Name = "Manufacturer"; Value = "SAMTEC"; VariantName = "[No Variations]"
Add component (AddParameter): Name = "Manufacturer Part Number"; Value = "MTLW-102-07-L-S-250"; VariantName = "[No Variations]"
Add component (AddParameter): Name = "Mounted"; Value = "Yes"; VariantName = "[No Variations]"
Add component (AddParameter): Name = "Part Description"; Value = "2 Contacts - Pitch 2.54mm - Single Row Through Mount Straight Header (Post Lead = 6.35mm, Tail Lead 3.05mm, Insulator 1.52mm)"; VariantName = "[No Variations]"
Add component (AddParameter): Name = "Part Number"; Value = "SAMTEC_MTLW-102-07-L-S-250"; VariantName = "[No Variations]"
Add component (AddParameter): Name = "Pin Count"; Value = "2"; VariantName = "[No Variations]"
Add component (AddParameter): Name = "SMD"; Value = "No"; VariantName = "[No Variations]"
Add component (AddParameter): Name = "Socket"; Value = "No"; VariantName = "[No Variations]"
Add component (AddParameter): Name = "Status"; Value = "None"; VariantName = "[No Variations]"
Add component (AddParameter): Name = "Table"; Value = "SAMTEC"; VariantName = "[No Variations]"
Added Component: Designator=W1+(SAMTEC_MTLW-102-07-L-S-250)
Add component. Clean all parameters for all variants
Add component (AddParameter): Name = "Author"; Value = "CERN DEM JLC"; VariantName = "[No Variations]"
Add component (AddParameter): Name = "ClassName"; Value = "Overlapping"; VariantName = "[No Variations]"
Add component (AddParameter): Name = "ComponentHeight"; Value = "7.87mm"; VariantName = "[No Variations]"
Add component (AddParameter): Name = "Component Type"; Value = "Standard"; VariantName = "[No Variations]"
Add component (AddParameter): Name = "CreateDate"; Value = "13/12/2012"; VariantName = "[No Variations]"
Add component (AddParameter): Name = "Family"; Value = "Header 2"; VariantName = "[No Variations]"
Add component (AddParameter): Name = "HelpURL"; Value = "\\cern.ch\dfs\Applications\Altium\Datasheets\SAMTEC_MTLW-102-07-L-S-250.pdf"; VariantName = "[No Variations]"
Add component (AddParameter): Name = "LatestRevisionDate"; Value = "13/12/2012"; VariantName = "[No Variations]"
Add component (AddParameter): Name = "Manufacturer"; Value = "SAMTEC"; VariantName = "[No Variations]"
Add component (AddParameter): Name = "Manufacturer Part Number"; Value = "MTLW-102-07-L-S-250"; VariantName = "[No Variations]"
Add component (AddParameter): Name = "Mounted"; Value = "Yes"; VariantName = "[No Variations]"
Add component (AddParameter): Name = "Part Description"; Value = "2 Contacts - Pitch 2.54mm - Single Row Through Mount Straight Header (Post Lead = 6.35mm, Tail Lead 3.05mm, Insulator 1.52mm)"; VariantName = "[No Variations]"
Add component (AddParameter): Name = "Part Number"; Value = "SAMTEC_MTLW-102-07-L-S-250"; VariantName = "[No Variations]"
Add component (AddParameter): Name = "Pin Count"; Value = "2"; VariantName = "[No Variations]"
Add component (AddParameter): Name = "SMD"; Value = "No"; VariantName = "[No Variations]"
Add component (AddParameter): Name = "Socket"; Value = "No"; VariantName = "[No Variations]"
Add component (AddParameter): Name = "Status"; Value = "None"; VariantName = "[No Variations]"
Add component (AddParameter): Name = "Table"; Value = "SAMTEC"; VariantName = "[No Variations]"
Added Component: Designator=W1-(SAMTEC_MTLW-102-07-L-S-250)
Add component. Clean all parameters for all variants
Add component (AddParameter): Name = "Author"; Value = "CERN DEM JLC"; VariantName = "[No Variations]"
Add component (AddParameter): Name = "ClassName"; Value = "Overlapping"; VariantName = "[No Variations]"
Add component (AddParameter): Name = "ComponentHeight"; Value = "7.87mm"; VariantName = "[No Variations]"
Add component (AddParameter): Name = "Component Type"; Value = "Standard"; VariantName = "[No Variations]"
Add component (AddParameter): Name = "CreateDate"; Value = "13/12/2012"; VariantName = "[No Variations]"
Add component (AddParameter): Name = "Family"; Value = "Header 2"; VariantName = "[No Variations]"
Add component (AddParameter): Name = "HelpURL"; Value = "\\cern.ch\dfs\Applications\Altium\Datasheets\SAMTEC_MTLW-102-07-L-S-250.pdf"; VariantName = "[No Variations]"
Add component (AddParameter): Name = "LatestRevisionDate"; Value = "13/12/2012"; VariantName = "[No Variations]"
Add component (AddParameter): Name = "Manufacturer"; Value = "SAMTEC"; VariantName = "[No Variations]"
Add component (AddParameter): Name = "Manufacturer Part Number"; Value = "MTLW-102-07-L-S-250"; VariantName = "[No Variations]"
Add component (AddParameter): Name = "Mounted"; Value = "Yes"; VariantName = "[No Variations]"
Add component (AddParameter): Name = "Part Description"; Value = "2 Contacts - Pitch 2.54mm - Single Row Through Mount Straight Header (Post Lead = 6.35mm, Tail Lead 3.05mm, Insulator 1.52mm)"; VariantName = "[No Variations]"
Add component (AddParameter): Name = "Part Number"; Value = "SAMTEC_MTLW-102-07-L-S-250"; VariantName = "[No Variations]"
Add component (AddParameter): Name = "Pin Count"; Value = "2"; VariantName = "[No Variations]"
Add component (AddParameter): Name = "SMD"; Value = "No"; VariantName = "[No Variations]"
Add component (AddParameter): Name = "Socket"; Value = "No"; VariantName = "[No Variations]"
Add component (AddParameter): Name = "Status"; Value = "None"; VariantName = "[No Variations]"
Add component (AddParameter): Name = "Table"; Value = "SAMTEC"; VariantName = "[No Variations]"
Added Component: Designator=W2+(SAMTEC_MTLW-102-07-L-S-250)
Add component. Clean all parameters for all variants
Add component (AddParameter): Name = "Author"; Value = "CERN DEM JLC"; VariantName = "[No Variations]"
Add component (AddParameter): Name = "ClassName"; Value = "Overlapping"; VariantName = "[No Variations]"
Add component (AddParameter): Name = "ComponentHeight"; Value = "7.87mm"; VariantName = "[No Variations]"
Add component (AddParameter): Name = "Component Type"; Value = "Standard"; VariantName = "[No Variations]"
Add component (AddParameter): Name = "CreateDate"; Value = "13/12/2012"; VariantName = "[No Variations]"
Add component (AddParameter): Name = "Family"; Value = "Header 2"; VariantName = "[No Variations]"
Add component (AddParameter): Name = "HelpURL"; Value = "\\cern.ch\dfs\Applications\Altium\Datasheets\SAMTEC_MTLW-102-07-L-S-250.pdf"; VariantName = "[No Variations]"
Add component (AddParameter): Name = "LatestRevisionDate"; Value = "13/12/2012"; VariantName = "[No Variations]"
Add component (AddParameter): Name = "Manufacturer"; Value = "SAMTEC"; VariantName = "[No Variations]"
Add component (AddParameter): Name = "Manufacturer Part Number"; Value = "MTLW-102-07-L-S-250"; VariantName = "[No Variations]"
Add component (AddParameter): Name = "Mounted"; Value = "Yes"; VariantName = "[No Variations]"
Add component (AddParameter): Name = "Part Description"; Value = "2 Contacts - Pitch 2.54mm - Single Row Through Mount Straight Header (Post Lead = 6.35mm, Tail Lead 3.05mm, Insulator 1.52mm)"; VariantName = "[No Variations]"
Add component (AddParameter): Name = "Part Number"; Value = "SAMTEC_MTLW-102-07-L-S-250"; VariantName = "[No Variations]"
Add component (AddParameter): Name = "Pin Count"; Value = "2"; VariantName = "[No Variations]"
Add component (AddParameter): Name = "SMD"; Value = "No"; VariantName = "[No Variations]"
Add component (AddParameter): Name = "Socket"; Value = "No"; VariantName = "[No Variations]"
Add component (AddParameter): Name = "Status"; Value = "None"; VariantName = "[No Variations]"
Add component (AddParameter): Name = "Table"; Value = "SAMTEC"; VariantName = "[No Variations]"
Added Component: Designator=W2-(SAMTEC_MTLW-102-07-L-S-250)
Add component. Clean all parameters for all variants
Add component (AddParameter): Name = "Author"; Value = "CERN DEM JLC"; VariantName = "[No Variations]"
Add component (AddParameter): Name = "ClassName"; Value = "Overlapping"; VariantName = "[No Variations]"
Add component (AddParameter): Name = "ComponentHeight"; Value = "7.87mm"; VariantName = "[No Variations]"
Add component (AddParameter): Name = "Component Type"; Value = "Standard"; VariantName = "[No Variations]"
Add component (AddParameter): Name = "CreateDate"; Value = "13/12/2012"; VariantName = "[No Variations]"
Add component (AddParameter): Name = "Family"; Value = "Header 2"; VariantName = "[No Variations]"
Add component (AddParameter): Name = "HelpURL"; Value = "\\cern.ch\dfs\Applications\Altium\Datasheets\SAMTEC_MTLW-102-07-L-S-250.pdf"; VariantName = "[No Variations]"
Add component (AddParameter): Name = "LatestRevisionDate"; Value = "13/12/2012"; VariantName = "[No Variations]"
Add component (AddParameter): Name = "Manufacturer"; Value = "SAMTEC"; VariantName = "[No Variations]"
Add component (AddParameter): Name = "Manufacturer Part Number"; Value = "MTLW-102-07-L-S-250"; VariantName = "[No Variations]"
Add component (AddParameter): Name = "Mounted"; Value = "Yes"; VariantName = "[No Variations]"
Add component (AddParameter): Name = "Part Description"; Value = "2 Contacts - Pitch 2.54mm - Single Row Through Mount Straight Header (Post Lead = 6.35mm, Tail Lead 3.05mm, Insulator 1.52mm)"; VariantName = "[No Variations]"
Add component (AddParameter): Name = "Part Number"; Value = "SAMTEC_MTLW-102-07-L-S-250"; VariantName = "[No Variations]"
Add component (AddParameter): Name = "Pin Count"; Value = "2"; VariantName = "[No Variations]"
Add component (AddParameter): Name = "SMD"; Value = "No"; VariantName = "[No Variations]"
Add component (AddParameter): Name = "Socket"; Value = "No"; VariantName = "[No Variations]"
Add component (AddParameter): Name = "Status"; Value = "None"; VariantName = "[No Variations]"
Add component (AddParameter): Name = "Table"; Value = "SAMTEC"; VariantName = "[No Variations]"
Added Component: Designator=W3+(SAMTEC_MTLW-102-07-L-S-250)
Add component. Clean all parameters for all variants
Add component (AddParameter): Name = "Author"; Value = "CERN DEM JLC"; VariantName = "[No Variations]"
Add component (AddParameter): Name = "ClassName"; Value = "Overlapping"; VariantName = "[No Variations]"
Add component (AddParameter): Name = "ComponentHeight"; Value = "7.87mm"; VariantName = "[No Variations]"
Add component (AddParameter): Name = "Component Type"; Value = "Standard"; VariantName = "[No Variations]"
Add component (AddParameter): Name = "CreateDate"; Value = "13/12/2012"; VariantName = "[No Variations]"
Add component (AddParameter): Name = "Family"; Value = "Header 2"; VariantName = "[No Variations]"
Add component (AddParameter): Name = "HelpURL"; Value = "\\cern.ch\dfs\Applications\Altium\Datasheets\SAMTEC_MTLW-102-07-L-S-250.pdf"; VariantName = "[No Variations]"
Add component (AddParameter): Name = "LatestRevisionDate"; Value = "13/12/2012"; VariantName = "[No Variations]"
Add component (AddParameter): Name = "Manufacturer"; Value = "SAMTEC"; VariantName = "[No Variations]"
Add component (AddParameter): Name = "Manufacturer Part Number"; Value = "MTLW-102-07-L-S-250"; VariantName = "[No Variations]"
Add component (AddParameter): Name = "Mounted"; Value = "Yes"; VariantName = "[No Variations]"
Add component (AddParameter): Name = "Part Description"; Value = "2 Contacts - Pitch 2.54mm - Single Row Through Mount Straight Header (Post Lead = 6.35mm, Tail Lead 3.05mm, Insulator 1.52mm)"; VariantName = "[No Variations]"
Add component (AddParameter): Name = "Part Number"; Value = "SAMTEC_MTLW-102-07-L-S-250"; VariantName = "[No Variations]"
Add component (AddParameter): Name = "Pin Count"; Value = "2"; VariantName = "[No Variations]"
Add component (AddParameter): Name = "SMD"; Value = "No"; VariantName = "[No Variations]"
Add component (AddParameter): Name = "Socket"; Value = "No"; VariantName = "[No Variations]"
Add component (AddParameter): Name = "Status"; Value = "None"; VariantName = "[No Variations]"
Add component (AddParameter): Name = "Table"; Value = "SAMTEC"; VariantName = "[No Variations]"
Added Component: Designator=W3-(SAMTEC_MTLW-102-07-L-S-250)
Add component. Clean all parameters for all variants
Add component (AddParameter): Name = "Author"; Value = "CERN DEM JLC"; VariantName = "[No Variations]"
Add component (AddParameter): Name = "ClassName"; Value = "Overlapping"; VariantName = "[No Variations]"
Add component (AddParameter): Name = "ComponentHeight"; Value = "7.87mm"; VariantName = "[No Variations]"
Add component (AddParameter): Name = "Component Type"; Value = "Standard"; VariantName = "[No Variations]"
Add component (AddParameter): Name = "CreateDate"; Value = "13/12/2012"; VariantName = "[No Variations]"
Add component (AddParameter): Name = "Family"; Value = "Header 2"; VariantName = "[No Variations]"
Add component (AddParameter): Name = "HelpURL"; Value = "\\cern.ch\dfs\Applications\Altium\Datasheets\SAMTEC_MTLW-102-07-L-S-250.pdf"; VariantName = "[No Variations]"
Add component (AddParameter): Name = "LatestRevisionDate"; Value = "13/12/2012"; VariantName = "[No Variations]"
Add component (AddParameter): Name = "Manufacturer"; Value = "SAMTEC"; VariantName = "[No Variations]"
Add component (AddParameter): Name = "Manufacturer Part Number"; Value = "MTLW-102-07-L-S-250"; VariantName = "[No Variations]"
Add component (AddParameter): Name = "Mounted"; Value = "Yes"; VariantName = "[No Variations]"
Add component (AddParameter): Name = "Part Description"; Value = "2 Contacts - Pitch 2.54mm - Single Row Through Mount Straight Header (Post Lead = 6.35mm, Tail Lead 3.05mm, Insulator 1.52mm)"; VariantName = "[No Variations]"
Add component (AddParameter): Name = "Part Number"; Value = "SAMTEC_MTLW-102-07-L-S-250"; VariantName = "[No Variations]"
Add component (AddParameter): Name = "Pin Count"; Value = "2"; VariantName = "[No Variations]"
Add component (AddParameter): Name = "SMD"; Value = "No"; VariantName = "[No Variations]"
Add component (AddParameter): Name = "Socket"; Value = "No"; VariantName = "[No Variations]"
Add component (AddParameter): Name = "Status"; Value = "None"; VariantName = "[No Variations]"
Add component (AddParameter): Name = "Table"; Value = "SAMTEC"; VariantName = "[No Variations]"
Added Component: Designator=W4+(SAMTEC_MTLW-102-07-L-S-250)
Add component. Clean all parameters for all variants
Add component (AddParameter): Name = "Author"; Value = "CERN DEM JLC"; VariantName = "[No Variations]"
Add component (AddParameter): Name = "ClassName"; Value = "Overlapping"; VariantName = "[No Variations]"
Add component (AddParameter): Name = "ComponentHeight"; Value = "7.87mm"; VariantName = "[No Variations]"
Add component (AddParameter): Name = "Component Type"; Value = "Standard"; VariantName = "[No Variations]"
Add component (AddParameter): Name = "CreateDate"; Value = "13/12/2012"; VariantName = "[No Variations]"
Add component (AddParameter): Name = "Family"; Value = "Header 2"; VariantName = "[No Variations]"
Add component (AddParameter): Name = "HelpURL"; Value = "\\cern.ch\dfs\Applications\Altium\Datasheets\SAMTEC_MTLW-102-07-L-S-250.pdf"; VariantName = "[No Variations]"
Add component (AddParameter): Name = "LatestRevisionDate"; Value = "13/12/2012"; VariantName = "[No Variations]"
Add component (AddParameter): Name = "Manufacturer"; Value = "SAMTEC"; VariantName = "[No Variations]"
Add component (AddParameter): Name = "Manufacturer Part Number"; Value = "MTLW-102-07-L-S-250"; VariantName = "[No Variations]"
Add component (AddParameter): Name = "Mounted"; Value = "Yes"; VariantName = "[No Variations]"
Add component (AddParameter): Name = "Part Description"; Value = "2 Contacts - Pitch 2.54mm - Single Row Through Mount Straight Header (Post Lead = 6.35mm, Tail Lead 3.05mm, Insulator 1.52mm)"; VariantName = "[No Variations]"
Add component (AddParameter): Name = "Part Number"; Value = "SAMTEC_MTLW-102-07-L-S-250"; VariantName = "[No Variations]"
Add component (AddParameter): Name = "Pin Count"; Value = "2"; VariantName = "[No Variations]"
Add component (AddParameter): Name = "SMD"; Value = "No"; VariantName = "[No Variations]"
Add component (AddParameter): Name = "Socket"; Value = "No"; VariantName = "[No Variations]"
Add component (AddParameter): Name = "Status"; Value = "None"; VariantName = "[No Variations]"
Add component (AddParameter): Name = "Table"; Value = "SAMTEC"; VariantName = "[No Variations]"
Added Component: Designator=W4-(SAMTEC_MTLW-102-07-L-S-250)
Add component. Clean all parameters for all variants
Add component (AddParameter): Name = "Author"; Value = "CERN DEM JLC"; VariantName = "[No Variations]"
Add component (AddParameter): Name = "ClassName"; Value = "Overlapping"; VariantName = "[No Variations]"
Add component (AddParameter): Name = "ComponentHeight"; Value = "7.87mm"; VariantName = "[No Variations]"
Add component (AddParameter): Name = "Component Type"; Value = "Standard"; VariantName = "[No Variations]"
Add component (AddParameter): Name = "CreateDate"; Value = "13/12/2012"; VariantName = "[No Variations]"
Add component (AddParameter): Name = "Family"; Value = "Header 2"; VariantName = "[No Variations]"
Add component (AddParameter): Name = "HelpURL"; Value = "\\cern.ch\dfs\Applications\Altium\Datasheets\SAMTEC_MTLW-102-07-L-S-250.pdf"; VariantName = "[No Variations]"
Add component (AddParameter): Name = "LatestRevisionDate"; Value = "13/12/2012"; VariantName = "[No Variations]"
Add component (AddParameter): Name = "Manufacturer"; Value = "SAMTEC"; VariantName = "[No Variations]"
Add component (AddParameter): Name = "Manufacturer Part Number"; Value = "MTLW-102-07-L-S-250"; VariantName = "[No Variations]"
Add component (AddParameter): Name = "Mounted"; Value = "Yes"; VariantName = "[No Variations]"
Add component (AddParameter): Name = "Part Description"; Value = "2 Contacts - Pitch 2.54mm - Single Row Through Mount Straight Header (Post Lead = 6.35mm, Tail Lead 3.05mm, Insulator 1.52mm)"; VariantName = "[No Variations]"
Add component (AddParameter): Name = "Part Number"; Value = "SAMTEC_MTLW-102-07-L-S-250"; VariantName = "[No Variations]"
Add component (AddParameter): Name = "Pin Count"; Value = "2"; VariantName = "[No Variations]"
Add component (AddParameter): Name = "SMD"; Value = "No"; VariantName = "[No Variations]"
Add component (AddParameter): Name = "Socket"; Value = "No"; VariantName = "[No Variations]"
Add component (AddParameter): Name = "Status"; Value = "None"; VariantName = "[No Variations]"
Add component (AddParameter): Name = "Table"; Value = "SAMTEC"; VariantName = "[No Variations]"
Added Component: Designator=W5+(SAMTEC_MTLW-102-07-L-S-250)
Add component. Clean all parameters for all variants
Add component (AddParameter): Name = "Author"; Value = "CERN DEM JLC"; VariantName = "[No Variations]"
Add component (AddParameter): Name = "ClassName"; Value = "Overlapping"; VariantName = "[No Variations]"
Add component (AddParameter): Name = "ComponentHeight"; Value = "7.87mm"; VariantName = "[No Variations]"
Add component (AddParameter): Name = "Component Type"; Value = "Standard"; VariantName = "[No Variations]"
Add component (AddParameter): Name = "CreateDate"; Value = "13/12/2012"; VariantName = "[No Variations]"
Add component (AddParameter): Name = "Family"; Value = "Header 2"; VariantName = "[No Variations]"
Add component (AddParameter): Name = "HelpURL"; Value = "\\cern.ch\dfs\Applications\Altium\Datasheets\SAMTEC_MTLW-102-07-L-S-250.pdf"; VariantName = "[No Variations]"
Add component (AddParameter): Name = "LatestRevisionDate"; Value = "13/12/2012"; VariantName = "[No Variations]"
Add component (AddParameter): Name = "Manufacturer"; Value = "SAMTEC"; VariantName = "[No Variations]"
Add component (AddParameter): Name = "Manufacturer Part Number"; Value = "MTLW-102-07-L-S-250"; VariantName = "[No Variations]"
Add component (AddParameter): Name = "Mounted"; Value = "Yes"; VariantName = "[No Variations]"
Add component (AddParameter): Name = "Part Description"; Value = "2 Contacts - Pitch 2.54mm - Single Row Through Mount Straight Header (Post Lead = 6.35mm, Tail Lead 3.05mm, Insulator 1.52mm)"; VariantName = "[No Variations]"
Add component (AddParameter): Name = "Part Number"; Value = "SAMTEC_MTLW-102-07-L-S-250"; VariantName = "[No Variations]"
Add component (AddParameter): Name = "Pin Count"; Value = "2"; VariantName = "[No Variations]"
Add component (AddParameter): Name = "SMD"; Value = "No"; VariantName = "[No Variations]"
Add component (AddParameter): Name = "Socket"; Value = "No"; VariantName = "[No Variations]"
Add component (AddParameter): Name = "Status"; Value = "None"; VariantName = "[No Variations]"
Add component (AddParameter): Name = "Table"; Value = "SAMTEC"; VariantName = "[No Variations]"
Added Component: Designator=W5-(SAMTEC_MTLW-102-07-L-S-250)
Add component. Clean all parameters for all variants
Add component (AddParameter): Name = "Author"; Value = "CERN DEM JLC"; VariantName = "[No Variations]"
Add component (AddParameter): Name = "ClassName"; Value = "Overlapping"; VariantName = "[No Variations]"
Add component (AddParameter): Name = "ComponentHeight"; Value = "7.87mm"; VariantName = "[No Variations]"
Add component (AddParameter): Name = "Component Type"; Value = "Standard"; VariantName = "[No Variations]"
Add component (AddParameter): Name = "CreateDate"; Value = "13/12/2012"; VariantName = "[No Variations]"
Add component (AddParameter): Name = "Family"; Value = "Header 2"; VariantName = "[No Variations]"
Add component (AddParameter): Name = "HelpURL"; Value = "\\cern.ch\dfs\Applications\Altium\Datasheets\SAMTEC_MTLW-102-07-L-S-250.pdf"; VariantName = "[No Variations]"
Add component (AddParameter): Name = "LatestRevisionDate"; Value = "13/12/2012"; VariantName = "[No Variations]"
Add component (AddParameter): Name = "Manufacturer"; Value = "SAMTEC"; VariantName = "[No Variations]"
Add component (AddParameter): Name = "Manufacturer Part Number"; Value = "MTLW-102-07-L-S-250"; VariantName = "[No Variations]"
Add component (AddParameter): Name = "Mounted"; Value = "Yes"; VariantName = "[No Variations]"
Add component (AddParameter): Name = "Part Description"; Value = "2 Contacts - Pitch 2.54mm - Single Row Through Mount Straight Header (Post Lead = 6.35mm, Tail Lead 3.05mm, Insulator 1.52mm)"; VariantName = "[No Variations]"
Add component (AddParameter): Name = "Part Number"; Value = "SAMTEC_MTLW-102-07-L-S-250"; VariantName = "[No Variations]"
Add component (AddParameter): Name = "Pin Count"; Value = "2"; VariantName = "[No Variations]"
Add component (AddParameter): Name = "SMD"; Value = "No"; VariantName = "[No Variations]"
Add component (AddParameter): Name = "Socket"; Value = "No"; VariantName = "[No Variations]"
Add component (AddParameter): Name = "Status"; Value = "None"; VariantName = "[No Variations]"
Add component (AddParameter): Name = "Table"; Value = "SAMTEC"; VariantName = "[No Variations]"
Added Component: Designator=W6+(SAMTEC_MTLW-102-07-L-S-250)
Add component. Clean all parameters for all variants
Add component (AddParameter): Name = "Author"; Value = "CERN DEM JLC"; VariantName = "[No Variations]"
Add component (AddParameter): Name = "ClassName"; Value = "Overlapping"; VariantName = "[No Variations]"
Add component (AddParameter): Name = "ComponentHeight"; Value = "7.87mm"; VariantName = "[No Variations]"
Add component (AddParameter): Name = "Component Type"; Value = "Standard"; VariantName = "[No Variations]"
Add component (AddParameter): Name = "CreateDate"; Value = "13/12/2012"; VariantName = "[No Variations]"
Add component (AddParameter): Name = "Family"; Value = "Header 2"; VariantName = "[No Variations]"
Add component (AddParameter): Name = "HelpURL"; Value = "\\cern.ch\dfs\Applications\Altium\Datasheets\SAMTEC_MTLW-102-07-L-S-250.pdf"; VariantName = "[No Variations]"
Add component (AddParameter): Name = "LatestRevisionDate"; Value = "13/12/2012"; VariantName = "[No Variations]"
Add component (AddParameter): Name = "Manufacturer"; Value = "SAMTEC"; VariantName = "[No Variations]"
Add component (AddParameter): Name = "Manufacturer Part Number"; Value = "MTLW-102-07-L-S-250"; VariantName = "[No Variations]"
Add component (AddParameter): Name = "Mounted"; Value = "Yes"; VariantName = "[No Variations]"
Add component (AddParameter): Name = "Part Description"; Value = "2 Contacts - Pitch 2.54mm - Single Row Through Mount Straight Header (Post Lead = 6.35mm, Tail Lead 3.05mm, Insulator 1.52mm)"; VariantName = "[No Variations]"
Add component (AddParameter): Name = "Part Number"; Value = "SAMTEC_MTLW-102-07-L-S-250"; VariantName = "[No Variations]"
Add component (AddParameter): Name = "Pin Count"; Value = "2"; VariantName = "[No Variations]"
Add component (AddParameter): Name = "SMD"; Value = "No"; VariantName = "[No Variations]"
Add component (AddParameter): Name = "Socket"; Value = "No"; VariantName = "[No Variations]"
Add component (AddParameter): Name = "Status"; Value = "None"; VariantName = "[No Variations]"
Add component (AddParameter): Name = "Table"; Value = "SAMTEC"; VariantName = "[No Variations]"
Added Component: Designator=W6-(SAMTEC_MTLW-102-07-L-S-250)
Add component. Clean all parameters for all variants
Add component (AddParameter): Name = "Author"; Value = "CERN DEM JLC"; VariantName = "[No Variations]"
Add component (AddParameter): Name = "ClassName"; Value = "Overlapping"; VariantName = "[No Variations]"
Add component (AddParameter): Name = "ComponentHeight"; Value = "7.87mm"; VariantName = "[No Variations]"
Add component (AddParameter): Name = "Component Type"; Value = "Standard"; VariantName = "[No Variations]"
Add component (AddParameter): Name = "CreateDate"; Value = "13/12/2012"; VariantName = "[No Variations]"
Add component (AddParameter): Name = "Family"; Value = "Header 2"; VariantName = "[No Variations]"
Add component (AddParameter): Name = "HelpURL"; Value = "\\cern.ch\dfs\Applications\Altium\Datasheets\SAMTEC_MTLW-102-07-L-S-250.pdf"; VariantName = "[No Variations]"
Add component (AddParameter): Name = "LatestRevisionDate"; Value = "13/12/2012"; VariantName = "[No Variations]"
Add component (AddParameter): Name = "Manufacturer"; Value = "SAMTEC"; VariantName = "[No Variations]"
Add component (AddParameter): Name = "Manufacturer Part Number"; Value = "MTLW-102-07-L-S-250"; VariantName = "[No Variations]"
Add component (AddParameter): Name = "Mounted"; Value = "Yes"; VariantName = "[No Variations]"
Add component (AddParameter): Name = "Part Description"; Value = "2 Contacts - Pitch 2.54mm - Single Row Through Mount Straight Header (Post Lead = 6.35mm, Tail Lead 3.05mm, Insulator 1.52mm)"; VariantName = "[No Variations]"
Add component (AddParameter): Name = "Part Number"; Value = "SAMTEC_MTLW-102-07-L-S-250"; VariantName = "[No Variations]"
Add component (AddParameter): Name = "Pin Count"; Value = "2"; VariantName = "[No Variations]"
Add component (AddParameter): Name = "SMD"; Value = "No"; VariantName = "[No Variations]"
Add component (AddParameter): Name = "Socket"; Value = "No"; VariantName = "[No Variations]"
Add component (AddParameter): Name = "Status"; Value = "None"; VariantName = "[No Variations]"
Add component (AddParameter): Name = "Table"; Value = "SAMTEC"; VariantName = "[No Variations]"
Added Component: Designator=W7+(SAMTEC_MTLW-102-07-L-S-250)
Add component. Clean all parameters for all variants
Add component (AddParameter): Name = "Author"; Value = "CERN DEM JLC"; VariantName = "[No Variations]"
Add component (AddParameter): Name = "ClassName"; Value = "Overlapping"; VariantName = "[No Variations]"
Add component (AddParameter): Name = "ComponentHeight"; Value = "7.87mm"; VariantName = "[No Variations]"
Add component (AddParameter): Name = "Component Type"; Value = "Standard"; VariantName = "[No Variations]"
Add component (AddParameter): Name = "CreateDate"; Value = "13/12/2012"; VariantName = "[No Variations]"
Add component (AddParameter): Name = "Family"; Value = "Header 2"; VariantName = "[No Variations]"
Add component (AddParameter): Name = "HelpURL"; Value = "\\cern.ch\dfs\Applications\Altium\Datasheets\SAMTEC_MTLW-102-07-L-S-250.pdf"; VariantName = "[No Variations]"
Add component (AddParameter): Name = "LatestRevisionDate"; Value = "13/12/2012"; VariantName = "[No Variations]"
Add component (AddParameter): Name = "Manufacturer"; Value = "SAMTEC"; VariantName = "[No Variations]"
Add component (AddParameter): Name = "Manufacturer Part Number"; Value = "MTLW-102-07-L-S-250"; VariantName = "[No Variations]"
Add component (AddParameter): Name = "Mounted"; Value = "Yes"; VariantName = "[No Variations]"
Add component (AddParameter): Name = "Part Description"; Value = "2 Contacts - Pitch 2.54mm - Single Row Through Mount Straight Header (Post Lead = 6.35mm, Tail Lead 3.05mm, Insulator 1.52mm)"; VariantName = "[No Variations]"
Add component (AddParameter): Name = "Part Number"; Value = "SAMTEC_MTLW-102-07-L-S-250"; VariantName = "[No Variations]"
Add component (AddParameter): Name = "Pin Count"; Value = "2"; VariantName = "[No Variations]"
Add component (AddParameter): Name = "SMD"; Value = "No"; VariantName = "[No Variations]"
Add component (AddParameter): Name = "Socket"; Value = "No"; VariantName = "[No Variations]"
Add component (AddParameter): Name = "Status"; Value = "None"; VariantName = "[No Variations]"
Add component (AddParameter): Name = "Table"; Value = "SAMTEC"; VariantName = "[No Variations]"
Added Component: Designator=W7-(SAMTEC_MTLW-102-07-L-S-250)
Add component. Clean all parameters for all variants
Add component (AddParameter): Name = "Author"; Value = "CERN DEM JLC"; VariantName = "[No Variations]"
Add component (AddParameter): Name = "ClassName"; Value = "Overlapping"; VariantName = "[No Variations]"
Add component (AddParameter): Name = "ComponentHeight"; Value = "7.87mm"; VariantName = "[No Variations]"
Add component (AddParameter): Name = "Component Type"; Value = "Standard"; VariantName = "[No Variations]"
Add component (AddParameter): Name = "CreateDate"; Value = "13/12/2012"; VariantName = "[No Variations]"
Add component (AddParameter): Name = "Family"; Value = "Header 2"; VariantName = "[No Variations]"
Add component (AddParameter): Name = "HelpURL"; Value = "\\cern.ch\dfs\Applications\Altium\Datasheets\SAMTEC_MTLW-102-07-L-S-250.pdf"; VariantName = "[No Variations]"
Add component (AddParameter): Name = "LatestRevisionDate"; Value = "13/12/2012"; VariantName = "[No Variations]"
Add component (AddParameter): Name = "Manufacturer"; Value = "SAMTEC"; VariantName = "[No Variations]"
Add component (AddParameter): Name = "Manufacturer Part Number"; Value = "MTLW-102-07-L-S-250"; VariantName = "[No Variations]"
Add component (AddParameter): Name = "Mounted"; Value = "Yes"; VariantName = "[No Variations]"
Add component (AddParameter): Name = "Part Description"; Value = "2 Contacts - Pitch 2.54mm - Single Row Through Mount Straight Header (Post Lead = 6.35mm, Tail Lead 3.05mm, Insulator 1.52mm)"; VariantName = "[No Variations]"
Add component (AddParameter): Name = "Part Number"; Value = "SAMTEC_MTLW-102-07-L-S-250"; VariantName = "[No Variations]"
Add component (AddParameter): Name = "Pin Count"; Value = "2"; VariantName = "[No Variations]"
Add component (AddParameter): Name = "SMD"; Value = "No"; VariantName = "[No Variations]"
Add component (AddParameter): Name = "Socket"; Value = "No"; VariantName = "[No Variations]"
Add component (AddParameter): Name = "Status"; Value = "None"; VariantName = "[No Variations]"
Add component (AddParameter): Name = "Table"; Value = "SAMTEC"; VariantName = "[No Variations]"
Added Pin To Net: NetName=1/0I+ Pin=J1-46
Added Pin To Net: NetName=1/0I+ Pin=J100-1
Added Net: Name=1/0I+
Added Pin To Net: NetName=1/0I- Pin=J1-7
Added Pin To Net: NetName=1/0I- Pin=J1-11
Added Pin To Net: NetName=1/0I- Pin=J1-17
Added Pin To Net: NetName=1/0I- Pin=J1-21
Added Pin To Net: NetName=1/0I- Pin=J1-31
Added Pin To Net: NetName=1/0I- Pin=J1-35
Added Pin To Net: NetName=1/0I- Pin=J1-41
Added Pin To Net: NetName=1/0I- Pin=J1-45
Added Pin To Net: NetName=1/0I- Pin=J2-7
Added Pin To Net: NetName=1/0I- Pin=J2-11
Added Pin To Net: NetName=1/0I- Pin=J2-17
Added Pin To Net: NetName=1/0I- Pin=J2-21
Added Pin To Net: NetName=1/0I- Pin=J2-31
Added Pin To Net: NetName=1/0I- Pin=J2-35
Added Pin To Net: NetName=1/0I- Pin=J2-41
Added Pin To Net: NetName=1/0I- Pin=J2-45
Added Pin To Net: NetName=1/0I- Pin=J3-21
Added Pin To Net: NetName=1/0I- Pin=J4-10
Added Pin To Net: NetName=1/0I- Pin=J100-2
Added Pin To Net: NetName=1/0I- Pin=J100-4
Added Pin To Net: NetName=1/0I- Pin=J100-6
Added Pin To Net: NetName=1/0I- Pin=J100-8
Added Pin To Net: NetName=1/0I- Pin=J100-10
Added Pin To Net: NetName=1/0I- Pin=J100-12
Added Pin To Net: NetName=1/0I- Pin=J100-14
Added Pin To Net: NetName=1/0I- Pin=J100-16
Added Pin To Net: NetName=1/0I- Pin=J100-18
Added Pin To Net: NetName=1/0I- Pin=J100-20
Added Pin To Net: NetName=1/0I- Pin=J100-22
Added Pin To Net: NetName=1/0I- Pin=J100-24
Added Pin To Net: NetName=1/0I- Pin=J100-26
Added Pin To Net: NetName=1/0I- Pin=J100-28
Added Pin To Net: NetName=1/0I- Pin=J100-30
Added Pin To Net: NetName=1/0I- Pin=J100-32
Added Pin To Net: NetName=1/0I- Pin=J100-34
Added Pin To Net: NetName=1/0I- Pin=J100-36
Added Pin To Net: NetName=1/0I- Pin=J100-38
Added Pin To Net: NetName=1/0I- Pin=J100-40
Added Pin To Net: NetName=1/0I- Pin=J100-42
Added Pin To Net: NetName=1/0I- Pin=J100-44
Added Pin To Net: NetName=1/0I- Pin=J100-46
Added Pin To Net: NetName=1/0I- Pin=J100-48
Added Pin To Net: NetName=1/0I- Pin=SW0--1
Added Pin To Net: NetName=1/0I- Pin=SW1--1
Added Pin To Net: NetName=1/0I- Pin=SW2--1
Added Pin To Net: NetName=1/0I- Pin=SW3--1
Added Pin To Net: NetName=1/0I- Pin=SW4--1
Added Pin To Net: NetName=1/0I- Pin=SW5--1
Added Pin To Net: NetName=1/0I- Pin=SW6--1
Added Pin To Net: NetName=1/0I- Pin=SW7--1
Added Pin To Net: NetName=1/0I- Pin=W0--1
Added Pin To Net: NetName=1/0I- Pin=W1--1
Added Pin To Net: NetName=1/0I- Pin=W2--1
Added Pin To Net: NetName=1/0I- Pin=W3--1
Added Pin To Net: NetName=1/0I- Pin=W4--1
Added Pin To Net: NetName=1/0I- Pin=W4--2
Added Pin To Net: NetName=1/0I- Pin=W5--1
Added Pin To Net: NetName=1/0I- Pin=W6--1
Added Pin To Net: NetName=1/0I- Pin=W7--1
Added Net: Name=1/0I-
Added Pin To Net: NetName=1/1I+ Pin=J1-42
Added Pin To Net: NetName=1/1I+ Pin=J100-3
Added Net: Name=1/1I+
Added Pin To Net: NetName=1/2I+ Pin=J1-36
Added Pin To Net: NetName=1/2I+ Pin=J100-5
Added Net: Name=1/2I+
Added Pin To Net: NetName=1/3I+ Pin=J1-32
Added Pin To Net: NetName=1/3I+ Pin=J100-7
Added Net: Name=1/3I+
Added Pin To Net: NetName=1/CH4+ Pin=J1-22
Added Pin To Net: NetName=1/CH4+ Pin=J100-9
Added Net: Name=1/CH4+
Added Pin To Net: NetName=1/CH5+ Pin=J1-18
Added Pin To Net: NetName=1/CH5+ Pin=J100-11
Added Net: Name=1/CH5+
Added Pin To Net: NetName=1/CH6+ Pin=J1-12
Added Pin To Net: NetName=1/CH6+ Pin=J100-13
Added Net: Name=1/CH6+
Added Pin To Net: NetName=1/CH7+ Pin=J1-8
Added Pin To Net: NetName=1/CH7+ Pin=J100-15
Added Net: Name=1/CH7+
Added Pin To Net: NetName=1/CH8+ Pin=J1-3
Added Pin To Net: NetName=1/CH8+ Pin=J1-4
Added Net: Name=1/CH8+
Added Pin To Net: NetName=1/CH8- Pin=J1-1
Added Pin To Net: NetName=1/CH8- Pin=J1-2
Added Net: Name=1/CH8-
Added Pin To Net: NetName=2/CH0+ Pin=J2-46
Added Pin To Net: NetName=2/CH0+ Pin=J100-17
Added Net: Name=2/CH0+
Added Pin To Net: NetName=2/CH1+ Pin=J2-42
Added Pin To Net: NetName=2/CH1+ Pin=J100-19
Added Net: Name=2/CH1+
Added Pin To Net: NetName=2/CH2+ Pin=J2-36
Added Pin To Net: NetName=2/CH2+ Pin=J100-21
Added Net: Name=2/CH2+
Added Pin To Net: NetName=2/CH3+ Pin=J2-32
Added Pin To Net: NetName=2/CH3+ Pin=J100-23
Added Net: Name=2/CH3+
Added Pin To Net: NetName=2/CH4+ Pin=J2-22
Added Pin To Net: NetName=2/CH4+ Pin=J100-25
Added Net: Name=2/CH4+
Added Pin To Net: NetName=2/CH5+ Pin=J2-18
Added Pin To Net: NetName=2/CH5+ Pin=J100-27
Added Net: Name=2/CH5+
Added Pin To Net: NetName=2/CH6+ Pin=J2-12
Added Pin To Net: NetName=2/CH6+ Pin=J100-29
Added Net: Name=2/CH6+
Added Pin To Net: NetName=2/CH7+ Pin=J2-8
Added Pin To Net: NetName=2/CH7+ Pin=J100-31
Added Net: Name=2/CH7+
Added Pin To Net: NetName=2/CH8+ Pin=J2-3
Added Pin To Net: NetName=2/CH8+ Pin=J2-4
Added Net: Name=2/CH8+
Added Pin To Net: NetName=2/CH8- Pin=J2-1
Added Pin To Net: NetName=2/CH8- Pin=J2-2
Added Net: Name=2/CH8-
Added Pin To Net: NetName=3/CH0+ Pin=J3-46
Added Pin To Net: NetName=3/CH0+ Pin=J4-1
Added Pin To Net: NetName=3/CH0+ Pin=W0+-2
Added Net: Name=3/CH0+
Added Pin To Net: NetName=3/CH0- Pin=J3-45
Added Pin To Net: NetName=3/CH0- Pin=J4-2
Added Pin To Net: NetName=3/CH0- Pin=W0--2
Added Net: Name=3/CH0-
Added Pin To Net: NetName=3/CH1+ Pin=J3-42
Added Pin To Net: NetName=3/CH1+ Pin=J4-3
Added Pin To Net: NetName=3/CH1+ Pin=W1+-2
Added Net: Name=3/CH1+
Added Pin To Net: NetName=3/CH1- Pin=J3-41
Added Pin To Net: NetName=3/CH1- Pin=J4-4
Added Pin To Net: NetName=3/CH1- Pin=W1--2
Added Net: Name=3/CH1-
Added Pin To Net: NetName=3/CH2+ Pin=J3-36
Added Pin To Net: NetName=3/CH2+ Pin=J4-5
Added Pin To Net: NetName=3/CH2+ Pin=W2+-2
Added Net: Name=3/CH2+
Added Pin To Net: NetName=3/CH2- Pin=J3-35
Added Pin To Net: NetName=3/CH2- Pin=J4-6
Added Pin To Net: NetName=3/CH2- Pin=W2--2
Added Net: Name=3/CH2-
Added Pin To Net: NetName=3/CH3+ Pin=J3-32
Added Pin To Net: NetName=3/CH3+ Pin=J4-7
Added Pin To Net: NetName=3/CH3+ Pin=W3+-2
Added Net: Name=3/CH3+
Added Pin To Net: NetName=3/CH3- Pin=J3-31
Added Pin To Net: NetName=3/CH3- Pin=J4-8
Added Pin To Net: NetName=3/CH3- Pin=W3--2
Added Net: Name=3/CH3-
Added Pin To Net: NetName=3/CH4+ Pin=J3-22
Added Pin To Net: NetName=3/CH4+ Pin=J4-9
Added Pin To Net: NetName=3/CH4+ Pin=J100-41
Added Pin To Net: NetName=3/CH4+ Pin=SW4+-1
Added Pin To Net: NetName=3/CH4+ Pin=W4+-1
Added Pin To Net: NetName=3/CH4+ Pin=W4+-2
Added Net: Name=3/CH4+
Added Pin To Net: NetName=3/CH5+ Pin=J3-18
Added Pin To Net: NetName=3/CH5+ Pin=J4-11
Added Pin To Net: NetName=3/CH5+ Pin=W5+-2
Added Net: Name=3/CH5+
Added Pin To Net: NetName=3/CH5- Pin=J3-17
Added Pin To Net: NetName=3/CH5- Pin=J4-12
Added Pin To Net: NetName=3/CH5- Pin=W5--2
Added Net: Name=3/CH5-
Added Pin To Net: NetName=3/CH6+ Pin=J4-13
Added Net: Name=3/CH6+
Added Pin To Net: NetName=3/CH6- Pin=J4-14
Added Net: Name=3/CH6-
Added Pin To Net: NetName=3/CH7+ Pin=J3-8
Added Pin To Net: NetName=3/CH7+ Pin=J4-15
Added Pin To Net: NetName=3/CH7+ Pin=W7+-2
Added Net: Name=3/CH7+
Added Pin To Net: NetName=3/CH7- Pin=J3-7
Added Pin To Net: NetName=3/CH7- Pin=J4-16
Added Pin To Net: NetName=3/CH7- Pin=W7--2
Added Net: Name=3/CH7-
Added Pin To Net: NetName=3/CH8+ Pin=J3-3
Added Pin To Net: NetName=3/CH8+ Pin=J3-4
Added Net: Name=3/CH8+
Added Pin To Net: NetName=3/CH8- Pin=J3-1
Added Pin To Net: NetName=3/CH8- Pin=J3-2
Added Net: Name=3/CH8-
Added Pin To Net: NetName=5/0I+ Pin=J100-33
Added Pin To Net: NetName=5/0I+ Pin=SW0+-1
Added Pin To Net: NetName=5/0I+ Pin=W0+-1
Added Net: Name=5/0I+
Added Pin To Net: NetName=5/1I+ Pin=J100-35
Added Pin To Net: NetName=5/1I+ Pin=SW1+-1
Added Pin To Net: NetName=5/1I+ Pin=W1+-1
Added Net: Name=5/1I+
Added Pin To Net: NetName=5/2I+ Pin=J100-37
Added Pin To Net: NetName=5/2I+ Pin=SW2+-1
Added Pin To Net: NetName=5/2I+ Pin=W2+-1
Added Net: Name=5/2I+
Added Pin To Net: NetName=5/3I+ Pin=J100-39
Added Pin To Net: NetName=5/3I+ Pin=SW3+-1
Added Pin To Net: NetName=5/3I+ Pin=W3+-1
Added Net: Name=5/3I+
Added Pin To Net: NetName=6/1I+ Pin=J100-43
Added Pin To Net: NetName=6/1I+ Pin=SW5+-1
Added Pin To Net: NetName=6/1I+ Pin=W5+-1
Added Net: Name=6/1I+
Added Pin To Net: NetName=6/2I+ Pin=J100-45
Added Pin To Net: NetName=6/2I+ Pin=SW6+-1
Added Pin To Net: NetName=6/2I+ Pin=W6+-1
Added Net: Name=6/2I+
Added Pin To Net: NetName=6/3I+ Pin=J100-47
Added Pin To Net: NetName=6/3I+ Pin=SW7+-1
Added Pin To Net: NetName=6/3I+ Pin=W7+-1
Added Net: Name=6/3I+
Added Pin To Net: NetName=NetJ3_11 Pin=J3-11
Added Pin To Net: NetName=NetJ3_11 Pin=W6--2
Added Net: Name=NetJ3_11
Added Pin To Net: NetName=NetJ3_12 Pin=J3-12
Added Pin To Net: NetName=NetJ3_12 Pin=W6+-2
Added Net: Name=NetJ3_12
Added Class: Name=ITK NTC PLC V1
Change Room Name: Old Name=PLC DI V1 New Name=ITK NTC PLC V1
Change Room Scope: Old Scope=InComponentClass('PLC DI V1') New Scope=InComponentClass('ITK NTC PLC V1')
