M48
;Layer_Color=9474304
;FILE_FORMAT=2:5
INCH,LZ
;TYPE=PLATED
T1F00S00C0.01968
T2F00S00C0.03150
T3F00S00C0.03543
T4F00S00C0.03937
T5F00S00C0.05118
T6F00S00C0.10630
T7F00S00C0.11024
;TYPE=NON_PLATED
T8F00S00C0.04724
%
T01
X0875625Y05925
X03475Y05325
X063Y093375
X0642456Y0923081
X06475Y0919375
X06655Y0925244
X0662Y0930044
X0574Y0909419
X0569359Y0913253
X0559847Y0901653
X0555Y09055
X0551505Y08935
X05465Y0897
X0380625Y0926875
X0373125Y0928125
X03495Y08725
X034519Y0837
X0349147Y0832323
X0353Y0828
X0362
X035825Y08225
X0366
X0400625Y094125
X0405Y0938125
X0431875Y095125
X0428125Y0955
X0605Y09575
X06095Y0953
X0606875Y0941875
X0612456Y0941831
X06295Y0939672
T02
X0315Y04225
Y04325
Y04425
Y04525
Y04625
X03225Y04575
Y04475
Y04375
Y04275
X033Y04225
Y04325
Y04425
Y04525
Y04625
X03225Y04675
X03375
Y04575
Y04475
Y04375
Y04275
X05725Y0402421
Y0392579
X066Y0380118
Y0370118
X0660438Y0440118
Y0450118
X03375Y04775
Y04875
Y04975
Y05075
Y05175
Y05275
Y05375
Y05475
Y05575
Y05675
Y05775
Y05875
X033Y05825
Y05725
Y05625
Y05525
Y05425
Y05325
Y05225
Y05125
Y05025
Y04925
Y04825
Y04725
X03225Y04775
Y04875
Y04975
Y05075
Y05175
Y05275
Y05375
Y05475
Y05575
Y05675
Y05775
Y05875
X0315Y05825
Y05725
Y05625
Y05525
Y05425
Y05325
Y05225
Y05125
Y05025
Y04925
Y04825
Y04725
Y08325
Y08425
Y08525
Y08625
Y08725
Y08825
Y08925
Y09025
Y09125
Y09225
Y09325
X03225Y09275
Y09175
Y09075
Y08975
Y08875
Y08775
Y08675
Y08575
Y08475
Y08375
X033Y08325
Y08425
Y08525
Y08625
Y08725
Y08825
Y08925
Y09025
Y09125
Y09225
Y09325
X03375Y09275
Y09175
Y09075
Y08975
Y08875
Y08775
Y08675
Y08575
Y08475
Y08375
Y09375
Y09475
Y09575
Y09675
Y09775
Y09875
Y09975
X033Y09925
Y09825
Y09725
Y09625
Y09525
Y09425
X03225Y09375
Y09475
Y09575
Y09675
Y09775
Y09875
Y09975
X0315Y09925
Y09825
Y09725
Y09625
Y09525
Y09425
X033Y1105
Y1115
X033Y11245
Y11345
T03
X0367Y0345
X0378
X0388901Y0344902
X0400051
X0411401
X0422673
X0433651
X0444651
X0461921Y0367453
X0444651Y0384902
X0433651
X0422673
X0411401
X0400051
X0388901
X0378Y0385
X0367
X0461921Y0407453
X0472952
X0483921
X0494921
X0505921
X0516921
X0527921Y0407166
X0539Y0407188
Y0367188
X0527921Y0367166
X0516921Y0367453
X0505921
X0494921
X0483921
X0472952
X044525Y077225
X043425
X0423272Y07725
X0412Y0772348
X040065Y07725
X03895
X0378
X03665
X0474031Y08055
X0485
X0496
X0507
X0518
X0529
X054
Y08455
X0529
X0518
X0507
X0496
X0485
X0474031
X0463
Y08055
X044525Y081225
X043425
X0423272Y08125
X0412Y0812348
X040065Y08125
X03895
X0378
X03665
X03475Y1105
Y11245
X03875
Y1105
T04
X0323Y03535
Y03635
X089Y03625
Y03525
Y03425
X091
Y03525
Y03625
Y03725
Y03825
Y03925
Y04025
Y04125
Y04225
Y04325
Y04425
Y04525
Y04625
X089
Y04525
Y04425
Y04325
Y04225
Y04125
Y04025
Y03925
Y03825
Y03725
Y04725
Y04825
Y04925
Y05025
Y05125
Y05225
Y05325
Y05425
Y05525
Y05625
Y05725
Y05825
Y05925
Y06025
Y06125
Y06225
X091
Y06125
Y06025
Y05925
Y05825
Y05725
Y05625
Y05525
Y05425
Y05325
Y05225
Y05125
Y05025
Y04925
Y04825
Y04725
Y06325
Y06425
Y06525
X089
Y06425
Y06325
Y08675
Y08775
Y08875
Y08975
Y09075
Y09175
Y09275
X091
Y09175
Y09075
Y08975
Y08875
Y08775
Y08675
X0322Y1062
Y1072
X089Y10675
Y10575
Y10475
Y10375
Y10275
Y10175
Y10075
Y09975
Y09875
Y09775
Y09675
Y09575
Y09475
Y09375
X091
Y09475
Y09575
Y09675
Y09775
Y09875
Y09975
Y10075
Y10175
Y10275
Y10375
Y10475
Y10575
Y10675
Y10775
Y10875
X089
Y10775
Y10975
Y11075
Y11175
Y11275
Y11375
Y11475
Y11575
Y11675
Y11775
X091
Y11675
Y11575
Y11475
Y11375
Y11275
Y11175
Y11075
Y10975
T05
X0608157Y0386824
Y0417139
X0627843
Y0386824
X068Y039315
Y041315
Y044315
X076
Y040315
Y036315
X083382Y0362415
X085618Y0362585
Y0402585
X083382Y0402415
T06
X0315Y03225
Y11975
T07
X03225Y0391024
X092Y03225
X03225Y0618976
X092Y06725
Y08475
X03225Y0801024
Y1028976
X092Y11975
T08
X032Y111
Y11295
M30
