%TF.GenerationSoftware,Altium Limited,Altium Designer,19.1.5 (86)*%
G04 Layer_Color=8388736*
%FSLAX45Y45*%
%MOMM*%
%TF.FileFunction,Other,Mechanical_14*%
%TF.Part,Single*%
G01*
G75*
%TA.AperFunction,NonConductor*%
%ADD27C,0.20000*%
%ADD28C,0.15240*%
%ADD29C,0.12700*%
%ADD33C,0.10000*%
D27*
X48036700Y9200922D02*
X48025275Y9206635D01*
X48008136Y9223774D01*
Y9103800D01*
X44296518Y17966499D02*
X44336505D01*
X44316513D01*
Y18086461D01*
X44296518Y18066467D01*
X44156519Y14420500D02*
X44196506D01*
X44176514D01*
Y14540462D01*
X44156519Y14520468D01*
X44336462Y14540462D02*
X44256488D01*
Y14480481D01*
X44296475Y14500475D01*
X44316467D01*
X44336462Y14480481D01*
Y14440494D01*
X44316467Y14420500D01*
X44276480D01*
X44256488Y14440494D01*
X44216492Y13145500D02*
X44136520D01*
X44216492Y13225475D01*
Y13245468D01*
X44196500Y13265462D01*
X44156512D01*
X44136520Y13245468D01*
X44256479D02*
X44276474Y13265462D01*
X44316461D01*
X44336456Y13245468D01*
Y13165492D01*
X44316461Y13145500D01*
X44276474D01*
X44256479Y13165492D01*
Y13245468D01*
X44216492Y11875500D02*
X44136520D01*
X44216492Y11955474D01*
Y11975468D01*
X44196500Y11995461D01*
X44156512D01*
X44136520Y11975468D01*
X44336456Y11995461D02*
X44256479D01*
Y11935481D01*
X44296466Y11955474D01*
X44316461D01*
X44336456Y11935481D01*
Y11895494D01*
X44316461Y11875500D01*
X44276474D01*
X44256479Y11895494D01*
X44136520Y10705468D02*
X44156512Y10725461D01*
X44196500D01*
X44216492Y10705468D01*
Y10685474D01*
X44196500Y10665481D01*
X44176505D01*
X44196500D01*
X44216492Y10645487D01*
Y10625494D01*
X44196500Y10605500D01*
X44156512D01*
X44136520Y10625494D01*
X44256479Y10705468D02*
X44276474Y10725461D01*
X44316461D01*
X44336456Y10705468D01*
Y10625494D01*
X44316461Y10605500D01*
X44276474D01*
X44256479Y10625494D01*
Y10705468D01*
X44328992Y17070461D02*
X44249020D01*
Y17010481D01*
X44289005Y17030473D01*
X44309000D01*
X44328992Y17010481D01*
Y16970494D01*
X44309000Y16950500D01*
X44269012D01*
X44249020Y16970494D01*
X44136520Y10197468D02*
X44156512Y10217461D01*
X44196500D01*
X44216492Y10197468D01*
Y10177474D01*
X44196500Y10157481D01*
X44176505D01*
X44196500D01*
X44216492Y10137487D01*
Y10117494D01*
X44196500Y10097500D01*
X44156512D01*
X44136520Y10117494D01*
X44336456Y10097500D02*
X44256479D01*
X44336456Y10177474D01*
Y10197468D01*
X44316461Y10217461D01*
X44276474D01*
X44256479Y10197468D01*
X44156519Y15688000D02*
X44196506D01*
X44176514D01*
Y15807961D01*
X44156519Y15787968D01*
X44256488D02*
X44276480Y15807961D01*
X44316467D01*
X44336462Y15787968D01*
Y15707994D01*
X44316467Y15688000D01*
X44276480D01*
X44256488Y15707994D01*
Y15787968D01*
X45314493Y18407474D02*
X45254514D01*
X45234521Y18387482D01*
Y18347495D01*
X45254514Y18327499D01*
X45314493D01*
X44528912Y18509975D02*
X44568900D01*
X44588895Y18489981D01*
Y18430000D01*
X44528912D01*
X44508920Y18449994D01*
X44528912Y18469987D01*
X44588895D01*
X40232516Y17966499D02*
X40272504D01*
X40252512D01*
Y18086461D01*
X40232516Y18066467D01*
X40092517Y14420500D02*
X40132504D01*
X40112512D01*
Y14540462D01*
X40092517Y14520468D01*
X40272458Y14540462D02*
X40192484D01*
Y14480481D01*
X40232471Y14500475D01*
X40252466D01*
X40272458Y14480481D01*
Y14440494D01*
X40252466Y14420500D01*
X40212479D01*
X40192484Y14440494D01*
X40152490Y13145500D02*
X40072516D01*
X40152490Y13225475D01*
Y13245468D01*
X40132498Y13265462D01*
X40092511D01*
X40072516Y13245468D01*
X40192477D02*
X40212473Y13265462D01*
X40252460D01*
X40272452Y13245468D01*
Y13165492D01*
X40252460Y13145500D01*
X40212473D01*
X40192477Y13165492D01*
Y13245468D01*
X40152490Y11875500D02*
X40072516D01*
X40152490Y11955474D01*
Y11975468D01*
X40132498Y11995461D01*
X40092511D01*
X40072516Y11975468D01*
X40272452Y11995461D02*
X40192477D01*
Y11935481D01*
X40232465Y11955474D01*
X40252460D01*
X40272452Y11935481D01*
Y11895494D01*
X40252460Y11875500D01*
X40212473D01*
X40192477Y11895494D01*
X40072516Y10705468D02*
X40092511Y10725461D01*
X40132498D01*
X40152490Y10705468D01*
Y10685474D01*
X40132498Y10665481D01*
X40112503D01*
X40132498D01*
X40152490Y10645487D01*
Y10625494D01*
X40132498Y10605500D01*
X40092511D01*
X40072516Y10625494D01*
X40192477Y10705468D02*
X40212473Y10725461D01*
X40252460D01*
X40272452Y10705468D01*
Y10625494D01*
X40252460Y10605500D01*
X40212473D01*
X40192477Y10625494D01*
Y10705468D01*
X40264990Y17070461D02*
X40185016D01*
Y17010481D01*
X40225003Y17030473D01*
X40244998D01*
X40264990Y17010481D01*
Y16970494D01*
X40244998Y16950500D01*
X40205011D01*
X40185016Y16970494D01*
X40072516Y10197468D02*
X40092511Y10217461D01*
X40132498D01*
X40152490Y10197468D01*
Y10177474D01*
X40132498Y10157481D01*
X40112503D01*
X40132498D01*
X40152490Y10137487D01*
Y10117494D01*
X40132498Y10097500D01*
X40092511D01*
X40072516Y10117494D01*
X40272452Y10097500D02*
X40192477D01*
X40272452Y10177474D01*
Y10197468D01*
X40252460Y10217461D01*
X40212473D01*
X40192477Y10197468D01*
X40092517Y15688000D02*
X40132504D01*
X40112512D01*
Y15807961D01*
X40092517Y15787968D01*
X40192484D02*
X40212479Y15807961D01*
X40252466D01*
X40272458Y15787968D01*
Y15707994D01*
X40252466Y15688000D01*
X40212479D01*
X40192484Y15707994D01*
Y15787968D01*
X41250491Y18407474D02*
X41190512D01*
X41170517Y18387482D01*
Y18347495D01*
X41190512Y18327499D01*
X41250491D01*
X40464911Y18509975D02*
X40504898D01*
X40524893Y18489981D01*
Y18430000D01*
X40464911D01*
X40444919Y18449994D01*
X40464911Y18469987D01*
X40524893D01*
X47399100Y10828622D02*
X47387674Y10834335D01*
X47370535Y10851475D01*
Y10731500D01*
X47415887Y10187909D02*
Y10193621D01*
X47410175Y10205048D01*
X47404462Y10210761D01*
X47393036Y10216474D01*
X47370181D01*
X47358755Y10210761D01*
X47353043Y10205048D01*
X47347330Y10193621D01*
Y10182196D01*
X47353043Y10170769D01*
X47364468Y10153630D01*
X47421600Y10096499D01*
X47341617D01*
X7952894Y18509975D02*
X7992881D01*
X8012874Y18489981D01*
Y18430000D01*
X7952894D01*
X7932900Y18449994D01*
X7952894Y18469987D01*
X8012874D01*
X8738474Y18407474D02*
X8678494D01*
X8658500Y18387482D01*
Y18347495D01*
X8678494Y18327499D01*
X8738474D01*
X7580500Y15688000D02*
X7620487D01*
X7600493D01*
Y15807961D01*
X7580500Y15787968D01*
X7680467D02*
X7700461Y15807961D01*
X7740448D01*
X7760442Y15787968D01*
Y15707993D01*
X7740448Y15688000D01*
X7700461D01*
X7680467Y15707993D01*
Y15787968D01*
X7560500Y10197468D02*
X7580493Y10217461D01*
X7620480D01*
X7640474Y10197468D01*
Y10177474D01*
X7620480Y10157480D01*
X7600487D01*
X7620480D01*
X7640474Y10137487D01*
Y10117493D01*
X7620480Y10097500D01*
X7580493D01*
X7560500Y10117493D01*
X7760435Y10097500D02*
X7680461D01*
X7760435Y10177474D01*
Y10197468D01*
X7740441Y10217461D01*
X7700454D01*
X7680461Y10197468D01*
X7752974Y17070461D02*
X7673000D01*
Y17010480D01*
X7712987Y17030473D01*
X7732980D01*
X7752974Y17010480D01*
Y16970493D01*
X7732980Y16950500D01*
X7692993D01*
X7673000Y16970493D01*
X7560500Y10705468D02*
X7580493Y10725461D01*
X7620480D01*
X7640474Y10705468D01*
Y10685474D01*
X7620480Y10665480D01*
X7600487D01*
X7620480D01*
X7640474Y10645487D01*
Y10625493D01*
X7620480Y10605500D01*
X7580493D01*
X7560500Y10625493D01*
X7680461Y10705468D02*
X7700454Y10725461D01*
X7740441D01*
X7760435Y10705468D01*
Y10625493D01*
X7740441Y10605500D01*
X7700454D01*
X7680461Y10625493D01*
Y10705468D01*
X7640474Y11875500D02*
X7560500D01*
X7640474Y11955474D01*
Y11975468D01*
X7620480Y11995461D01*
X7580493D01*
X7560500Y11975468D01*
X7760435Y11995461D02*
X7680461D01*
Y11935480D01*
X7720448Y11955474D01*
X7740441D01*
X7760435Y11935480D01*
Y11895493D01*
X7740441Y11875500D01*
X7700454D01*
X7680461Y11895493D01*
X7640474Y13145499D02*
X7560500D01*
X7640474Y13225475D01*
Y13245467D01*
X7620480Y13265462D01*
X7580493D01*
X7560500Y13245467D01*
X7680461D02*
X7700454Y13265462D01*
X7740441D01*
X7760435Y13245467D01*
Y13165492D01*
X7740441Y13145499D01*
X7700454D01*
X7680461Y13165492D01*
Y13245467D01*
X7580500Y14420500D02*
X7620487D01*
X7600493D01*
Y14540462D01*
X7580500Y14520468D01*
X7760442Y14540462D02*
X7680467D01*
Y14480479D01*
X7720454Y14500475D01*
X7740448D01*
X7760442Y14480479D01*
Y14440492D01*
X7740448Y14420500D01*
X7700461D01*
X7680467Y14440492D01*
X7720499Y17966499D02*
X7760486D01*
X7740493D01*
Y18086461D01*
X7720499Y18066467D01*
X36400894Y18509975D02*
X36440881D01*
X36460873Y18489981D01*
Y18430000D01*
X36400894D01*
X36380899Y18449994D01*
X36400894Y18469987D01*
X36460873D01*
X37186475Y18407474D02*
X37126495D01*
X37106500Y18387482D01*
Y18347495D01*
X37126495Y18327499D01*
X37186475D01*
X36028500Y15688000D02*
X36068488D01*
X36048492D01*
Y15807961D01*
X36028500Y15787968D01*
X36128467D02*
X36148462Y15807961D01*
X36188449D01*
X36208441Y15787968D01*
Y15707993D01*
X36188449Y15688000D01*
X36148462D01*
X36128467Y15707993D01*
Y15787968D01*
X36008499Y10197468D02*
X36028494Y10217461D01*
X36068481D01*
X36088474Y10197468D01*
Y10177474D01*
X36068481Y10157480D01*
X36048486D01*
X36068481D01*
X36088474Y10137487D01*
Y10117493D01*
X36068481Y10097500D01*
X36028494D01*
X36008499Y10117493D01*
X36208435Y10097500D02*
X36128461D01*
X36208435Y10177474D01*
Y10197468D01*
X36188440Y10217461D01*
X36148453D01*
X36128461Y10197468D01*
X36200974Y17070461D02*
X36120999D01*
Y17010480D01*
X36160986Y17030473D01*
X36180981D01*
X36200974Y17010480D01*
Y16970493D01*
X36180981Y16950500D01*
X36140994D01*
X36120999Y16970493D01*
X36008499Y10705468D02*
X36028494Y10725461D01*
X36068481D01*
X36088474Y10705468D01*
Y10685474D01*
X36068481Y10665480D01*
X36048486D01*
X36068481D01*
X36088474Y10645487D01*
Y10625493D01*
X36068481Y10605500D01*
X36028494D01*
X36008499Y10625493D01*
X36128461Y10705468D02*
X36148453Y10725461D01*
X36188440D01*
X36208435Y10705468D01*
Y10625493D01*
X36188440Y10605500D01*
X36148453D01*
X36128461Y10625493D01*
Y10705468D01*
X36088474Y11875500D02*
X36008499D01*
X36088474Y11955474D01*
Y11975468D01*
X36068481Y11995461D01*
X36028494D01*
X36008499Y11975468D01*
X36208435Y11995461D02*
X36128461D01*
Y11935480D01*
X36168448Y11955474D01*
X36188440D01*
X36208435Y11935480D01*
Y11895493D01*
X36188440Y11875500D01*
X36148453D01*
X36128461Y11895493D01*
X36088474Y13145499D02*
X36008499D01*
X36088474Y13225475D01*
Y13245467D01*
X36068481Y13265462D01*
X36028494D01*
X36008499Y13245467D01*
X36128461D02*
X36148453Y13265462D01*
X36188440D01*
X36208435Y13245467D01*
Y13165492D01*
X36188440Y13145499D01*
X36148453D01*
X36128461Y13165492D01*
Y13245467D01*
X36028500Y14420500D02*
X36068488D01*
X36048492D01*
Y14540462D01*
X36028500Y14520468D01*
X36208441Y14540462D02*
X36128467D01*
Y14480479D01*
X36168454Y14500475D01*
X36188449D01*
X36208441Y14480479D01*
Y14440492D01*
X36188449Y14420500D01*
X36148462D01*
X36128467Y14440492D01*
X36168500Y17966499D02*
X36208487D01*
X36188492D01*
Y18086461D01*
X36168500Y18066467D01*
X32336893Y18509975D02*
X32376880D01*
X32396875Y18489981D01*
Y18430000D01*
X32336893D01*
X32316901Y18449994D01*
X32336893Y18469987D01*
X32396875D01*
X33122473Y18407474D02*
X33062494D01*
X33042499Y18387482D01*
Y18347495D01*
X33062494Y18327499D01*
X33122473D01*
X31964499Y15688000D02*
X32004486D01*
X31984494D01*
Y15807961D01*
X31964499Y15787968D01*
X32064468D02*
X32084460Y15807961D01*
X32124448D01*
X32144443Y15787968D01*
Y15707993D01*
X32124448Y15688000D01*
X32084460D01*
X32064468Y15707993D01*
Y15787968D01*
X31944501Y10197468D02*
X31964493Y10217461D01*
X32004480D01*
X32024475Y10197468D01*
Y10177474D01*
X32004480Y10157480D01*
X31984488D01*
X32004480D01*
X32024475Y10137487D01*
Y10117493D01*
X32004480Y10097500D01*
X31964493D01*
X31944501Y10117493D01*
X32144434Y10097500D02*
X32064462D01*
X32144434Y10177474D01*
Y10197468D01*
X32124442Y10217461D01*
X32084454D01*
X32064462Y10197468D01*
X32136975Y17070461D02*
X32057001D01*
Y17010480D01*
X32096988Y17030473D01*
X32116980D01*
X32136975Y17010480D01*
Y16970493D01*
X32116980Y16950500D01*
X32076993D01*
X32057001Y16970493D01*
X31944501Y10705468D02*
X31964493Y10725461D01*
X32004480D01*
X32024475Y10705468D01*
Y10685474D01*
X32004480Y10665480D01*
X31984488D01*
X32004480D01*
X32024475Y10645487D01*
Y10625493D01*
X32004480Y10605500D01*
X31964493D01*
X31944501Y10625493D01*
X32064462Y10705468D02*
X32084454Y10725461D01*
X32124442D01*
X32144434Y10705468D01*
Y10625493D01*
X32124442Y10605500D01*
X32084454D01*
X32064462Y10625493D01*
Y10705468D01*
X32024475Y11875500D02*
X31944501D01*
X32024475Y11955474D01*
Y11975468D01*
X32004480Y11995461D01*
X31964493D01*
X31944501Y11975468D01*
X32144434Y11995461D02*
X32064462D01*
Y11935480D01*
X32104449Y11955474D01*
X32124442D01*
X32144434Y11935480D01*
Y11895493D01*
X32124442Y11875500D01*
X32084454D01*
X32064462Y11895493D01*
X32024475Y13145499D02*
X31944501D01*
X32024475Y13225475D01*
Y13245467D01*
X32004480Y13265462D01*
X31964493D01*
X31944501Y13245467D01*
X32064462D02*
X32084454Y13265462D01*
X32124442D01*
X32144434Y13245467D01*
Y13165492D01*
X32124442Y13145499D01*
X32084454D01*
X32064462Y13165492D01*
Y13245467D01*
X31964499Y14420500D02*
X32004486D01*
X31984494D01*
Y14540462D01*
X31964499Y14520468D01*
X32144443Y14540462D02*
X32064468D01*
Y14480479D01*
X32104453Y14500475D01*
X32124448D01*
X32144443Y14480479D01*
Y14440492D01*
X32124448Y14420500D01*
X32084460D01*
X32064468Y14440492D01*
X32104498Y17966499D02*
X32144485D01*
X32124493D01*
Y18086461D01*
X32104498Y18066467D01*
X28272894Y18509975D02*
X28312881D01*
X28332874Y18489981D01*
Y18430000D01*
X28272894D01*
X28252899Y18449994D01*
X28272894Y18469987D01*
X28332874D01*
X29058475Y18407474D02*
X28998495D01*
X28978500Y18387482D01*
Y18347495D01*
X28998495Y18327499D01*
X29058475D01*
X27900500Y15688000D02*
X27940488D01*
X27920493D01*
Y15807961D01*
X27900500Y15787968D01*
X28000467D02*
X28020462Y15807961D01*
X28060449D01*
X28080441Y15787968D01*
Y15707993D01*
X28060449Y15688000D01*
X28020462D01*
X28000467Y15707993D01*
Y15787968D01*
X27880499Y10197468D02*
X27900494Y10217461D01*
X27940479D01*
X27960474Y10197468D01*
Y10177474D01*
X27940479Y10157480D01*
X27920486D01*
X27940479D01*
X27960474Y10137487D01*
Y10117493D01*
X27940479Y10097500D01*
X27900494D01*
X27880499Y10117493D01*
X28080435Y10097500D02*
X28000461D01*
X28080435Y10177474D01*
Y10197468D01*
X28060440Y10217461D01*
X28020453D01*
X28000461Y10197468D01*
X28072974Y17070461D02*
X27992999D01*
Y17010480D01*
X28032986Y17030473D01*
X28052979D01*
X28072974Y17010480D01*
Y16970493D01*
X28052979Y16950500D01*
X28012994D01*
X27992999Y16970493D01*
X27880499Y10705468D02*
X27900494Y10725461D01*
X27940479D01*
X27960474Y10705468D01*
Y10685474D01*
X27940479Y10665480D01*
X27920486D01*
X27940479D01*
X27960474Y10645487D01*
Y10625493D01*
X27940479Y10605500D01*
X27900494D01*
X27880499Y10625493D01*
X28000461Y10705468D02*
X28020453Y10725461D01*
X28060440D01*
X28080435Y10705468D01*
Y10625493D01*
X28060440Y10605500D01*
X28020453D01*
X28000461Y10625493D01*
Y10705468D01*
X27960474Y11875500D02*
X27880499D01*
X27960474Y11955474D01*
Y11975468D01*
X27940479Y11995461D01*
X27900494D01*
X27880499Y11975468D01*
X28080435Y11995461D02*
X28000461D01*
Y11935480D01*
X28040448Y11955474D01*
X28060440D01*
X28080435Y11935480D01*
Y11895493D01*
X28060440Y11875500D01*
X28020453D01*
X28000461Y11895493D01*
X27960474Y13145499D02*
X27880499D01*
X27960474Y13225475D01*
Y13245467D01*
X27940479Y13265462D01*
X27900494D01*
X27880499Y13245467D01*
X28000461D02*
X28020453Y13265462D01*
X28060440D01*
X28080435Y13245467D01*
Y13165492D01*
X28060440Y13145499D01*
X28020453D01*
X28000461Y13165492D01*
Y13245467D01*
X27900500Y14420500D02*
X27940488D01*
X27920493D01*
Y14540462D01*
X27900500Y14520468D01*
X28080441Y14540462D02*
X28000467D01*
Y14480479D01*
X28040454Y14500475D01*
X28060449D01*
X28080441Y14480479D01*
Y14440492D01*
X28060449Y14420500D01*
X28020462D01*
X28000467Y14440492D01*
X28040500Y17966499D02*
X28080487D01*
X28060492D01*
Y18086461D01*
X28040500Y18066467D01*
X24208894Y18509975D02*
X24248882D01*
X24268874Y18489981D01*
Y18430000D01*
X24208894D01*
X24188901Y18449994D01*
X24208894Y18469987D01*
X24268874D01*
X24994473Y18407474D02*
X24934494D01*
X24914500Y18387482D01*
Y18347495D01*
X24934494Y18327499D01*
X24994473D01*
X23836501Y15688000D02*
X23876488D01*
X23856493D01*
Y15807961D01*
X23836501Y15787968D01*
X23936467D02*
X23956461Y15807961D01*
X23996448D01*
X24016441Y15787968D01*
Y15707993D01*
X23996448Y15688000D01*
X23956461D01*
X23936467Y15707993D01*
Y15787968D01*
X23816499Y10197468D02*
X23836493Y10217461D01*
X23876480D01*
X23896474Y10197468D01*
Y10177474D01*
X23876480Y10157480D01*
X23856487D01*
X23876480D01*
X23896474Y10137487D01*
Y10117493D01*
X23876480Y10097500D01*
X23836493D01*
X23816499Y10117493D01*
X24016435Y10097500D02*
X23936461D01*
X24016435Y10177474D01*
Y10197468D01*
X23996442Y10217461D01*
X23956454D01*
X23936461Y10197468D01*
X24008974Y17070461D02*
X23928999D01*
Y17010480D01*
X23968987Y17030473D01*
X23988980D01*
X24008974Y17010480D01*
Y16970493D01*
X23988980Y16950500D01*
X23948993D01*
X23928999Y16970493D01*
X23816499Y10705468D02*
X23836493Y10725461D01*
X23876480D01*
X23896474Y10705468D01*
Y10685474D01*
X23876480Y10665480D01*
X23856487D01*
X23876480D01*
X23896474Y10645487D01*
Y10625493D01*
X23876480Y10605500D01*
X23836493D01*
X23816499Y10625493D01*
X23936461Y10705468D02*
X23956454Y10725461D01*
X23996442D01*
X24016435Y10705468D01*
Y10625493D01*
X23996442Y10605500D01*
X23956454D01*
X23936461Y10625493D01*
Y10705468D01*
X23896474Y11875500D02*
X23816499D01*
X23896474Y11955474D01*
Y11975468D01*
X23876480Y11995461D01*
X23836493D01*
X23816499Y11975468D01*
X24016435Y11995461D02*
X23936461D01*
Y11935480D01*
X23976448Y11955474D01*
X23996442D01*
X24016435Y11935480D01*
Y11895493D01*
X23996442Y11875500D01*
X23956454D01*
X23936461Y11895493D01*
X23896474Y13145499D02*
X23816499D01*
X23896474Y13225475D01*
Y13245467D01*
X23876480Y13265462D01*
X23836493D01*
X23816499Y13245467D01*
X23936461D02*
X23956454Y13265462D01*
X23996442D01*
X24016435Y13245467D01*
Y13165492D01*
X23996442Y13145499D01*
X23956454D01*
X23936461Y13165492D01*
Y13245467D01*
X23836501Y14420500D02*
X23876488D01*
X23856493D01*
Y14540462D01*
X23836501Y14520468D01*
X24016441Y14540462D02*
X23936467D01*
Y14480479D01*
X23976454Y14500475D01*
X23996448D01*
X24016441Y14480479D01*
Y14440492D01*
X23996448Y14420500D01*
X23956461D01*
X23936467Y14440492D01*
X23976498Y17966499D02*
X24016486D01*
X23996494D01*
Y18086461D01*
X23976498Y18066467D01*
X20144894Y18509975D02*
X20184882D01*
X20204874Y18489981D01*
Y18430000D01*
X20144894D01*
X20124899Y18449994D01*
X20144894Y18469987D01*
X20204874D01*
X20930473Y18407474D02*
X20870494D01*
X20850500Y18387482D01*
Y18347495D01*
X20870494Y18327499D01*
X20930473D01*
X19772501Y15688000D02*
X19812486D01*
X19792493D01*
Y15807961D01*
X19772501Y15787968D01*
X19872467D02*
X19892461Y15807961D01*
X19932448D01*
X19952441Y15787968D01*
Y15707993D01*
X19932448Y15688000D01*
X19892461D01*
X19872467Y15707993D01*
Y15787968D01*
X19752499Y10197468D02*
X19772493Y10217461D01*
X19812480D01*
X19832474Y10197468D01*
Y10177474D01*
X19812480Y10157480D01*
X19792487D01*
X19812480D01*
X19832474Y10137487D01*
Y10117493D01*
X19812480Y10097500D01*
X19772493D01*
X19752499Y10117493D01*
X19952435Y10097500D02*
X19872461D01*
X19952435Y10177474D01*
Y10197468D01*
X19932442Y10217461D01*
X19892455D01*
X19872461Y10197468D01*
X19944974Y17070461D02*
X19864999D01*
Y17010480D01*
X19904987Y17030473D01*
X19924980D01*
X19944974Y17010480D01*
Y16970493D01*
X19924980Y16950500D01*
X19884993D01*
X19864999Y16970493D01*
X19752499Y10705468D02*
X19772493Y10725461D01*
X19812480D01*
X19832474Y10705468D01*
Y10685474D01*
X19812480Y10665480D01*
X19792487D01*
X19812480D01*
X19832474Y10645487D01*
Y10625493D01*
X19812480Y10605500D01*
X19772493D01*
X19752499Y10625493D01*
X19872461Y10705468D02*
X19892455Y10725461D01*
X19932442D01*
X19952435Y10705468D01*
Y10625493D01*
X19932442Y10605500D01*
X19892455D01*
X19872461Y10625493D01*
Y10705468D01*
X19832474Y11875500D02*
X19752499D01*
X19832474Y11955474D01*
Y11975468D01*
X19812480Y11995461D01*
X19772493D01*
X19752499Y11975468D01*
X19952435Y11995461D02*
X19872461D01*
Y11935480D01*
X19912448Y11955474D01*
X19932442D01*
X19952435Y11935480D01*
Y11895493D01*
X19932442Y11875500D01*
X19892455D01*
X19872461Y11895493D01*
X19832474Y13145499D02*
X19752499D01*
X19832474Y13225475D01*
Y13245467D01*
X19812480Y13265462D01*
X19772493D01*
X19752499Y13245467D01*
X19872461D02*
X19892455Y13265462D01*
X19932442D01*
X19952435Y13245467D01*
Y13165492D01*
X19932442Y13145499D01*
X19892455D01*
X19872461Y13165492D01*
Y13245467D01*
X19772501Y14420500D02*
X19812486D01*
X19792493D01*
Y14540462D01*
X19772501Y14520468D01*
X19952441Y14540462D02*
X19872467D01*
Y14480479D01*
X19912454Y14500475D01*
X19932448D01*
X19952441Y14480479D01*
Y14440492D01*
X19932448Y14420500D01*
X19892461D01*
X19872467Y14440492D01*
X19912498Y17966499D02*
X19952486D01*
X19932494D01*
Y18086461D01*
X19912498Y18066467D01*
X16080894Y18509975D02*
X16120882D01*
X16140874Y18489981D01*
Y18430000D01*
X16080894D01*
X16060899Y18449994D01*
X16080894Y18469987D01*
X16140874D01*
X16866473Y18407474D02*
X16806494D01*
X16786501Y18387482D01*
Y18347495D01*
X16806494Y18327499D01*
X16866473D01*
X15708501Y15688000D02*
X15748486D01*
X15728493D01*
Y15807961D01*
X15708501Y15787968D01*
X15808467D02*
X15828461Y15807961D01*
X15868448D01*
X15888441Y15787968D01*
Y15707993D01*
X15868448Y15688000D01*
X15828461D01*
X15808467Y15707993D01*
Y15787968D01*
X15688499Y10197468D02*
X15708493Y10217461D01*
X15748480D01*
X15768474Y10197468D01*
Y10177474D01*
X15748480Y10157480D01*
X15728487D01*
X15748480D01*
X15768474Y10137487D01*
Y10117493D01*
X15748480Y10097500D01*
X15708493D01*
X15688499Y10117493D01*
X15888435Y10097500D02*
X15808461D01*
X15888435Y10177474D01*
Y10197468D01*
X15868440Y10217461D01*
X15828455D01*
X15808461Y10197468D01*
X15880974Y17070461D02*
X15800999D01*
Y17010480D01*
X15840987Y17030473D01*
X15860980D01*
X15880974Y17010480D01*
Y16970493D01*
X15860980Y16950500D01*
X15820993D01*
X15800999Y16970493D01*
X15688499Y10705468D02*
X15708493Y10725461D01*
X15748480D01*
X15768474Y10705468D01*
Y10685474D01*
X15748480Y10665480D01*
X15728487D01*
X15748480D01*
X15768474Y10645487D01*
Y10625493D01*
X15748480Y10605500D01*
X15708493D01*
X15688499Y10625493D01*
X15808461Y10705468D02*
X15828455Y10725461D01*
X15868440D01*
X15888435Y10705468D01*
Y10625493D01*
X15868440Y10605500D01*
X15828455D01*
X15808461Y10625493D01*
Y10705468D01*
X15768474Y11875500D02*
X15688499D01*
X15768474Y11955474D01*
Y11975468D01*
X15748480Y11995461D01*
X15708493D01*
X15688499Y11975468D01*
X15888435Y11995461D02*
X15808461D01*
Y11935480D01*
X15848448Y11955474D01*
X15868440D01*
X15888435Y11935480D01*
Y11895493D01*
X15868440Y11875500D01*
X15828455D01*
X15808461Y11895493D01*
X15768474Y13145499D02*
X15688499D01*
X15768474Y13225475D01*
Y13245467D01*
X15748480Y13265462D01*
X15708493D01*
X15688499Y13245467D01*
X15808461D02*
X15828455Y13265462D01*
X15868440D01*
X15888435Y13245467D01*
Y13165492D01*
X15868440Y13145499D01*
X15828455D01*
X15808461Y13165492D01*
Y13245467D01*
X15708501Y14420500D02*
X15748486D01*
X15728493D01*
Y14540462D01*
X15708501Y14520468D01*
X15888441Y14540462D02*
X15808467D01*
Y14480479D01*
X15848454Y14500475D01*
X15868448D01*
X15888441Y14480479D01*
Y14440492D01*
X15868448Y14420500D01*
X15828461D01*
X15808467Y14440492D01*
X15848499Y17966499D02*
X15888486D01*
X15868494D01*
Y18086461D01*
X15848499Y18066467D01*
X12016894Y18509975D02*
X12056881D01*
X12076874Y18489981D01*
Y18430000D01*
X12016894D01*
X11996900Y18449994D01*
X12016894Y18469987D01*
X12076874D01*
X12802473Y18407474D02*
X12742494D01*
X12722500Y18387482D01*
Y18347495D01*
X12742494Y18327499D01*
X12802473D01*
X11644500Y15688000D02*
X11684487D01*
X11664493D01*
Y15807961D01*
X11644500Y15787968D01*
X11744467D02*
X11764461Y15807961D01*
X11804448D01*
X11824442Y15787968D01*
Y15707993D01*
X11804448Y15688000D01*
X11764461D01*
X11744467Y15707993D01*
Y15787968D01*
X11624500Y10197468D02*
X11644493Y10217461D01*
X11684480D01*
X11704474Y10197468D01*
Y10177474D01*
X11684480Y10157480D01*
X11664487D01*
X11684480D01*
X11704474Y10137487D01*
Y10117493D01*
X11684480Y10097500D01*
X11644493D01*
X11624500Y10117493D01*
X11824435Y10097500D02*
X11744461D01*
X11824435Y10177474D01*
Y10197468D01*
X11804441Y10217461D01*
X11764454D01*
X11744461Y10197468D01*
X11816974Y17070461D02*
X11737000D01*
Y17010480D01*
X11776987Y17030473D01*
X11796980D01*
X11816974Y17010480D01*
Y16970493D01*
X11796980Y16950500D01*
X11756993D01*
X11737000Y16970493D01*
X11624500Y10705468D02*
X11644493Y10725461D01*
X11684480D01*
X11704474Y10705468D01*
Y10685474D01*
X11684480Y10665480D01*
X11664487D01*
X11684480D01*
X11704474Y10645487D01*
Y10625493D01*
X11684480Y10605500D01*
X11644493D01*
X11624500Y10625493D01*
X11744461Y10705468D02*
X11764454Y10725461D01*
X11804441D01*
X11824435Y10705468D01*
Y10625493D01*
X11804441Y10605500D01*
X11764454D01*
X11744461Y10625493D01*
Y10705468D01*
X11704474Y11875500D02*
X11624500D01*
X11704474Y11955474D01*
Y11975468D01*
X11684480Y11995461D01*
X11644493D01*
X11624500Y11975468D01*
X11824435Y11995461D02*
X11744461D01*
Y11935480D01*
X11784448Y11955474D01*
X11804441D01*
X11824435Y11935480D01*
Y11895493D01*
X11804441Y11875500D01*
X11764454D01*
X11744461Y11895493D01*
X11704474Y13145499D02*
X11624500D01*
X11704474Y13225475D01*
Y13245467D01*
X11684480Y13265462D01*
X11644493D01*
X11624500Y13245467D01*
X11744461D02*
X11764454Y13265462D01*
X11804441D01*
X11824435Y13245467D01*
Y13165492D01*
X11804441Y13145499D01*
X11764454D01*
X11744461Y13165492D01*
Y13245467D01*
X11644500Y14420500D02*
X11684487D01*
X11664493D01*
Y14540462D01*
X11644500Y14520468D01*
X11824442Y14540462D02*
X11744467D01*
Y14480479D01*
X11784454Y14500475D01*
X11804448D01*
X11824442Y14480479D01*
Y14440492D01*
X11804448Y14420500D01*
X11764461D01*
X11744467Y14440492D01*
X11784499Y17966499D02*
X11824486D01*
X11804493D01*
Y18086461D01*
X11784499Y18066467D01*
D28*
X48807553Y11371971D02*
X48812390Y11381646D01*
X48826901Y11396157D01*
X48725323D01*
X49291721Y17883154D02*
Y17834785D01*
X49248187Y17829948D01*
X49253024Y17834785D01*
X49257861Y17849297D01*
Y17863808D01*
X49253024Y17878319D01*
X49243350Y17887993D01*
X49228839Y17892830D01*
X49219165D01*
X49204654Y17887993D01*
X49194980Y17878319D01*
X49190143Y17863808D01*
Y17849297D01*
X49194980Y17834785D01*
X49199817Y17829948D01*
X49209491Y17825111D01*
X49291721Y17944586D02*
X49286884Y17930075D01*
X49272372Y17920401D01*
X49248187Y17915564D01*
X49233676D01*
X49209491Y17920401D01*
X49194980Y17930075D01*
X49190143Y17944586D01*
Y17954260D01*
X49194980Y17968771D01*
X49209491Y17978445D01*
X49233676Y17983282D01*
X49248187D01*
X49272372Y17978445D01*
X49286884Y17968771D01*
X49291721Y17954260D01*
Y17944586D01*
D29*
X47369101Y13163229D02*
X47359427Y13168066D01*
X47344916Y13182578D01*
Y13081000D01*
X47386761Y12523393D02*
Y12528229D01*
X47381927Y12537904D01*
X47377090Y12542741D01*
X47367416Y12547578D01*
X47348065D01*
X47338391Y12542741D01*
X47333554Y12537904D01*
X47328717Y12528229D01*
Y12518555D01*
X47333554Y12508881D01*
X47343228Y12494370D01*
X47391599Y12445999D01*
X47323880D01*
D33*
X47342117Y8570403D02*
G03*
X47171283Y8570403I-85418J-106603D01*
G01*
X47346701Y8583800D02*
G03*
X47166699Y8583800I-90000J-120000D01*
G01*
X47306699Y8876250D02*
G03*
X47306699Y8751350I-50000J-62450D01*
G01*
X47316699Y9080800D02*
G03*
X47296701Y9060800I0J-20000D01*
G01*
X47216699D02*
G03*
X47196701Y9080800I-20000J0D01*
G01*
X46992117Y8570403D02*
G03*
X46821283Y8570403I-85418J-106603D01*
G01*
X46996701Y8583800D02*
G03*
X46816699Y8583800I-90000J-120000D01*
G01*
X46966699Y9080800D02*
G03*
X46946701Y9060800I0J-20000D01*
G01*
X46866699D02*
G03*
X46846701Y9080800I-20000J0D01*
G01*
X46986700Y8813800D02*
G03*
X46986700Y8813800I-80000J0D01*
G01*
X49119022Y18597000D02*
G03*
X49119022Y18597000I-127000J0D01*
G01*
Y10710300D02*
G03*
X49119022Y10710300I-127000J0D01*
G01*
X45169901Y9597000D02*
G03*
X45169901Y9597000I-250000J0D01*
G01*
X44990891Y9673259D02*
G03*
X45021436Y9620353I40237J-12040D01*
G01*
X44891074Y9694893D02*
G03*
X44950443Y9696612I28826J30545D01*
G01*
X44990891Y9673259D02*
G03*
X44950443Y9696611I-22993J6880D01*
G01*
X44891074Y9694893D02*
G03*
X44848907Y9673259I-19035J-14809D01*
G01*
X44820709Y9620982D02*
G03*
X44848907Y9673259I-12040J40237D01*
G01*
X44817764Y9620203D02*
G03*
X44818362Y9573648I6136J-23202D01*
G01*
X44849536Y9523090D02*
G03*
X44818362Y9573648I-40866J9692D01*
G01*
X44849536Y9523090D02*
G03*
X44889355Y9497389I22342J-9081D01*
G01*
X44948724Y9499108D02*
G03*
X44889355Y9497389I-28826J-30545D01*
G01*
X44948724Y9499108D02*
G03*
X44990891Y9520742I19035J14809D01*
G01*
X45021436Y9573648D02*
G03*
X44990891Y9520742I9692J-40866D01*
G01*
X45021436Y9573648D02*
G03*
X45021436Y9620353I-5538J23352D01*
G01*
X45044901Y9597000D02*
G03*
X45044901Y9597000I-125000J0D01*
G01*
X45159525D02*
G03*
X45159525Y9597000I-239626J0D01*
G01*
X45178021Y18597005D02*
G03*
X45178021Y18597005I-250000J0D01*
G01*
X44999014Y18673264D02*
G03*
X45029559Y18620358I40237J-12040D01*
G01*
X44899194Y18694897D02*
G03*
X44958566Y18696616I28826J30545D01*
G01*
X44999011Y18673264D02*
G03*
X44958566Y18696616I-22993J6880D01*
G01*
X44899194Y18694897D02*
G03*
X44857028Y18673264I-19035J-14809D01*
G01*
X44828830Y18620987D02*
G03*
X44857028Y18673264I-12040J40237D01*
G01*
X44825882Y18620209D02*
G03*
X44826480Y18573653I6136J-23202D01*
G01*
X44857657Y18523096D02*
G03*
X44826480Y18573653I-40866J9692D01*
G01*
X44857657Y18523096D02*
G03*
X44897473Y18497394I22342J-9081D01*
G01*
X44956845Y18499113D02*
G03*
X44897473Y18497394I-28826J-30545D01*
G01*
X44956845Y18499113D02*
G03*
X44999014Y18520747I19035J14809D01*
G01*
X45029559Y18573653D02*
G03*
X44999014Y18520747I9692J-40866D01*
G01*
X45029559Y18573653D02*
G03*
X45029559Y18620357I-5538J23352D01*
G01*
X45053021Y18597005D02*
G03*
X45053021Y18597005I-125000J0D01*
G01*
X45167645D02*
G03*
X45167645Y18597005I-239626J0D01*
G01*
X41114017Y9597000D02*
G03*
X41114017Y9597000I-250000J0D01*
G01*
X40935010Y9673259D02*
G03*
X40965555Y9620353I40237J-12040D01*
G01*
X40835190Y9694892D02*
G03*
X40894562Y9696611I28826J30545D01*
G01*
X40935010Y9673259D02*
G03*
X40894562Y9696611I-22993J6880D01*
G01*
X40835190Y9694892D02*
G03*
X40793024Y9673259I-19035J-14809D01*
G01*
X40764828Y9620982D02*
G03*
X40793024Y9673259I-12040J40237D01*
G01*
X40761880Y9620203D02*
G03*
X40762479Y9573648I6136J-23202D01*
G01*
X40793655Y9523089D02*
G03*
X40762479Y9573648I-40866J9692D01*
G01*
X40793655Y9523090D02*
G03*
X40833472Y9497389I22342J-9081D01*
G01*
X40892844Y9499108D02*
G03*
X40833472Y9497389I-28826J-30545D01*
G01*
X40892844Y9499108D02*
G03*
X40935010Y9520741I19035J14809D01*
G01*
X40965555Y9573648D02*
G03*
X40935010Y9520741I9692J-40866D01*
G01*
X40965555Y9573648D02*
G03*
X40965555Y9620352I-5538J23352D01*
G01*
X40989017Y9597000D02*
G03*
X40989017Y9597000I-125000J0D01*
G01*
X41103644D02*
G03*
X41103644Y9597000I-239626J0D01*
G01*
X41114017Y18597005D02*
G03*
X41114017Y18597005I-250000J0D01*
G01*
X40935010Y18673264D02*
G03*
X40965555Y18620358I40237J-12040D01*
G01*
X40835190Y18694897D02*
G03*
X40894562Y18696616I28826J30545D01*
G01*
X40935010Y18673264D02*
G03*
X40894562Y18696616I-22993J6880D01*
G01*
X40835190Y18694897D02*
G03*
X40793024Y18673264I-19035J-14809D01*
G01*
X40764828Y18620987D02*
G03*
X40793024Y18673264I-12040J40237D01*
G01*
X40761880Y18620209D02*
G03*
X40762479Y18573653I6136J-23202D01*
G01*
X40793655Y18523096D02*
G03*
X40762479Y18573653I-40866J9692D01*
G01*
X40793655Y18523096D02*
G03*
X40833472Y18497394I22342J-9081D01*
G01*
X40892844Y18499113D02*
G03*
X40833472Y18497394I-28826J-30545D01*
G01*
X40892844Y18499113D02*
G03*
X40935010Y18520747I19035J14809D01*
G01*
X40965555Y18573653D02*
G03*
X40935010Y18520747I9692J-40866D01*
G01*
X40965555Y18573653D02*
G03*
X40965555Y18620357I-5538J23352D01*
G01*
X40989017Y18597005D02*
G03*
X40989017Y18597005I-125000J0D01*
G01*
X41103644D02*
G03*
X41103644Y18597005I-239626J0D01*
G01*
X45054898Y9601200D02*
G03*
X45054898Y9601200I-135000J0D01*
G01*
X45169901D02*
G03*
X45169901Y9601200I-250000J0D01*
G01*
X45063019Y18597000D02*
G03*
X45063019Y18597000I-135000J0D01*
G01*
X45178021D02*
G03*
X45178021Y18597000I-250000J0D01*
G01*
X40999017Y9596996D02*
G03*
X40999017Y9596996I-135000J0D01*
G01*
X41114017D02*
G03*
X41114017Y9596996I-250000J0D01*
G01*
X40999017Y18597000D02*
G03*
X40999017Y18597000I-135000J0D01*
G01*
X41114017D02*
G03*
X41114017Y18597000I-250000J0D01*
G01*
X45070520Y9596995D02*
G03*
X45070520Y9596995I-142500J0D01*
G01*
Y18597000D02*
G03*
X45070520Y18597000I-142500J0D01*
G01*
X44433020Y9456995D02*
G03*
X44533020Y9356995I100000J0D01*
G01*
X45383020Y9356996D02*
G03*
X45483020Y9456996I0J100000D01*
G01*
X44533020Y18837001D02*
G03*
X44433020Y18737001I0J-100000D01*
G01*
X45483020D02*
G03*
X45383020Y18837001I-100000J0D01*
G01*
X41006519Y9596995D02*
G03*
X41006519Y9596995I-142500J0D01*
G01*
Y18597000D02*
G03*
X41006519Y18597000I-142500J0D01*
G01*
X40369016Y9456995D02*
G03*
X40469016Y9356995I100000J0D01*
G01*
X41319019Y9356996D02*
G03*
X41419019Y9456996I0J100000D01*
G01*
X40469019Y18837001D02*
G03*
X40369019Y18737001I0J-100000D01*
G01*
X41419019D02*
G03*
X41319019Y18837001I-100000J0D01*
G01*
X46901099Y10458449D02*
G03*
X46901099Y9861551I0J-298449D01*
G01*
Y10420350D02*
G03*
X46901099Y9899649I0J-260350D01*
G01*
Y11093449D02*
G03*
X46901099Y10496551I0J-298449D01*
G01*
Y11055351D02*
G03*
X46901099Y10534650I0J-260350D01*
G01*
Y12807948D02*
G03*
X46901099Y12211051I0J-298449D01*
G01*
Y12769850D02*
G03*
X46901099Y12249149I0J-260350D01*
G01*
Y13442949D02*
G03*
X46901099Y12846051I0J-298449D01*
G01*
Y13404851D02*
G03*
X46901099Y12884151I0J-260350D01*
G01*
X8907000Y18737000D02*
G03*
X8807000Y18837000I-100000J0D01*
G01*
X7957000D02*
G03*
X7857000Y18737000I0J-100000D01*
G01*
X8807000Y9356995D02*
G03*
X8907000Y9456995I0J100000D01*
G01*
X7857000Y9456995D02*
G03*
X7957000Y9356995I100000J0D01*
G01*
X8494500Y18597000D02*
G03*
X8494500Y18597000I-142500J0D01*
G01*
Y9596995D02*
G03*
X8494500Y9596995I-142500J0D01*
G01*
X37354999Y18737000D02*
G03*
X37254999Y18837000I-100000J0D01*
G01*
X36404999D02*
G03*
X36304999Y18737000I0J-100000D01*
G01*
X37254999Y9356995D02*
G03*
X37354999Y9456995I0J100000D01*
G01*
X36304999Y9456995D02*
G03*
X36404999Y9356995I100000J0D01*
G01*
X36942499Y18597000D02*
G03*
X36942499Y18597000I-142500J0D01*
G01*
Y9596995D02*
G03*
X36942499Y9596995I-142500J0D01*
G01*
X33291000Y18737000D02*
G03*
X33191000Y18837000I-100000J0D01*
G01*
X32341000D02*
G03*
X32241000Y18737000I0J-100000D01*
G01*
X33191000Y9356995D02*
G03*
X33291000Y9456995I0J100000D01*
G01*
X32241000Y9456995D02*
G03*
X32341000Y9356995I100000J0D01*
G01*
X32878500Y18597000D02*
G03*
X32878500Y18597000I-142500J0D01*
G01*
Y9596995D02*
G03*
X32878500Y9596995I-142500J0D01*
G01*
X29226999Y18737000D02*
G03*
X29126999Y18837000I-100000J0D01*
G01*
X28276999D02*
G03*
X28176999Y18737000I0J-100000D01*
G01*
X29126999Y9356995D02*
G03*
X29226999Y9456995I0J100000D01*
G01*
X28176999Y9456995D02*
G03*
X28276999Y9356995I100000J0D01*
G01*
X28814499Y18597000D02*
G03*
X28814499Y18597000I-142500J0D01*
G01*
Y9596995D02*
G03*
X28814499Y9596995I-142500J0D01*
G01*
X25163000Y18737000D02*
G03*
X25063000Y18837000I-100000J0D01*
G01*
X24213000D02*
G03*
X24113000Y18737000I0J-100000D01*
G01*
X25063000Y9356995D02*
G03*
X25163000Y9456995I0J100000D01*
G01*
X24113000Y9456995D02*
G03*
X24213000Y9356995I100000J0D01*
G01*
X24750500Y18597000D02*
G03*
X24750500Y18597000I-142500J0D01*
G01*
Y9596995D02*
G03*
X24750500Y9596995I-142500J0D01*
G01*
X21099001Y18737000D02*
G03*
X20999001Y18837000I-100000J0D01*
G01*
X20149001D02*
G03*
X20049001Y18737000I0J-100000D01*
G01*
X20999001Y9356995D02*
G03*
X21099001Y9456995I0J100000D01*
G01*
X20049001Y9456995D02*
G03*
X20149001Y9356995I100000J0D01*
G01*
X20686501Y18597000D02*
G03*
X20686501Y18597000I-142500J0D01*
G01*
Y9596995D02*
G03*
X20686501Y9596995I-142500J0D01*
G01*
X17035001Y18737000D02*
G03*
X16935001Y18837000I-100000J0D01*
G01*
X16085001D02*
G03*
X15985001Y18737000I0J-100000D01*
G01*
X16935001Y9356995D02*
G03*
X17035001Y9456995I0J100000D01*
G01*
X15985001Y9456995D02*
G03*
X16085001Y9356995I100000J0D01*
G01*
X16622501Y18597000D02*
G03*
X16622501Y18597000I-142500J0D01*
G01*
Y9596995D02*
G03*
X16622501Y9596995I-142500J0D01*
G01*
X12971001Y18737000D02*
G03*
X12871001Y18837000I-100000J0D01*
G01*
X12021000D02*
G03*
X11921000Y18737000I0J-100000D01*
G01*
X12871001Y9356995D02*
G03*
X12971001Y9456995I0J100000D01*
G01*
X11921000Y9456995D02*
G03*
X12021000Y9356995I100000J0D01*
G01*
X12558500Y18597000D02*
G03*
X12558500Y18597000I-142500J0D01*
G01*
Y9596995D02*
G03*
X12558500Y9596995I-142500J0D01*
G01*
X8602000Y18597000D02*
G03*
X8602000Y18597000I-250000J0D01*
G01*
X8477000D02*
G03*
X8477000Y18597000I-125000J0D01*
G01*
X8452650D02*
G03*
X8452650Y18597000I-100650J0D01*
G01*
X8602000Y9596995D02*
G03*
X8602000Y9596995I-250000J0D01*
G01*
X8477000D02*
G03*
X8477000Y9596995I-125000J0D01*
G01*
X8452650D02*
G03*
X8452650Y9596995I-100650J0D01*
G01*
X12666000Y18597000D02*
G03*
X12666000Y18597000I-250000J0D01*
G01*
X12541000D02*
G03*
X12541000Y18597000I-125000J0D01*
G01*
X12516650D02*
G03*
X12516650Y18597000I-100650J0D01*
G01*
X12666000Y9597000D02*
G03*
X12666000Y9597000I-250000J0D01*
G01*
X12541000D02*
G03*
X12541000Y9597000I-125000J0D01*
G01*
X12516650D02*
G03*
X12516650Y9597000I-100650J0D01*
G01*
X16730000Y18597005D02*
G03*
X16730000Y18597005I-250000J0D01*
G01*
X16605000D02*
G03*
X16605000Y18597005I-125000J0D01*
G01*
X16580650D02*
G03*
X16580650Y18597005I-100650J0D01*
G01*
X16730000Y9597000D02*
G03*
X16730000Y9597000I-250000J0D01*
G01*
X16605000D02*
G03*
X16605000Y9597000I-125000J0D01*
G01*
X16580650D02*
G03*
X16580650Y9597000I-100650J0D01*
G01*
X20794000Y18597005D02*
G03*
X20794000Y18597005I-250000J0D01*
G01*
X20669000D02*
G03*
X20669000Y18597005I-125000J0D01*
G01*
X20644650D02*
G03*
X20644650Y18597005I-100650J0D01*
G01*
X20794000Y9596995D02*
G03*
X20794000Y9596995I-250000J0D01*
G01*
X20669000D02*
G03*
X20669000Y9596995I-125000J0D01*
G01*
X20644650D02*
G03*
X20644650Y9596995I-100650J0D01*
G01*
X24858000Y18597005D02*
G03*
X24858000Y18597005I-250000J0D01*
G01*
X24733000D02*
G03*
X24733000Y18597005I-125000J0D01*
G01*
X24708650D02*
G03*
X24708650Y18597005I-100650J0D01*
G01*
X24858009Y9596996D02*
G03*
X24858009Y9596996I-250000J0D01*
G01*
X24733009D02*
G03*
X24733009Y9596996I-125000J0D01*
G01*
X24708659D02*
G03*
X24708659Y9596996I-100650J0D01*
G01*
X28922000Y18597000D02*
G03*
X28922000Y18597000I-250000J0D01*
G01*
X28797000D02*
G03*
X28797000Y18597000I-125000J0D01*
G01*
X28772650D02*
G03*
X28772650Y18597000I-100650J0D01*
G01*
X28922000Y9596995D02*
G03*
X28922000Y9596995I-250000J0D01*
G01*
X28797000D02*
G03*
X28797000Y9596995I-125000J0D01*
G01*
X28772650D02*
G03*
X28772650Y9596995I-100650J0D01*
G01*
X32985999Y18597005D02*
G03*
X32985999Y18597005I-250000J0D01*
G01*
X32860999D02*
G03*
X32860999Y18597005I-125000J0D01*
G01*
X32836649D02*
G03*
X32836649Y18597005I-100650J0D01*
G01*
X32985999Y9597000D02*
G03*
X32985999Y9597000I-250000J0D01*
G01*
X32860999D02*
G03*
X32860999Y9597000I-125000J0D01*
G01*
X32836649D02*
G03*
X32836649Y9597000I-100650J0D01*
G01*
X37050000Y18597005D02*
G03*
X37050000Y18597005I-250000J0D01*
G01*
X36925000D02*
G03*
X36925000Y18597005I-125000J0D01*
G01*
X36900650D02*
G03*
X36900650Y18597005I-100650J0D01*
G01*
X37050000Y9597000D02*
G03*
X37050000Y9597000I-250000J0D01*
G01*
X36925000D02*
G03*
X36925000Y9597000I-125000J0D01*
G01*
X36900650D02*
G03*
X36900650Y9597000I-100650J0D01*
G01*
X8591626Y18596996D02*
G03*
X8591626Y18596996I-239626J0D01*
G01*
X8477000D02*
G03*
X8477000Y18596996I-125000J0D01*
G01*
X8250462Y18620348D02*
G03*
X8250462Y18573643I5538J-23352D01*
G01*
Y18620348D02*
G03*
X8281007Y18673254I-9692J40866D01*
G01*
X8323174Y18694888D02*
G03*
X8281007Y18673254I-19035J-14809D01*
G01*
X8323174Y18694888D02*
G03*
X8382545Y18696606I28826J30545D01*
G01*
X8422364Y18670906D02*
G03*
X8382545Y18696606I-22342J9081D01*
G01*
X8422364Y18670906D02*
G03*
X8453538Y18620348I40866J-9692D01*
G01*
X8454136Y18573793D02*
G03*
X8453538Y18620348I-6136J23202D01*
G01*
X8451190Y18573013D02*
G03*
X8422993Y18520737I12040J-40237D01*
G01*
X8380827Y18499103D02*
G03*
X8422993Y18520737I19035J14809D01*
G01*
X8281008D02*
G03*
X8321455Y18497385I22993J-6880D01*
G01*
X8380827Y18499103D02*
G03*
X8321455Y18497385I-28826J-30545D01*
G01*
X8281007Y18520737D02*
G03*
X8250462Y18573643I-40237J12040D01*
G01*
X8602000Y18596996D02*
G03*
X8602000Y18596996I-250000J0D01*
G01*
X8591626Y9596990D02*
G03*
X8591626Y9596990I-239626J0D01*
G01*
X8477000D02*
G03*
X8477000Y9596990I-125000J0D01*
G01*
X8250462Y9620342D02*
G03*
X8250462Y9573638I5538J-23352D01*
G01*
Y9620343D02*
G03*
X8281007Y9673249I-9692J40866D01*
G01*
X8323174Y9694883D02*
G03*
X8281007Y9673249I-19035J-14809D01*
G01*
X8323174Y9694883D02*
G03*
X8382545Y9696601I28826J30545D01*
G01*
X8422364Y9670901D02*
G03*
X8382545Y9696601I-22342J9081D01*
G01*
X8422364Y9670901D02*
G03*
X8453538Y9620343I40866J-9692D01*
G01*
X8454136Y9573788D02*
G03*
X8453538Y9620342I-6136J23202D01*
G01*
X8451190Y9573009D02*
G03*
X8422993Y9520732I12040J-40237D01*
G01*
X8380827Y9499098D02*
G03*
X8422993Y9520732I19035J14809D01*
G01*
X8281008D02*
G03*
X8321455Y9497379I22993J-6880D01*
G01*
X8380827Y9499098D02*
G03*
X8321455Y9497379I-28826J-30545D01*
G01*
X8281007Y9520732D02*
G03*
X8250462Y9573638I-40237J12040D01*
G01*
X8602000Y9596990D02*
G03*
X8602000Y9596990I-250000J0D01*
G01*
X12655626Y18596996D02*
G03*
X12655626Y18596996I-239626J0D01*
G01*
X12541000D02*
G03*
X12541000Y18596996I-125000J0D01*
G01*
X12314462Y18620348D02*
G03*
X12314462Y18573643I5538J-23352D01*
G01*
Y18620348D02*
G03*
X12345007Y18673254I-9692J40866D01*
G01*
X12387174Y18694888D02*
G03*
X12345007Y18673254I-19035J-14809D01*
G01*
X12387174Y18694888D02*
G03*
X12446545Y18696606I28826J30545D01*
G01*
X12486364Y18670906D02*
G03*
X12446545Y18696606I-22342J9081D01*
G01*
X12486364Y18670906D02*
G03*
X12517538Y18620348I40866J-9692D01*
G01*
X12518136Y18573793D02*
G03*
X12517538Y18620348I-6136J23202D01*
G01*
X12515190Y18573013D02*
G03*
X12486993Y18520737I12040J-40237D01*
G01*
X12444827Y18499103D02*
G03*
X12486993Y18520737I19035J14809D01*
G01*
X12345008D02*
G03*
X12385455Y18497385I22993J-6880D01*
G01*
X12444827Y18499103D02*
G03*
X12385455Y18497385I-28826J-30545D01*
G01*
X12345007Y18520737D02*
G03*
X12314462Y18573643I-40237J12040D01*
G01*
X12666000Y18596996D02*
G03*
X12666000Y18596996I-250000J0D01*
G01*
X12655626Y9596995D02*
G03*
X12655626Y9596995I-239626J0D01*
G01*
X12541000D02*
G03*
X12541000Y9596995I-125000J0D01*
G01*
X12314462Y9620347D02*
G03*
X12314462Y9573643I5538J-23352D01*
G01*
Y9620348D02*
G03*
X12345007Y9673254I-9692J40866D01*
G01*
X12387174Y9694887D02*
G03*
X12345007Y9673254I-19035J-14809D01*
G01*
X12387174Y9694887D02*
G03*
X12446545Y9696606I28826J30545D01*
G01*
X12486364Y9670905D02*
G03*
X12446545Y9696606I-22342J9081D01*
G01*
X12486364Y9670906D02*
G03*
X12517538Y9620348I40866J-9692D01*
G01*
X12518136Y9573793D02*
G03*
X12517538Y9620347I-6136J23202D01*
G01*
X12515190Y9573013D02*
G03*
X12486993Y9520736I12040J-40237D01*
G01*
X12444827Y9499103D02*
G03*
X12486993Y9520736I19035J14809D01*
G01*
X12345008D02*
G03*
X12385455Y9497384I22993J-6880D01*
G01*
X12444827Y9499103D02*
G03*
X12385455Y9497384I-28826J-30545D01*
G01*
X12345007Y9520736D02*
G03*
X12314462Y9573643I-40237J12040D01*
G01*
X12666000Y9596995D02*
G03*
X12666000Y9596995I-250000J0D01*
G01*
X16719626Y18597000D02*
G03*
X16719626Y18597000I-239626J0D01*
G01*
X16605000D02*
G03*
X16605000Y18597000I-125000J0D01*
G01*
X16378462Y18620352D02*
G03*
X16378462Y18573648I5538J-23352D01*
G01*
Y18620354D02*
G03*
X16409007Y18673259I-9692J40866D01*
G01*
X16451173Y18694893D02*
G03*
X16409007Y18673259I-19035J-14809D01*
G01*
X16451173Y18694893D02*
G03*
X16510545Y18696611I28826J30545D01*
G01*
X16550365Y18670911D02*
G03*
X16510545Y18696611I-22342J9081D01*
G01*
X16550365Y18670911D02*
G03*
X16581538Y18620354I40866J-9692D01*
G01*
X16582137Y18573798D02*
G03*
X16581538Y18620352I-6136J23202D01*
G01*
X16579190Y18573018D02*
G03*
X16550993Y18520741I12040J-40237D01*
G01*
X16508827Y18499107D02*
G03*
X16550993Y18520741I19035J14809D01*
G01*
X16409007D02*
G03*
X16449455Y18497389I22993J-6880D01*
G01*
X16508827Y18499107D02*
G03*
X16449455Y18497389I-28826J-30545D01*
G01*
X16409007Y18520741D02*
G03*
X16378462Y18573648I-40237J12040D01*
G01*
X16730000Y18597000D02*
G03*
X16730000Y18597000I-250000J0D01*
G01*
X16719626Y9596995D02*
G03*
X16719626Y9596995I-239626J0D01*
G01*
X16605000D02*
G03*
X16605000Y9596995I-125000J0D01*
G01*
X16378462Y9620347D02*
G03*
X16378462Y9573643I5538J-23352D01*
G01*
Y9620348D02*
G03*
X16409007Y9673254I-9692J40866D01*
G01*
X16451173Y9694887D02*
G03*
X16409007Y9673254I-19035J-14809D01*
G01*
X16451173Y9694887D02*
G03*
X16510545Y9696606I28826J30545D01*
G01*
X16550365Y9670905D02*
G03*
X16510545Y9696606I-22342J9081D01*
G01*
X16550365Y9670906D02*
G03*
X16581538Y9620348I40866J-9692D01*
G01*
X16582137Y9573793D02*
G03*
X16581538Y9620347I-6136J23202D01*
G01*
X16579190Y9573013D02*
G03*
X16550993Y9520736I12040J-40237D01*
G01*
X16508827Y9499103D02*
G03*
X16550993Y9520736I19035J14809D01*
G01*
X16409007D02*
G03*
X16449455Y9497384I22993J-6880D01*
G01*
X16508827Y9499103D02*
G03*
X16449455Y9497384I-28826J-30545D01*
G01*
X16409007Y9520736D02*
G03*
X16378462Y9573643I-40237J12040D01*
G01*
X16730000Y9596995D02*
G03*
X16730000Y9596995I-250000J0D01*
G01*
X20783626Y18597000D02*
G03*
X20783626Y18597000I-239626J0D01*
G01*
X20669000D02*
G03*
X20669000Y18597000I-125000J0D01*
G01*
X20442462Y18620352D02*
G03*
X20442462Y18573648I5538J-23352D01*
G01*
Y18620354D02*
G03*
X20473007Y18673259I-9692J40866D01*
G01*
X20515173Y18694893D02*
G03*
X20473007Y18673259I-19035J-14809D01*
G01*
X20515173Y18694893D02*
G03*
X20574545Y18696611I28826J30545D01*
G01*
X20614365Y18670911D02*
G03*
X20574545Y18696611I-22342J9081D01*
G01*
X20614365Y18670911D02*
G03*
X20645538Y18620354I40866J-9692D01*
G01*
X20646136Y18573798D02*
G03*
X20645538Y18620352I-6136J23202D01*
G01*
X20643190Y18573018D02*
G03*
X20614993Y18520741I12040J-40237D01*
G01*
X20572827Y18499107D02*
G03*
X20614993Y18520741I19035J14809D01*
G01*
X20473009D02*
G03*
X20513455Y18497389I22993J-6880D01*
G01*
X20572827Y18499107D02*
G03*
X20513455Y18497389I-28826J-30545D01*
G01*
X20473007Y18520741D02*
G03*
X20442462Y18573648I-40237J12040D01*
G01*
X20794000Y18597000D02*
G03*
X20794000Y18597000I-250000J0D01*
G01*
X20783626Y9596990D02*
G03*
X20783626Y9596990I-239626J0D01*
G01*
X20669000D02*
G03*
X20669000Y9596990I-125000J0D01*
G01*
X20442462Y9620342D02*
G03*
X20442462Y9573638I5538J-23352D01*
G01*
Y9620343D02*
G03*
X20473007Y9673249I-9692J40866D01*
G01*
X20515173Y9694883D02*
G03*
X20473007Y9673249I-19035J-14809D01*
G01*
X20515173Y9694883D02*
G03*
X20574545Y9696601I28826J30545D01*
G01*
X20614365Y9670901D02*
G03*
X20574545Y9696601I-22342J9081D01*
G01*
X20614365Y9670901D02*
G03*
X20645538Y9620343I40866J-9692D01*
G01*
X20646136Y9573788D02*
G03*
X20645538Y9620342I-6136J23202D01*
G01*
X20643190Y9573009D02*
G03*
X20614993Y9520732I12040J-40237D01*
G01*
X20572827Y9499098D02*
G03*
X20614993Y9520732I19035J14809D01*
G01*
X20473009D02*
G03*
X20513455Y9497379I22993J-6880D01*
G01*
X20572827Y9499098D02*
G03*
X20513455Y9497379I-28826J-30545D01*
G01*
X20473007Y9520732D02*
G03*
X20442462Y9573638I-40237J12040D01*
G01*
X20794000Y9596990D02*
G03*
X20794000Y9596990I-250000J0D01*
G01*
X24847626Y18597000D02*
G03*
X24847626Y18597000I-239626J0D01*
G01*
X24733000D02*
G03*
X24733000Y18597000I-125000J0D01*
G01*
X24506462Y18620352D02*
G03*
X24506462Y18573648I5538J-23352D01*
G01*
Y18620354D02*
G03*
X24537007Y18673259I-9692J40866D01*
G01*
X24579173Y18694893D02*
G03*
X24537007Y18673259I-19035J-14809D01*
G01*
X24579173Y18694893D02*
G03*
X24638545Y18696611I28826J30545D01*
G01*
X24678365Y18670911D02*
G03*
X24638545Y18696611I-22342J9081D01*
G01*
X24678365Y18670911D02*
G03*
X24709538Y18620354I40866J-9692D01*
G01*
X24710136Y18573798D02*
G03*
X24709538Y18620352I-6136J23202D01*
G01*
X24707190Y18573018D02*
G03*
X24678993Y18520741I12040J-40237D01*
G01*
X24636827Y18499107D02*
G03*
X24678993Y18520741I19035J14809D01*
G01*
X24537009D02*
G03*
X24577455Y18497389I22993J-6880D01*
G01*
X24636827Y18499107D02*
G03*
X24577455Y18497389I-28826J-30545D01*
G01*
X24537007Y18520741D02*
G03*
X24506462Y18573648I-40237J12040D01*
G01*
X24858000Y18597000D02*
G03*
X24858000Y18597000I-250000J0D01*
G01*
X24847635Y9596991D02*
G03*
X24847635Y9596991I-239626J0D01*
G01*
X24733009D02*
G03*
X24733009Y9596991I-125000J0D01*
G01*
X24506470Y9620343D02*
G03*
X24506470Y9573638I5538J-23352D01*
G01*
Y9620343D02*
G03*
X24537016Y9673249I-9692J40866D01*
G01*
X24579182Y9694883D02*
G03*
X24537016Y9673249I-19035J-14809D01*
G01*
X24579182Y9694883D02*
G03*
X24638554Y9696602I28826J30545D01*
G01*
X24678372Y9670901D02*
G03*
X24638554Y9696602I-22342J9081D01*
G01*
X24678374Y9670901D02*
G03*
X24709547Y9620343I40866J-9692D01*
G01*
X24710146Y9573788D02*
G03*
X24709547Y9620343I-6136J23202D01*
G01*
X24707199Y9573009D02*
G03*
X24679002Y9520732I12040J-40237D01*
G01*
X24636835Y9499098D02*
G03*
X24679002Y9520732I19035J14809D01*
G01*
X24537016D02*
G03*
X24577463Y9497380I22993J-6880D01*
G01*
X24636835Y9499098D02*
G03*
X24577463Y9497380I-28826J-30545D01*
G01*
X24537016Y9520732D02*
G03*
X24506470Y9573638I-40237J12040D01*
G01*
X24858009Y9596991D02*
G03*
X24858009Y9596991I-250000J0D01*
G01*
X28911627Y18596996D02*
G03*
X28911627Y18596996I-239626J0D01*
G01*
X28797000D02*
G03*
X28797000Y18596996I-125000J0D01*
G01*
X28570462Y18620348D02*
G03*
X28570462Y18573643I5538J-23352D01*
G01*
Y18620348D02*
G03*
X28601007Y18673254I-9692J40866D01*
G01*
X28643173Y18694888D02*
G03*
X28601007Y18673254I-19035J-14809D01*
G01*
X28643173Y18694888D02*
G03*
X28702545Y18696606I28826J30545D01*
G01*
X28742365Y18670906D02*
G03*
X28702545Y18696606I-22342J9081D01*
G01*
X28742365Y18670906D02*
G03*
X28773538Y18620348I40866J-9692D01*
G01*
X28774136Y18573793D02*
G03*
X28773538Y18620348I-6136J23202D01*
G01*
X28771191Y18573013D02*
G03*
X28742993Y18520737I12040J-40237D01*
G01*
X28700827Y18499103D02*
G03*
X28742993Y18520737I19035J14809D01*
G01*
X28601007D02*
G03*
X28641455Y18497385I22993J-6880D01*
G01*
X28700827Y18499103D02*
G03*
X28641455Y18497385I-28826J-30545D01*
G01*
X28601007Y18520737D02*
G03*
X28570462Y18573643I-40237J12040D01*
G01*
X28922000Y18596996D02*
G03*
X28922000Y18596996I-250000J0D01*
G01*
X28911627Y9596990D02*
G03*
X28911627Y9596990I-239626J0D01*
G01*
X28797000D02*
G03*
X28797000Y9596990I-125000J0D01*
G01*
X28570462Y9620342D02*
G03*
X28570462Y9573638I5538J-23352D01*
G01*
Y9620343D02*
G03*
X28601007Y9673249I-9692J40866D01*
G01*
X28643173Y9694883D02*
G03*
X28601007Y9673249I-19035J-14809D01*
G01*
X28643173Y9694883D02*
G03*
X28702545Y9696601I28826J30545D01*
G01*
X28742365Y9670901D02*
G03*
X28702545Y9696601I-22342J9081D01*
G01*
X28742365Y9670901D02*
G03*
X28773538Y9620343I40866J-9692D01*
G01*
X28774136Y9573788D02*
G03*
X28773538Y9620342I-6136J23202D01*
G01*
X28771191Y9573009D02*
G03*
X28742993Y9520732I12040J-40237D01*
G01*
X28700827Y9499098D02*
G03*
X28742993Y9520732I19035J14809D01*
G01*
X28601007D02*
G03*
X28641455Y9497379I22993J-6880D01*
G01*
X28700827Y9499098D02*
G03*
X28641455Y9497379I-28826J-30545D01*
G01*
X28601007Y9520732D02*
G03*
X28570462Y9573638I-40237J12040D01*
G01*
X28922000Y9596990D02*
G03*
X28922000Y9596990I-250000J0D01*
G01*
X32975626Y18597000D02*
G03*
X32975626Y18597000I-239626J0D01*
G01*
X32860999D02*
G03*
X32860999Y18597000I-125000J0D01*
G01*
X32634464Y18620352D02*
G03*
X32634464Y18573648I5538J-23352D01*
G01*
Y18620354D02*
G03*
X32665005Y18673259I-9692J40866D01*
G01*
X32707175Y18694893D02*
G03*
X32665005Y18673259I-19035J-14809D01*
G01*
X32707175Y18694893D02*
G03*
X32766544Y18696611I28826J30545D01*
G01*
X32806363Y18670911D02*
G03*
X32766544Y18696611I-22342J9081D01*
G01*
X32806363Y18670911D02*
G03*
X32837537Y18620354I40866J-9692D01*
G01*
X32838135Y18573798D02*
G03*
X32837537Y18620352I-6136J23202D01*
G01*
X32835190Y18573018D02*
G03*
X32806992Y18520741I12040J-40237D01*
G01*
X32764828Y18499107D02*
G03*
X32806992Y18520741I19035J14809D01*
G01*
X32665009D02*
G03*
X32705453Y18497389I22993J-6880D01*
G01*
X32764828Y18499107D02*
G03*
X32705453Y18497389I-28826J-30545D01*
G01*
X32665005Y18520741D02*
G03*
X32634464Y18573648I-40237J12040D01*
G01*
X32985999Y18597000D02*
G03*
X32985999Y18597000I-250000J0D01*
G01*
X32975626Y9596995D02*
G03*
X32975626Y9596995I-239626J0D01*
G01*
X32860999D02*
G03*
X32860999Y9596995I-125000J0D01*
G01*
X32634464Y9620347D02*
G03*
X32634464Y9573643I5538J-23352D01*
G01*
Y9620348D02*
G03*
X32665005Y9673254I-9692J40866D01*
G01*
X32707175Y9694887D02*
G03*
X32665005Y9673254I-19035J-14809D01*
G01*
X32707175Y9694887D02*
G03*
X32766544Y9696606I28826J30545D01*
G01*
X32806363Y9670905D02*
G03*
X32766544Y9696606I-22342J9081D01*
G01*
X32806363Y9670906D02*
G03*
X32837537Y9620348I40866J-9692D01*
G01*
X32838135Y9573793D02*
G03*
X32837537Y9620347I-6136J23202D01*
G01*
X32835190Y9573013D02*
G03*
X32806992Y9520736I12040J-40237D01*
G01*
X32764828Y9499103D02*
G03*
X32806992Y9520736I19035J14809D01*
G01*
X32665009D02*
G03*
X32705453Y9497384I22993J-6880D01*
G01*
X32764828Y9499103D02*
G03*
X32705453Y9497384I-28826J-30545D01*
G01*
X32665005Y9520736D02*
G03*
X32634464Y9573643I-40237J12040D01*
G01*
X32985999Y9596995D02*
G03*
X32985999Y9596995I-250000J0D01*
G01*
X37039627Y18597000D02*
G03*
X37039627Y18597000I-239626J0D01*
G01*
X36925000D02*
G03*
X36925000Y18597000I-125000J0D01*
G01*
X36698462Y18620352D02*
G03*
X36698462Y18573648I5538J-23352D01*
G01*
Y18620354D02*
G03*
X36729007Y18673259I-9692J40866D01*
G01*
X36771173Y18694893D02*
G03*
X36729007Y18673259I-19035J-14809D01*
G01*
X36771173Y18694893D02*
G03*
X36830545Y18696611I28826J30545D01*
G01*
X36870364Y18670911D02*
G03*
X36830545Y18696611I-22342J9081D01*
G01*
X36870364Y18670911D02*
G03*
X36901538Y18620354I40866J-9692D01*
G01*
X36902136Y18573798D02*
G03*
X36901538Y18620352I-6136J23202D01*
G01*
X36899191Y18573018D02*
G03*
X36870993Y18520741I12040J-40237D01*
G01*
X36828827Y18499107D02*
G03*
X36870993Y18520741I19035J14809D01*
G01*
X36729007D02*
G03*
X36769455Y18497389I22993J-6880D01*
G01*
X36828827Y18499107D02*
G03*
X36769455Y18497389I-28826J-30545D01*
G01*
X36729007Y18520741D02*
G03*
X36698462Y18573648I-40237J12040D01*
G01*
X37050000Y18597000D02*
G03*
X37050000Y18597000I-250000J0D01*
G01*
X37039627Y9596995D02*
G03*
X37039627Y9596995I-239626J0D01*
G01*
X36925000D02*
G03*
X36925000Y9596995I-125000J0D01*
G01*
X36698462Y9620347D02*
G03*
X36698462Y9573643I5538J-23352D01*
G01*
Y9620348D02*
G03*
X36729007Y9673254I-9692J40866D01*
G01*
X36771173Y9694887D02*
G03*
X36729007Y9673254I-19035J-14809D01*
G01*
X36771173Y9694887D02*
G03*
X36830545Y9696606I28826J30545D01*
G01*
X36870364Y9670905D02*
G03*
X36830545Y9696606I-22342J9081D01*
G01*
X36870364Y9670906D02*
G03*
X36901538Y9620348I40866J-9692D01*
G01*
X36902136Y9573793D02*
G03*
X36901538Y9620347I-6136J23202D01*
G01*
X36899191Y9573013D02*
G03*
X36870993Y9520736I12040J-40237D01*
G01*
X36828827Y9499103D02*
G03*
X36870993Y9520736I19035J14809D01*
G01*
X36729007D02*
G03*
X36769455Y9497384I22993J-6880D01*
G01*
X36828827Y9499103D02*
G03*
X36769455Y9497384I-28826J-30545D01*
G01*
X36729007Y9520736D02*
G03*
X36698462Y9573643I-40237J12040D01*
G01*
X37050000Y9596995D02*
G03*
X37050000Y9596995I-250000J0D01*
G01*
X8602000Y18597000D02*
G03*
X8602000Y18597000I-250000J0D01*
G01*
X8487000D02*
G03*
X8487000Y18597000I-135000J0D01*
G01*
X8602000Y9596995D02*
G03*
X8602000Y9596995I-250000J0D01*
G01*
X8487000D02*
G03*
X8487000Y9596995I-135000J0D01*
G01*
X12666000Y18597000D02*
G03*
X12666000Y18597000I-250000J0D01*
G01*
X12551000D02*
G03*
X12551000Y18597000I-135000J0D01*
G01*
X12666000Y9597000D02*
G03*
X12666000Y9597000I-250000J0D01*
G01*
X12551000D02*
G03*
X12551000Y9597000I-135000J0D01*
G01*
X16730000Y18597005D02*
G03*
X16730000Y18597005I-250000J0D01*
G01*
X16614999D02*
G03*
X16614999Y18597005I-135000J0D01*
G01*
X16730000Y9597000D02*
G03*
X16730000Y9597000I-250000J0D01*
G01*
X16614999D02*
G03*
X16614999Y9597000I-135000J0D01*
G01*
X20794000Y18597005D02*
G03*
X20794000Y18597005I-250000J0D01*
G01*
X20678999D02*
G03*
X20678999Y18597005I-135000J0D01*
G01*
X20794000Y9596995D02*
G03*
X20794000Y9596995I-250000J0D01*
G01*
X20678999D02*
G03*
X20678999Y9596995I-135000J0D01*
G01*
X24858000Y18597005D02*
G03*
X24858000Y18597005I-250000J0D01*
G01*
X24742999D02*
G03*
X24742999Y18597005I-135000J0D01*
G01*
X24858009Y9596996D02*
G03*
X24858009Y9596996I-250000J0D01*
G01*
X24743008D02*
G03*
X24743008Y9596996I-135000J0D01*
G01*
X28922000Y18597000D02*
G03*
X28922000Y18597000I-250000J0D01*
G01*
X28807001D02*
G03*
X28807001Y18597000I-135000J0D01*
G01*
X28922000Y9596995D02*
G03*
X28922000Y9596995I-250000J0D01*
G01*
X28807001D02*
G03*
X28807001Y9596995I-135000J0D01*
G01*
X32985999Y18597005D02*
G03*
X32985999Y18597005I-250000J0D01*
G01*
X32870999D02*
G03*
X32870999Y18597005I-135000J0D01*
G01*
X32985999Y9597000D02*
G03*
X32985999Y9597000I-250000J0D01*
G01*
X32870999D02*
G03*
X32870999Y9597000I-135000J0D01*
G01*
X37050000Y18597005D02*
G03*
X37050000Y18597005I-250000J0D01*
G01*
X36935001D02*
G03*
X36935001Y18597005I-135000J0D01*
G01*
X37050000Y9597000D02*
G03*
X37050000Y9597000I-250000J0D01*
G01*
X36935001D02*
G03*
X36935001Y9597000I-135000J0D01*
G01*
X47563501Y9972000D02*
Y10602000D01*
Y9972000D02*
X47813501D01*
Y10602000D01*
X47563501D02*
X47813501D01*
X47688501Y9892000D02*
Y9972000D01*
Y10602000D02*
Y10682000D01*
X46216699Y9238800D02*
X47946701D01*
X46216699Y8513800D02*
Y9238800D01*
Y8513800D02*
X47946701D01*
Y9238800D01*
X47107700Y9148800D02*
X47405701D01*
X47107700D02*
X47131201Y9080800D01*
X47382199D01*
X47405701Y9148800D01*
X47296701Y9013800D02*
Y9060800D01*
Y9013800D02*
X47411700D01*
X47296701Y9027198D02*
X47411700D01*
Y8570402D02*
Y9027198D01*
X47342117Y8570402D02*
X47411700D01*
X47342117D02*
X47346701Y8583800D01*
X47411700D01*
X47166699D02*
X47171283Y8570402D01*
X47101700D02*
X47171283D01*
X47101700D02*
Y9027198D01*
Y8583800D02*
X47166699D01*
X47101700Y9027198D02*
X47216699D01*
X47101700Y9013800D02*
X47216699D01*
Y8853800D02*
X47296701D01*
X47216699Y8773800D02*
Y8853800D01*
Y8773800D02*
X47296701D01*
Y8853800D01*
X47270700Y8827800D02*
X47296701Y8853800D01*
X47242700Y8827800D02*
X47270700D01*
X47216699Y8853800D02*
X47242700Y8827800D01*
X47216699Y8773800D02*
X47243494Y8800595D01*
X47270700Y8799800D02*
X47296701Y8773800D01*
X47270700Y8799800D02*
Y8827800D01*
X47242700Y8799800D02*
X47270700D01*
X47242700D02*
X47242700Y8827785D01*
X47306699Y8751350D02*
Y8876250D01*
X47216699Y9013800D02*
Y9060800D01*
X46757700Y9148800D02*
X47055701D01*
X46757700D02*
X46781201Y9080800D01*
X47032199D01*
X47055701Y9148800D01*
X46946701Y9013800D02*
Y9060800D01*
Y9013800D02*
X47061700D01*
X46946701Y9027198D02*
X47061700D01*
Y8570402D02*
Y9027198D01*
X46992117Y8570402D02*
X47061700D01*
X46992117D02*
X46996701Y8583800D01*
X47061700D01*
X46816699D02*
X46821283Y8570402D01*
X46751700D02*
X46821283D01*
X46751700D02*
Y9027198D01*
Y8583800D02*
X46816699D01*
X46751700Y9027198D02*
X46866699D01*
X46751700Y9013800D02*
X46866699D01*
Y8853800D02*
X46946701D01*
X46866699Y8773800D02*
Y8853800D01*
Y8773800D02*
X46946701D01*
Y8853800D01*
X46920700Y8827800D02*
X46946701Y8853800D01*
X46892700Y8827800D02*
X46920700D01*
X46866699Y8853800D02*
X46892700Y8827800D01*
X46866699Y8773800D02*
X46893494Y8800595D01*
X46920700Y8799800D02*
X46946701Y8773800D01*
X46920700Y8799800D02*
Y8827800D01*
X46892700Y8799800D02*
X46920700D01*
X46892700D02*
X46892700Y8827785D01*
X46866699Y9013800D02*
Y9060800D01*
X48585623Y14450450D02*
X48699921D01*
X48585623Y14856850D02*
X48699921D01*
X49449222Y10513450D02*
Y18793851D01*
X48585623D02*
X49449222D01*
X48585623Y10513450D02*
Y18793851D01*
X49334921Y11211950D02*
Y18095351D01*
X49144421D02*
X49334921D01*
X48844702Y17765150D02*
X49144421D01*
X48844702D02*
Y18461037D01*
X48585623D02*
X48844702D01*
X48699921Y18095351D02*
X48844702D01*
X48699921Y11211950D02*
Y18095351D01*
X48585623Y17478764D02*
X48699921D01*
X48585623Y17670535D02*
X48699921D01*
X48585623Y18049261D02*
X48699921D01*
X48585623Y18137585D02*
X48844702D01*
X49144421Y18133450D02*
X49449222D01*
X49334921Y18049261D02*
X49449222D01*
X49144421Y18376848D02*
X49449222D01*
X48699921Y18461037D02*
Y18793851D01*
X49334921Y18461037D02*
Y18793851D01*
X49144421Y17765150D02*
Y18461037D01*
X49449222D01*
X48816046Y18597000D02*
X48904034Y18749400D01*
X49080011D01*
X49167999Y18597000D01*
X49080011Y18444600D02*
X49167999Y18597000D01*
X48904034Y18444600D02*
X49080011D01*
X48816046Y18597000D02*
X48904034Y18444600D01*
X48585623Y18376848D02*
X48844702D01*
X48992023Y18597000D02*
X49092023D01*
X48892023D02*
X48992023D01*
Y18697000D01*
Y18497000D02*
Y18597000D01*
X48585623Y10513450D02*
X49449222D01*
X49334921D02*
Y10846265D01*
X48699921Y10513450D02*
Y10846265D01*
X48585623D02*
X48844702D01*
Y11542150D01*
X49144421D01*
Y10846265D02*
Y11542150D01*
Y10846265D02*
X49449222D01*
X49144421Y11211950D02*
X49334921D01*
X48699921D02*
X48844702D01*
X49334921Y10513450D02*
Y10846265D01*
Y11258039D02*
X49449222D01*
X48585623D02*
X48699921D01*
X48585623Y11890765D02*
X48699921D01*
X48585623Y12082535D02*
X48699921D01*
X49144421Y11173850D02*
X49449222D01*
X49144421D02*
X49449222D01*
X48585623Y11173749D02*
X48844702Y11173850D01*
X48585623Y11258039D02*
X48699921D01*
X49334921D02*
X49449222D01*
X48585623Y10930453D02*
X48844702D01*
X49144421D02*
X49449222D01*
X48816046Y10710300D02*
X48904034Y10862700D01*
X49080011D01*
X49167999Y10710300D01*
X49080011Y10557900D02*
X49167999Y10710300D01*
X48904034Y10557900D02*
X49080011D01*
X48816046Y10710300D02*
X48904034Y10557900D01*
X48992023Y10710300D02*
X49092023D01*
X48892023D02*
X48992023D01*
Y10810300D01*
Y10610300D02*
Y10710300D01*
X48585623Y11605650D02*
X48699921Y11478650D01*
X48585623Y11605650D02*
X48699921Y11732650D01*
Y11478650D02*
Y11732650D01*
X44958017Y18279498D02*
X45005521D01*
X45070517Y18344499D01*
X45005521Y18174498D02*
Y18279498D01*
X45315521Y10019495D02*
Y18174498D01*
X44600519Y18279498D02*
X44704019D01*
X44535519Y18344499D02*
X44600519Y18279498D01*
Y9914494D02*
Y18279498D01*
X44535519Y9849496D02*
X44600519Y9914494D01*
X44704019D01*
X45005521D02*
Y10019495D01*
Y9914494D02*
X45070517Y9849496D01*
X44958017Y9914494D02*
X45005521D01*
X45212021Y18174498D02*
X45315521D01*
X45380521Y18239497D01*
X45212021Y10019495D02*
X45315521D01*
X45380521Y9954494D01*
X44958020Y18174500D02*
Y18279498D01*
Y18344499D01*
X45005518Y18174500D02*
X45212021D01*
X44776300Y18344501D02*
X44958017Y18344499D01*
X45070520Y18174500D02*
Y18344499D01*
X44704019Y18174500D02*
Y18279498D01*
Y18344499D01*
X45212021Y18239499D02*
X45380521D01*
X45212021Y9954495D02*
X45380521D01*
X45005518Y10019495D02*
X45212021D01*
X44535519Y18344499D02*
X44704019D01*
Y9914495D02*
Y10019495D01*
Y9849495D02*
Y9914495D01*
X44535519Y9849495D02*
X44704019D01*
X44958020Y9914495D02*
Y10019495D01*
Y9849495D02*
Y9914495D01*
X45070520Y9849495D02*
Y10019495D01*
X44776300Y9849495D02*
X44958017Y9849496D01*
X45070520Y9849495D02*
X45079739D01*
X44958020Y9849495D02*
X45070520D01*
X45212021Y18174500D02*
Y18239499D01*
Y9954495D02*
Y10019495D01*
X44704019D02*
X44958020D01*
X45225519Y9596995D02*
X45483020D01*
X44433020D02*
X44630518D01*
Y9356995D02*
Y9596995D01*
X44630521D02*
X44776300Y9849495D01*
X45225519Y9356995D02*
Y9596995D01*
X45079739Y9849495D02*
X45225519Y9596995D01*
X45079739Y18344501D02*
X45225519Y18597000D01*
X44630521D02*
X44776300Y18344501D01*
X44704019Y18174500D02*
X44958020D01*
X45225519Y18597000D02*
Y18837001D01*
Y18597000D02*
X45483020D01*
X44433020D02*
X44630518D01*
Y18837001D01*
X45380521Y9954494D02*
Y18239497D01*
X44535519Y9849496D02*
Y18344499D01*
X44433020Y9456995D02*
X44433020Y18737001D01*
X44533020Y9356995D02*
X45383020Y9356996D01*
X45483020Y18737001D02*
X45483020Y9456996D01*
X44533020Y18837001D02*
X45383020D01*
X40894016Y18279498D02*
X40941519D01*
X41006516Y18344499D01*
X40941519Y18174498D02*
Y18279498D01*
X41251517Y10019495D02*
Y18174498D01*
X40536517Y18279498D02*
X40640018D01*
X40471518Y18344499D02*
X40536517Y18279498D01*
Y9914494D02*
Y18279498D01*
X40471518Y9849496D02*
X40536517Y9914494D01*
X40640018D01*
X40941519D02*
Y10019495D01*
Y9914494D02*
X41006516Y9849496D01*
X40894016Y9914494D02*
X40941519D01*
X41148019Y18174498D02*
X41251517D01*
X41316519Y18239497D01*
X41148019Y10019495D02*
X41251517D01*
X41316519Y9954494D01*
X40894016Y18174500D02*
Y18279498D01*
Y18344499D01*
X40941516Y18174500D02*
X41148019D01*
X40712299Y18344501D02*
X40894016Y18344499D01*
X41006516Y18174500D02*
Y18344499D01*
X40640018Y18174500D02*
Y18279498D01*
Y18344499D01*
X41148019Y18239499D02*
X41316519D01*
X41148019Y9954495D02*
X41316519D01*
X40941516Y10019495D02*
X41148019D01*
X40471518Y18344499D02*
X40640018D01*
Y9914495D02*
Y10019495D01*
Y9849495D02*
Y9914495D01*
X40471518Y9849495D02*
X40640018D01*
X40894016Y9914495D02*
Y10019495D01*
Y9849495D02*
Y9914495D01*
X41006516Y9849495D02*
Y10019495D01*
X40712299Y9849495D02*
X40894016Y9849496D01*
X41006519Y9849495D02*
X41015738D01*
X40894016Y9849495D02*
X41006516D01*
X41148019Y18174500D02*
Y18239499D01*
Y9954495D02*
Y10019495D01*
X40640018D02*
X40894016D01*
X41161517Y9596995D02*
X41419019D01*
X40369016D02*
X40566516D01*
Y9356995D02*
Y9596995D01*
X40566519D02*
X40712299Y9849495D01*
X41161517Y9356995D02*
Y9596995D01*
X41015738Y9849495D02*
X41161517Y9596995D01*
X41015738Y18344501D02*
X41161517Y18597000D01*
X40566519D02*
X40712299Y18344501D01*
X40640018Y18174500D02*
X40894016D01*
X41161517Y18597000D02*
Y18837001D01*
Y18597000D02*
X41419019D01*
X40369016D02*
X40566516D01*
Y18837001D01*
X41316519Y9954494D02*
Y18239497D01*
X40471518Y9849496D02*
Y18344499D01*
X40369016Y9456995D02*
X40369019Y18737001D01*
X40469016Y9356995D02*
X41319019Y9356996D01*
X41419019Y18737001D02*
X41419019Y9456996D01*
X40469019Y18837001D02*
X41319019D01*
X47161450Y9899650D02*
X47199551Y9861550D01*
X47161450Y10420350D02*
X47199551Y10458450D01*
X47161450Y10534650D02*
X47199551Y10496550D01*
X47161450Y11055350D02*
X47199551Y11093450D01*
X46901099Y11055350D02*
X47161450D01*
X47028101Y9779000D02*
X47282101D01*
X46520099Y11176000D02*
X46774100D01*
X46901099Y10420350D02*
X47161450Y10420350D01*
Y9899650D02*
Y10420350D01*
X46901099Y9899650D02*
X47161450D01*
X46901099Y9861551D02*
X47199551Y9861550D01*
Y10458450D01*
X46901099Y10458450D02*
X47199551Y10458450D01*
X46901099Y10496551D02*
X47199551Y10496550D01*
Y11093450D01*
X46901099Y10534650D02*
X47161450D01*
Y11055350D01*
X46901099Y11093450D02*
X47199551Y11093450D01*
X46774100Y11210030D02*
X47028101D01*
X46774100Y9744970D02*
X47028101D01*
X46774100Y9524999D02*
Y9779000D01*
Y9524999D02*
X47028101D01*
Y9779000D01*
X47282101D02*
X47409100D01*
Y9906000D01*
X47282101D02*
X47409100D01*
X47282101Y10414000D02*
X47409100D01*
Y10541000D01*
X47282101D02*
X47409100D01*
X47282101Y11049000D02*
X47409100D01*
Y11176000D01*
X47282101Y9779000D02*
Y11176000D01*
X46520099Y9779000D02*
X46774100D01*
X46520099D02*
Y11176000D01*
X47028101D02*
X47282101D01*
X47409100D01*
X46774100D02*
Y11430001D01*
X47028101D01*
Y11176000D02*
Y11430001D01*
X47161450Y12249150D02*
X47199551Y12211050D01*
X47161450Y12769850D02*
X47199551Y12807950D01*
X47161450Y12884151D02*
X47199551Y12846049D01*
X47161450Y13404849D02*
X47199551Y13442950D01*
X46901099Y13404849D02*
X47161450D01*
X47028101Y12128500D02*
X47282101D01*
X46520099Y13525500D02*
X46774100D01*
X46901099Y12769850D02*
X47161450Y12769850D01*
Y12249150D02*
Y12769850D01*
X46901099Y12249150D02*
X47161450D01*
X46901099Y12211051D02*
X47199551Y12211050D01*
Y12807950D01*
X46901099Y12807950D02*
X47199551Y12807950D01*
X46901099Y12846051D02*
X47199551Y12846049D01*
Y13442950D01*
X46901099Y12884151D02*
X47161450D01*
Y13404849D01*
X46901099Y13442950D02*
X47199551Y13442950D01*
X46774100Y13559531D02*
X47028101D01*
X46774100Y12094470D02*
X47028101D01*
X46774100Y11874499D02*
Y12128500D01*
Y11874499D02*
X47028101D01*
Y12128500D01*
X47282101D02*
X47409100D01*
Y12255500D01*
X47282101D02*
X47409100D01*
X47282101Y12763500D02*
X47409100D01*
Y12890500D01*
X47282101D02*
X47409100D01*
X47282101Y13398500D02*
X47409100D01*
Y13525500D01*
X47282101Y12128500D02*
Y13525500D01*
X46520099Y12128500D02*
X46774100D01*
X46520099D02*
Y13525500D01*
X47028101D02*
X47282101D01*
X47409100D01*
X46774100D02*
Y13779501D01*
X47028101D01*
Y13525500D02*
Y13779501D01*
X7957000Y18837000D02*
X8807000D01*
X8907000Y18737000D02*
X8907000Y9456995D01*
X7957000Y9356995D02*
X8807000Y9356995D01*
X7857000Y9456995D02*
X7857000Y18737000D01*
X7959499Y9849496D02*
Y18344499D01*
X8804501Y9954494D02*
Y18239497D01*
X8054500Y18597000D02*
Y18837000D01*
X7857000Y18597000D02*
X8054500D01*
X8649500D02*
X8907000D01*
X8649500D02*
Y18837000D01*
X8128000Y18174500D02*
X8382000D01*
X8054500Y18597000D02*
X8200281Y18344501D01*
X8503719D02*
X8649500Y18597000D01*
X8503719Y9849495D02*
X8649500Y9596995D01*
X8649500Y9356995D02*
Y9596995D01*
X8054500D02*
X8200281Y9849495D01*
X8054500Y9356995D02*
Y9596995D01*
X7857000D02*
X8054500D01*
X8649500D02*
X8907000D01*
X8128000Y10019495D02*
X8382000D01*
X8636000Y9954494D02*
Y10019495D01*
Y18174500D02*
Y18239499D01*
X8382000Y9849494D02*
X8494500D01*
X8494500Y9849495D02*
X8503719D01*
X8200281D02*
X8381999Y9849496D01*
X8494500Y9849494D02*
Y10019495D01*
X8382000Y9849494D02*
Y9914495D01*
Y10019495D01*
X7959500Y9849494D02*
X8128000D01*
Y9914495D01*
Y10019495D01*
X7959500Y18344499D02*
X8128000D01*
X8429500Y10019495D02*
X8636000D01*
Y9954494D02*
X8804500D01*
X8636000Y18239499D02*
X8804500D01*
X8128000Y18279498D02*
Y18344499D01*
Y18174500D02*
Y18279498D01*
X8494500Y18174500D02*
Y18344499D01*
X8200281Y18344501D02*
X8381999Y18344499D01*
X8429500Y18174500D02*
X8636000D01*
X8382000Y18279498D02*
Y18344499D01*
Y18174500D02*
Y18279498D01*
X8739500Y10019495D02*
X8804501Y9954494D01*
X8636000Y10019495D02*
X8739500D01*
Y18174498D02*
X8804501Y18239497D01*
X8636000Y18174498D02*
X8739500D01*
X8381999Y9914494D02*
X8429501D01*
X8494499Y9849496D01*
X8429501Y9914494D02*
Y10019495D01*
X8024500Y9914494D02*
X8128000D01*
X7959499Y9849496D02*
X8024500Y9914494D01*
Y18279498D01*
X7959499Y18344499D02*
X8024500Y18279498D01*
X8128000D01*
X8739500Y10019495D02*
Y18174498D01*
X8429501D02*
Y18279498D01*
X8494499Y18344499D01*
X8381999Y18279498D02*
X8429501D01*
X36404999Y18837000D02*
X37254999D01*
X37354999Y18737000D02*
X37354999Y9456995D01*
X36404999Y9356995D02*
X37254999Y9356995D01*
X36304999Y9456995D02*
X36304999Y18737000D01*
X36407498Y9849496D02*
Y18344499D01*
X37252502Y9954494D02*
Y18239497D01*
X36502499Y18597000D02*
Y18837000D01*
X36304999Y18597000D02*
X36502499D01*
X37097501D02*
X37354999D01*
X37097501D02*
Y18837000D01*
X36576001Y18174500D02*
X36829999D01*
X36502499Y18597000D02*
X36648282Y18344501D01*
X36951718D02*
X37097501Y18597000D01*
X36951718Y9849495D02*
X37097501Y9596995D01*
X37097501Y9356995D02*
Y9596995D01*
X36502499D02*
X36648282Y9849495D01*
X36502499Y9356995D02*
Y9596995D01*
X36304999D02*
X36502499D01*
X37097501D02*
X37354999D01*
X36576001Y10019495D02*
X36829999D01*
X37084000Y9954494D02*
Y10019495D01*
Y18174500D02*
Y18239499D01*
X36829999Y9849494D02*
X36942499D01*
X36942499Y9849495D02*
X36951718D01*
X36648282D02*
X36829999Y9849496D01*
X36942499Y9849494D02*
Y10019495D01*
X36829999Y9849494D02*
Y9914495D01*
Y10019495D01*
X36407501Y9849494D02*
X36576001D01*
Y9914495D01*
Y10019495D01*
X36407501Y18344499D02*
X36576001D01*
X36877499Y10019495D02*
X37084000D01*
Y9954494D02*
X37252499D01*
X37084000Y18239499D02*
X37252499D01*
X36576001Y18279498D02*
Y18344499D01*
Y18174500D02*
Y18279498D01*
X36942499Y18174500D02*
Y18344499D01*
X36648282Y18344501D02*
X36829999Y18344499D01*
X36877499Y18174500D02*
X37084000D01*
X36829999Y18279498D02*
Y18344499D01*
Y18174500D02*
Y18279498D01*
X37187500Y10019495D02*
X37252502Y9954494D01*
X37084000Y10019495D02*
X37187500D01*
Y18174498D02*
X37252502Y18239497D01*
X37084000Y18174498D02*
X37187500D01*
X36829999Y9914494D02*
X36877502D01*
X36942499Y9849496D01*
X36877502Y9914494D02*
Y10019495D01*
X36472501Y9914494D02*
X36576001D01*
X36407498Y9849496D02*
X36472501Y9914494D01*
Y18279498D01*
X36407498Y18344499D02*
X36472501Y18279498D01*
X36576001D01*
X37187500Y10019495D02*
Y18174498D01*
X36877502D02*
Y18279498D01*
X36942499Y18344499D01*
X36829999Y18279498D02*
X36877502D01*
X32341000Y18837000D02*
X33191000D01*
X33291000Y18737000D02*
X33291000Y9456995D01*
X32341000Y9356995D02*
X33191000Y9356995D01*
X32241000Y9456995D02*
X32241000Y18737000D01*
X32343500Y9849496D02*
Y18344499D01*
X33188501Y9954494D02*
Y18239497D01*
X32438501Y18597000D02*
Y18837000D01*
X32241000Y18597000D02*
X32438501D01*
X33033499D02*
X33291000D01*
X33033499D02*
Y18837000D01*
X32512000Y18174500D02*
X32766000D01*
X32438501Y18597000D02*
X32584280Y18344501D01*
X32887720D02*
X33033499Y18597000D01*
X32887720Y9849495D02*
X33033499Y9596995D01*
X33033499Y9356995D02*
Y9596995D01*
X32438501D02*
X32584280Y9849495D01*
X32438501Y9356995D02*
Y9596995D01*
X32241000D02*
X32438501D01*
X33033499D02*
X33291000D01*
X32512000Y10019495D02*
X32766000D01*
X33020001Y9954494D02*
Y10019495D01*
Y18174500D02*
Y18239499D01*
X32766000Y9849494D02*
X32878500D01*
X32878500Y9849495D02*
X32887720D01*
X32584280D02*
X32766000Y9849496D01*
X32878500Y9849494D02*
Y10019495D01*
X32766000Y9849494D02*
Y9914495D01*
Y10019495D01*
X32343500Y9849494D02*
X32512000D01*
Y9914495D01*
Y10019495D01*
X32343500Y18344499D02*
X32512000D01*
X32813501Y10019495D02*
X33020001D01*
Y9954494D02*
X33188501D01*
X33020001Y18239499D02*
X33188501D01*
X32512000Y18279498D02*
Y18344499D01*
Y18174500D02*
Y18279498D01*
X32878500Y18174500D02*
Y18344499D01*
X32584280Y18344501D02*
X32766000Y18344499D01*
X32813501Y18174500D02*
X33020001D01*
X32766000Y18279498D02*
Y18344499D01*
Y18174500D02*
Y18279498D01*
X33123499Y10019495D02*
X33188501Y9954494D01*
X33020001Y10019495D02*
X33123499D01*
Y18174498D02*
X33188501Y18239497D01*
X33020001Y18174498D02*
X33123499D01*
X32766000Y9914494D02*
X32813501D01*
X32878500Y9849496D01*
X32813501Y9914494D02*
Y10019495D01*
X32408499Y9914494D02*
X32512000D01*
X32343500Y9849496D02*
X32408499Y9914494D01*
Y18279498D01*
X32343500Y18344499D02*
X32408499Y18279498D01*
X32512000D01*
X33123499Y10019495D02*
Y18174498D01*
X32813501D02*
Y18279498D01*
X32878500Y18344499D01*
X32766000Y18279498D02*
X32813501D01*
X28276999Y18837000D02*
X29126999D01*
X29226999Y18737000D02*
X29226999Y9456995D01*
X28276999Y9356995D02*
X29126999Y9356995D01*
X28176999Y9456995D02*
X28176999Y18737000D01*
X28279498Y9849496D02*
Y18344499D01*
X29124500Y9954494D02*
Y18239497D01*
X28374500Y18597000D02*
Y18837000D01*
X28176999Y18597000D02*
X28374500D01*
X28969501D02*
X29226999D01*
X28969501D02*
Y18837000D01*
X28448001Y18174500D02*
X28701999D01*
X28374500Y18597000D02*
X28520282Y18344501D01*
X28823718D02*
X28969501Y18597000D01*
X28823718Y9849495D02*
X28969501Y9596995D01*
X28969501Y9356995D02*
Y9596995D01*
X28374500D02*
X28520282Y9849495D01*
X28374500Y9356995D02*
Y9596995D01*
X28176999D02*
X28374500D01*
X28969501D02*
X29226999D01*
X28448001Y10019495D02*
X28701999D01*
X28956000Y9954494D02*
Y10019495D01*
Y18174500D02*
Y18239499D01*
X28701999Y9849494D02*
X28814499D01*
X28814499Y9849495D02*
X28823718D01*
X28520282D02*
X28701999Y9849496D01*
X28814499Y9849494D02*
Y10019495D01*
X28701999Y9849494D02*
Y9914495D01*
Y10019495D01*
X28279501Y9849494D02*
X28448001D01*
Y9914495D01*
Y10019495D01*
X28279501Y18344499D02*
X28448001D01*
X28749500Y10019495D02*
X28956000D01*
Y9954494D02*
X29124500D01*
X28956000Y18239499D02*
X29124500D01*
X28448001Y18279498D02*
Y18344499D01*
Y18174500D02*
Y18279498D01*
X28814499Y18174500D02*
Y18344499D01*
X28520282Y18344501D02*
X28701999Y18344499D01*
X28749500Y18174500D02*
X28956000D01*
X28701999Y18279498D02*
Y18344499D01*
Y18174500D02*
Y18279498D01*
X29059500Y10019495D02*
X29124500Y9954494D01*
X28956000Y10019495D02*
X29059500D01*
Y18174498D02*
X29124500Y18239497D01*
X28956000Y18174498D02*
X29059500D01*
X28701999Y9914494D02*
X28749500D01*
X28814499Y9849496D01*
X28749500Y9914494D02*
Y10019495D01*
X28344501Y9914494D02*
X28448001D01*
X28279498Y9849496D02*
X28344501Y9914494D01*
Y18279498D01*
X28279498Y18344499D02*
X28344501Y18279498D01*
X28448001D01*
X29059500Y10019495D02*
Y18174498D01*
X28749500D02*
Y18279498D01*
X28814499Y18344499D01*
X28701999Y18279498D02*
X28749500D01*
X24213000Y18837000D02*
X25063000D01*
X25163000Y18737000D02*
X25163000Y9456995D01*
X24213000Y9356995D02*
X25063000Y9356995D01*
X24113000Y9456995D02*
X24113000Y18737000D01*
X24215498Y9849496D02*
Y18344499D01*
X25060501Y9954494D02*
Y18239497D01*
X24310500Y18597000D02*
Y18837000D01*
X24113000Y18597000D02*
X24310500D01*
X24905499D02*
X25163000D01*
X24905499D02*
Y18837000D01*
X24384000Y18174500D02*
X24638000D01*
X24310500Y18597000D02*
X24456281Y18344501D01*
X24759718D02*
X24905499Y18597000D01*
X24759718Y9849495D02*
X24905499Y9596995D01*
X24905499Y9356995D02*
Y9596995D01*
X24310500D02*
X24456281Y9849495D01*
X24310500Y9356995D02*
Y9596995D01*
X24113000D02*
X24310500D01*
X24905499D02*
X25163000D01*
X24384000Y10019495D02*
X24638000D01*
X24892000Y9954494D02*
Y10019495D01*
Y18174500D02*
Y18239499D01*
X24638000Y9849494D02*
X24750500D01*
X24750500Y9849495D02*
X24759718D01*
X24456281D02*
X24637999Y9849496D01*
X24750500Y9849494D02*
Y10019495D01*
X24638000Y9849494D02*
Y9914495D01*
Y10019495D01*
X24215500Y9849494D02*
X24384000D01*
Y9914495D01*
Y10019495D01*
X24215500Y18344499D02*
X24384000D01*
X24685500Y10019495D02*
X24892000D01*
Y9954494D02*
X25060500D01*
X24892000Y18239499D02*
X25060500D01*
X24384000Y18279498D02*
Y18344499D01*
Y18174500D02*
Y18279498D01*
X24750500Y18174500D02*
Y18344499D01*
X24456281Y18344501D02*
X24637999Y18344499D01*
X24685500Y18174500D02*
X24892000D01*
X24638000Y18279498D02*
Y18344499D01*
Y18174500D02*
Y18279498D01*
X24995500Y10019495D02*
X25060501Y9954494D01*
X24892000Y10019495D02*
X24995500D01*
Y18174498D02*
X25060501Y18239497D01*
X24892000Y18174498D02*
X24995500D01*
X24637999Y9914494D02*
X24685501D01*
X24750499Y9849496D01*
X24685501Y9914494D02*
Y10019495D01*
X24280499Y9914494D02*
X24384000D01*
X24215498Y9849496D02*
X24280499Y9914494D01*
Y18279498D01*
X24215498Y18344499D02*
X24280499Y18279498D01*
X24384000D01*
X24995500Y10019495D02*
Y18174498D01*
X24685501D02*
Y18279498D01*
X24750499Y18344499D01*
X24637999Y18279498D02*
X24685501D01*
X20149001Y18837000D02*
X20999001D01*
X21099001Y18737000D02*
X21099001Y9456995D01*
X20149001Y9356995D02*
X20999001Y9356995D01*
X20049001Y9456995D02*
X20049001Y18737000D01*
X20151498Y9849496D02*
Y18344499D01*
X20996501Y9954494D02*
Y18239497D01*
X20246500Y18597000D02*
Y18837000D01*
X20049001Y18597000D02*
X20246500D01*
X20841499D02*
X21099001D01*
X20841499D02*
Y18837000D01*
X20320000Y18174500D02*
X20574001D01*
X20246500Y18597000D02*
X20392281Y18344501D01*
X20695718D02*
X20841499Y18597000D01*
X20695718Y9849495D02*
X20841499Y9596995D01*
X20841499Y9356995D02*
Y9596995D01*
X20246500D02*
X20392281Y9849495D01*
X20246500Y9356995D02*
Y9596995D01*
X20049001D02*
X20246500D01*
X20841499D02*
X21099001D01*
X20320000Y10019495D02*
X20574001D01*
X20828000Y9954494D02*
Y10019495D01*
Y18174500D02*
Y18239499D01*
X20574001Y9849494D02*
X20686501D01*
X20686501Y9849495D02*
X20695718D01*
X20392281D02*
X20573999Y9849496D01*
X20686501Y9849494D02*
Y10019495D01*
X20574001Y9849494D02*
Y9914495D01*
Y10019495D01*
X20151500Y9849494D02*
X20320000D01*
Y9914495D01*
Y10019495D01*
X20151500Y18344499D02*
X20320000D01*
X20621500Y10019495D02*
X20828000D01*
Y9954494D02*
X20996500D01*
X20828000Y18239499D02*
X20996500D01*
X20320000Y18279498D02*
Y18344499D01*
Y18174500D02*
Y18279498D01*
X20686501Y18174500D02*
Y18344499D01*
X20392281Y18344501D02*
X20573999Y18344499D01*
X20621500Y18174500D02*
X20828000D01*
X20574001Y18279498D02*
Y18344499D01*
Y18174500D02*
Y18279498D01*
X20931500Y10019495D02*
X20996501Y9954494D01*
X20828000Y10019495D02*
X20931500D01*
Y18174498D02*
X20996501Y18239497D01*
X20828000Y18174498D02*
X20931500D01*
X20573999Y9914494D02*
X20621501D01*
X20686499Y9849496D01*
X20621501Y9914494D02*
Y10019495D01*
X20216499Y9914494D02*
X20320000D01*
X20151498Y9849496D02*
X20216499Y9914494D01*
Y18279498D01*
X20151498Y18344499D02*
X20216499Y18279498D01*
X20320000D01*
X20931500Y10019495D02*
Y18174498D01*
X20621501D02*
Y18279498D01*
X20686499Y18344499D01*
X20573999Y18279498D02*
X20621501D01*
X16085001Y18837000D02*
X16935001D01*
X17035001Y18737000D02*
X17035001Y9456995D01*
X16085001Y9356995D02*
X16935001Y9356995D01*
X15985001Y9456995D02*
X15985001Y18737000D01*
X16087498Y9849496D02*
Y18344499D01*
X16932501Y9954494D02*
Y18239497D01*
X16182500Y18597000D02*
Y18837000D01*
X15985001Y18597000D02*
X16182500D01*
X16777499D02*
X17035001D01*
X16777499D02*
Y18837000D01*
X16256000Y18174500D02*
X16510001D01*
X16182500Y18597000D02*
X16328281Y18344501D01*
X16631718D02*
X16777499Y18597000D01*
X16631718Y9849495D02*
X16777499Y9596995D01*
X16777499Y9356995D02*
Y9596995D01*
X16182500D02*
X16328281Y9849495D01*
X16182500Y9356995D02*
Y9596995D01*
X15985001D02*
X16182500D01*
X16777499D02*
X17035001D01*
X16256000Y10019495D02*
X16510001D01*
X16764000Y9954494D02*
Y10019495D01*
Y18174500D02*
Y18239499D01*
X16510001Y9849494D02*
X16622501D01*
X16622501Y9849495D02*
X16631718D01*
X16328281D02*
X16509999Y9849496D01*
X16622501Y9849494D02*
Y10019495D01*
X16510001Y9849494D02*
Y9914495D01*
Y10019495D01*
X16087500Y9849494D02*
X16256000D01*
Y9914495D01*
Y10019495D01*
X16087500Y18344499D02*
X16256000D01*
X16557500Y10019495D02*
X16764000D01*
Y9954494D02*
X16932500D01*
X16764000Y18239499D02*
X16932500D01*
X16256000Y18279498D02*
Y18344499D01*
Y18174500D02*
Y18279498D01*
X16622501Y18174500D02*
Y18344499D01*
X16328281Y18344501D02*
X16509999Y18344499D01*
X16557500Y18174500D02*
X16764000D01*
X16510001Y18279498D02*
Y18344499D01*
Y18174500D02*
Y18279498D01*
X16867500Y10019495D02*
X16932501Y9954494D01*
X16764000Y10019495D02*
X16867500D01*
Y18174498D02*
X16932501Y18239497D01*
X16764000Y18174498D02*
X16867500D01*
X16509999Y9914494D02*
X16557501D01*
X16622499Y9849496D01*
X16557501Y9914494D02*
Y10019495D01*
X16152499Y9914494D02*
X16256000D01*
X16087498Y9849496D02*
X16152499Y9914494D01*
Y18279498D01*
X16087498Y18344499D02*
X16152499Y18279498D01*
X16256000D01*
X16867500Y10019495D02*
Y18174498D01*
X16557501D02*
Y18279498D01*
X16622499Y18344499D01*
X16509999Y18279498D02*
X16557501D01*
X12021000Y18837000D02*
X12871001D01*
X12971001Y18737000D02*
X12971001Y9456995D01*
X12021000Y9356995D02*
X12871001Y9356995D01*
X11921000Y9456995D02*
X11921000Y18737000D01*
X12023499Y9849496D02*
Y18344499D01*
X12868501Y9954494D02*
Y18239497D01*
X12118500Y18597000D02*
Y18837000D01*
X11921000Y18597000D02*
X12118500D01*
X12713500D02*
X12971001D01*
X12713500D02*
Y18837000D01*
X12192000Y18174500D02*
X12446000D01*
X12118500Y18597000D02*
X12264281Y18344501D01*
X12567719D02*
X12713500Y18597000D01*
X12567719Y9849495D02*
X12713500Y9596995D01*
X12713500Y9356995D02*
Y9596995D01*
X12118500D02*
X12264281Y9849495D01*
X12118500Y9356995D02*
Y9596995D01*
X11921000D02*
X12118500D01*
X12713500D02*
X12971001D01*
X12192000Y10019495D02*
X12446000D01*
X12700000Y9954494D02*
Y10019495D01*
Y18174500D02*
Y18239499D01*
X12446000Y9849494D02*
X12558500D01*
X12558500Y9849495D02*
X12567719D01*
X12264281D02*
X12445999Y9849496D01*
X12558500Y9849494D02*
Y10019495D01*
X12446000Y9849494D02*
Y9914495D01*
Y10019495D01*
X12023500Y9849494D02*
X12192000D01*
Y9914495D01*
Y10019495D01*
X12023500Y18344499D02*
X12192000D01*
X12493500Y10019495D02*
X12700000D01*
Y9954494D02*
X12868500D01*
X12700000Y18239499D02*
X12868500D01*
X12192000Y18279498D02*
Y18344499D01*
Y18174500D02*
Y18279498D01*
X12558500Y18174500D02*
Y18344499D01*
X12264281Y18344501D02*
X12445999Y18344499D01*
X12493500Y18174500D02*
X12700000D01*
X12446000Y18279498D02*
Y18344499D01*
Y18174500D02*
Y18279498D01*
X12803500Y10019495D02*
X12868501Y9954494D01*
X12700000Y10019495D02*
X12803500D01*
Y18174498D02*
X12868501Y18239497D01*
X12700000Y18174498D02*
X12803500D01*
X12445999Y9914494D02*
X12493501D01*
X12558499Y9849496D01*
X12493501Y9914494D02*
Y10019495D01*
X12088500Y9914494D02*
X12192000D01*
X12023499Y9849496D02*
X12088500Y9914494D01*
Y18279498D01*
X12023499Y18344499D02*
X12088500Y18279498D01*
X12192000D01*
X12803500Y10019495D02*
Y18174498D01*
X12493501D02*
Y18279498D01*
X12558499Y18344499D01*
X12445999Y18279498D02*
X12493501D01*
X8207663Y18847000D02*
X8496338Y18847000D01*
X8640675Y18597000D01*
X8496338Y18347000D02*
X8640675Y18597000D01*
X8207663Y18347000D02*
X8496338D01*
X8063325Y18597000D02*
X8207663Y18347000D01*
X8063325Y18597000D02*
X8207663Y18847000D01*
Y9846995D02*
X8496338Y9846995D01*
X8640675Y9596995D01*
X8496338Y9346995D02*
X8640675Y9596995D01*
X8207663Y9346995D02*
X8496338D01*
X8063325Y9596995D02*
X8207663Y9346995D01*
X8063325Y9596995D02*
X8207663Y9846995D01*
X12271663Y18847000D02*
X12560338Y18847000D01*
X12704675Y18597000D01*
X12560338Y18347000D02*
X12704675Y18597000D01*
X12271663Y18347000D02*
X12560338D01*
X12127325Y18597000D02*
X12271663Y18347000D01*
X12127325Y18597000D02*
X12271663Y18847000D01*
Y9847000D02*
X12560338Y9847000D01*
X12704675Y9597000D01*
X12560338Y9347000D02*
X12704675Y9597000D01*
X12271663Y9347000D02*
X12560338D01*
X12127325Y9597000D02*
X12271663Y9347000D01*
X12127325Y9597000D02*
X12271663Y9847000D01*
X16335663Y18847005D02*
X16624338Y18847005D01*
X16768675Y18597005D01*
X16624338Y18347005D02*
X16768675Y18597005D01*
X16335663Y18347005D02*
X16624338D01*
X16191325Y18597005D02*
X16335663Y18347005D01*
X16191325Y18597005D02*
X16335663Y18847005D01*
Y9847000D02*
X16624338Y9847000D01*
X16768675Y9597000D01*
X16624338Y9347000D02*
X16768675Y9597000D01*
X16335663Y9347000D02*
X16624338D01*
X16191325Y9597000D02*
X16335663Y9347000D01*
X16191325Y9597000D02*
X16335663Y9847000D01*
X20399663Y18847005D02*
X20688338Y18847005D01*
X20832675Y18597005D01*
X20688338Y18347005D02*
X20832675Y18597005D01*
X20399663Y18347005D02*
X20688338D01*
X20255325Y18597005D02*
X20399663Y18347005D01*
X20255325Y18597005D02*
X20399663Y18847005D01*
Y9846995D02*
X20688338Y9846995D01*
X20832675Y9596995D01*
X20688338Y9346995D02*
X20832675Y9596995D01*
X20399663Y9346995D02*
X20688338D01*
X20255325Y9596995D02*
X20399663Y9346995D01*
X20255325Y9596995D02*
X20399663Y9846995D01*
X24463663Y18847005D02*
X24752338Y18847005D01*
X24896675Y18597005D01*
X24752338Y18347005D02*
X24896675Y18597005D01*
X24463663Y18347005D02*
X24752338D01*
X24319325Y18597005D02*
X24463663Y18347005D01*
X24319325Y18597005D02*
X24463663Y18847005D01*
X24463670Y9846996D02*
X24752345Y9846996D01*
X24896684Y9596996D01*
X24752345Y9346996D02*
X24896684Y9596996D01*
X24463670Y9346996D02*
X24752345D01*
X24319333Y9596996D02*
X24463670Y9346996D01*
X24319333Y9596996D02*
X24463670Y9846996D01*
X28527664Y18847000D02*
X28816339Y18847000D01*
X28960675Y18597000D01*
X28816339Y18347000D02*
X28960675Y18597000D01*
X28527664Y18347000D02*
X28816339D01*
X28383325Y18597000D02*
X28527664Y18347000D01*
X28383325Y18597000D02*
X28527664Y18847000D01*
Y9846995D02*
X28816339Y9846995D01*
X28960675Y9596995D01*
X28816339Y9346995D02*
X28960675Y9596995D01*
X28527664Y9346995D02*
X28816339D01*
X28383325Y9596995D02*
X28527664Y9346995D01*
X28383325Y9596995D02*
X28527664Y9846995D01*
X32591663Y18847005D02*
X32880338Y18847005D01*
X33024677Y18597005D01*
X32880338Y18347005D02*
X33024677Y18597005D01*
X32591663Y18347005D02*
X32880338D01*
X32447324Y18597005D02*
X32591663Y18347005D01*
X32447324Y18597005D02*
X32591663Y18847005D01*
Y9847000D02*
X32880338Y9847000D01*
X33024677Y9597000D01*
X32880338Y9347000D02*
X33024677Y9597000D01*
X32591663Y9347000D02*
X32880338D01*
X32447324Y9597000D02*
X32591663Y9347000D01*
X32447324Y9597000D02*
X32591663Y9847000D01*
X36655664Y18847005D02*
X36944339Y18847005D01*
X37088675Y18597005D01*
X36944339Y18347005D02*
X37088675Y18597005D01*
X36655664Y18347005D02*
X36944339D01*
X36511325Y18597005D02*
X36655664Y18347005D01*
X36511325Y18597005D02*
X36655664Y18847005D01*
Y9847000D02*
X36944339Y9847000D01*
X37088675Y9597000D01*
X36944339Y9347000D02*
X37088675Y9597000D01*
X36655664Y9347000D02*
X36944339D01*
X36511325Y9597000D02*
X36655664Y9347000D01*
X36511325Y9597000D02*
X36655664Y9847000D01*
%TF.MD5,b3cb7d64e60c4310b62dcd97199ff95f*%
M02*
