%TF.GenerationSoftware,Altium Limited,Altium Designer,19.1.5 (86)*%
G04 Layer_Color=16711935*
%FSLAX45Y45*%
%MOMM*%
%TF.FileFunction,Other,Panelisation*%
%TF.Part,Single*%
G01*
G75*
%TF.MD5,de77b187ff799a0ea8e731fb0b434abc*%
M02*
