%TF.GenerationSoftware,Altium Limited,Altium Designer,19.1.5 (86)*%
G04 Layer_Physical_Order=2*
G04 Layer_Color=16711680*
%FSLAX45Y45*%
%MOMM*%
%TF.FileFunction,Copper,L2,Bot,Signal*%
%TF.Part,Single*%
G01*
G75*
%TA.AperFunction,Conductor*%
%ADD10C,0.60960*%
%TA.AperFunction,NonConductor*%
%ADD11C,0.17780*%
%ADD12C,0.25400*%
%TA.AperFunction,ComponentPad*%
%ADD13C,1.60000*%
%ADD14C,1.50000*%
%ADD15R,1.60000X1.60000*%
%ADD16C,1.90000*%
%ADD17C,0.50000*%
%ADD18C,1.70000*%
%ADD20C,2.00000*%
%TA.AperFunction,ViaPad*%
%ADD21C,4.45000*%
%TA.AperFunction,Conductor*%
%ADD22C,1.27000*%
%TA.AperFunction,ComponentPad*%
%ADD23C,5.10000*%
G36*
X23063200Y17576799D02*
Y16840199D01*
X23494997D01*
X23495003Y8585200D01*
X23063200Y8585199D01*
X23063200Y7873999D01*
X8585200Y7874000D01*
Y8788400D01*
X7823200Y8788400D01*
X7823200Y16611600D01*
X8509000D01*
Y17576801D01*
X23063200Y17576799D01*
D02*
G37*
%LPC*%
G36*
X8420100Y16388037D02*
Y16319501D01*
X8488637D01*
X8480793Y16338438D01*
X8462664Y16362064D01*
X8439038Y16380193D01*
X8420100Y16388037D01*
D02*
G37*
G36*
X8343900D02*
X8324962Y16380193D01*
X8301336Y16362064D01*
X8283208Y16338438D01*
X8275363Y16319501D01*
X8343900D01*
Y16388037D01*
D02*
G37*
G36*
X8488637Y16243300D02*
X8420100D01*
Y16174763D01*
X8439038Y16182607D01*
X8462664Y16200735D01*
X8480793Y16224362D01*
X8488637Y16243300D01*
D02*
G37*
G36*
X8343900D02*
X8275363D01*
X8283208Y16224362D01*
X8301336Y16200735D01*
X8324962Y16182607D01*
X8343900Y16174763D01*
Y16243300D01*
D02*
G37*
G36*
X14135100Y16215649D02*
Y16141701D01*
X14209048D01*
X14200160Y16163159D01*
X14181230Y16187830D01*
X14156560Y16206760D01*
X14135100Y16215649D01*
D02*
G37*
G36*
X14058900D02*
X14037440Y16206760D01*
X14012770Y16187830D01*
X13993840Y16163159D01*
X13984950Y16141701D01*
X14058900D01*
Y16215649D01*
D02*
G37*
G36*
X8128000Y16246185D02*
X8104244Y16243057D01*
X8082108Y16233888D01*
X8063098Y16219302D01*
X8048512Y16200291D01*
X8039343Y16178156D01*
X8036215Y16154401D01*
X8039343Y16130644D01*
X8048512Y16108508D01*
X8063098Y16089497D01*
X8082108Y16074911D01*
X8104244Y16065742D01*
X8128000Y16062614D01*
X8151756Y16065742D01*
X8173892Y16074911D01*
X8192902Y16089497D01*
X8207488Y16108508D01*
X8216657Y16130644D01*
X8219785Y16154401D01*
X8216657Y16178156D01*
X8207488Y16200291D01*
X8192902Y16219302D01*
X8173892Y16233888D01*
X8151756Y16243057D01*
X8128000Y16246185D01*
D02*
G37*
G36*
X16510001Y16215558D02*
X16481023Y16211743D01*
X16454021Y16200558D01*
X16430833Y16182767D01*
X16413042Y16159579D01*
X16401857Y16132578D01*
X16398042Y16103600D01*
X16401857Y16074623D01*
X16413042Y16047621D01*
X16430833Y16024434D01*
X16454021Y16006642D01*
X16481023Y15995457D01*
X16510001Y15991643D01*
X16538977Y15995457D01*
X16565979Y16006642D01*
X16589166Y16024434D01*
X16606958Y16047621D01*
X16618143Y16074623D01*
X16621957Y16103600D01*
X16618143Y16132578D01*
X16606958Y16159579D01*
X16589166Y16182767D01*
X16565979Y16200558D01*
X16538977Y16211743D01*
X16510001Y16215558D01*
D02*
G37*
G36*
X15494000D02*
X15465022Y16211743D01*
X15438020Y16200558D01*
X15414835Y16182767D01*
X15397041Y16159579D01*
X15385857Y16132578D01*
X15382042Y16103600D01*
X15385857Y16074623D01*
X15397041Y16047621D01*
X15414835Y16024434D01*
X15438020Y16006642D01*
X15465022Y15995457D01*
X15494000Y15991643D01*
X15522977Y15995457D01*
X15549979Y16006642D01*
X15573166Y16024434D01*
X15590958Y16047621D01*
X15602142Y16074623D01*
X15605959Y16103600D01*
X15602142Y16132578D01*
X15590958Y16159579D01*
X15573166Y16182767D01*
X15549979Y16200558D01*
X15522977Y16211743D01*
X15494000Y16215558D01*
D02*
G37*
G36*
X15113000D02*
X15084023Y16211743D01*
X15057021Y16200558D01*
X15033833Y16182767D01*
X15016042Y16159579D01*
X15004857Y16132578D01*
X15001042Y16103600D01*
X15004857Y16074623D01*
X15016042Y16047621D01*
X15033833Y16024434D01*
X15057021Y16006642D01*
X15084023Y15995457D01*
X15113000Y15991643D01*
X15141977Y15995457D01*
X15168979Y16006642D01*
X15192166Y16024434D01*
X15209958Y16047621D01*
X15221143Y16074623D01*
X15224957Y16103600D01*
X15221143Y16132578D01*
X15209958Y16159579D01*
X15192166Y16182767D01*
X15168979Y16200558D01*
X15141977Y16211743D01*
X15113000Y16215558D01*
D02*
G37*
G36*
X14209048Y16065500D02*
X14135100D01*
Y15991551D01*
X14156560Y16000439D01*
X14181230Y16019370D01*
X14200160Y16044041D01*
X14209048Y16065500D01*
D02*
G37*
G36*
X14058900D02*
X13984950D01*
X13993840Y16044041D01*
X14012770Y16019370D01*
X14037440Y16000439D01*
X14058900Y15991551D01*
Y16065500D01*
D02*
G37*
G36*
X8382000Y16134314D02*
X8354329Y16130672D01*
X8328543Y16119991D01*
X8306400Y16103000D01*
X8289410Y16080856D01*
X8278729Y16055072D01*
X8275086Y16027400D01*
X8278729Y15999728D01*
X8289410Y15973943D01*
X8306400Y15951801D01*
X8328543Y15934808D01*
X8354329Y15924129D01*
X8382000Y15920486D01*
X8409672Y15924129D01*
X8435457Y15934808D01*
X8457600Y15951801D01*
X8474591Y15973943D01*
X8485272Y15999728D01*
X8488915Y16027400D01*
X8485272Y16055072D01*
X8474591Y16080856D01*
X8457600Y16103000D01*
X8435457Y16119991D01*
X8409672Y16130672D01*
X8382000Y16134314D01*
D02*
G37*
G36*
X10185400Y16139359D02*
X10156423Y16135542D01*
X10129421Y16124358D01*
X10106234Y16106566D01*
X10088442Y16083379D01*
X10077257Y16056377D01*
X10073442Y16027400D01*
X10077257Y15998422D01*
X10088442Y15971420D01*
X10106234Y15948235D01*
X10129421Y15930441D01*
X10156423Y15919257D01*
X10185400Y15915442D01*
X10214377Y15919257D01*
X10241379Y15930441D01*
X10264566Y15948235D01*
X10282358Y15971420D01*
X10293543Y15998422D01*
X10297358Y16027400D01*
X10293543Y16056377D01*
X10282358Y16083379D01*
X10264566Y16106566D01*
X10241379Y16124358D01*
X10214377Y16135542D01*
X10185400Y16139359D01*
D02*
G37*
G36*
X9169400D02*
X9140423Y16135542D01*
X9113421Y16124358D01*
X9090234Y16106566D01*
X9072442Y16083379D01*
X9061257Y16056377D01*
X9057442Y16027400D01*
X9061257Y15998422D01*
X9072442Y15971420D01*
X9090234Y15948235D01*
X9113421Y15930441D01*
X9140423Y15919257D01*
X9169400Y15915442D01*
X9198377Y15919257D01*
X9225379Y15930441D01*
X9248566Y15948235D01*
X9266358Y15971420D01*
X9277543Y15998422D01*
X9281358Y16027400D01*
X9277543Y16056377D01*
X9266358Y16083379D01*
X9248566Y16106566D01*
X9225379Y16124358D01*
X9198377Y16135542D01*
X9169400Y16139359D01*
D02*
G37*
G36*
X23113998Y16754002D02*
X23083717Y16750015D01*
X23055499Y16738329D01*
X23031267Y16719734D01*
X23012674Y16695502D01*
X23000986Y16667284D01*
X22996999Y16637003D01*
X23000986Y16606720D01*
X23012674Y16578502D01*
X23031267Y16554269D01*
X23055499Y16535677D01*
X23078575Y16526118D01*
X23081328Y16510002D01*
X23078575Y16493886D01*
X23055499Y16484328D01*
X23031267Y16465733D01*
X23012674Y16441502D01*
X23000986Y16413284D01*
X22996999Y16383002D01*
X23000986Y16352721D01*
X23012674Y16324503D01*
X23031267Y16300270D01*
X23055499Y16281676D01*
X23078575Y16272118D01*
X23081328Y16256001D01*
X23078575Y16239886D01*
X23055499Y16230327D01*
X23031267Y16211734D01*
X23012674Y16187502D01*
X23000986Y16159283D01*
X22996999Y16129002D01*
X23000986Y16098720D01*
X23012674Y16070502D01*
X23031267Y16046271D01*
X23055499Y16027676D01*
X23078575Y16018118D01*
X23081328Y16002002D01*
X23078575Y15985886D01*
X23055499Y15976328D01*
X23031267Y15957735D01*
X23012674Y15933502D01*
X23000986Y15905284D01*
X22996999Y15875002D01*
X23000986Y15844720D01*
X23012674Y15816501D01*
X23031267Y15792270D01*
X23055499Y15773676D01*
X23078575Y15764117D01*
X23081328Y15748003D01*
X23078575Y15731886D01*
X23055499Y15722328D01*
X23047665Y15716318D01*
X22672333D01*
X22664500Y15722328D01*
X22641425Y15731886D01*
X22638670Y15748003D01*
X22641425Y15764117D01*
X22664500Y15773676D01*
X22688731Y15792270D01*
X22707326Y15816501D01*
X22719012Y15844720D01*
X22723000Y15875002D01*
X22719012Y15905284D01*
X22707326Y15933502D01*
X22688731Y15957735D01*
X22664500Y15976328D01*
X22641425Y15985886D01*
X22638670Y16002002D01*
X22641425Y16018118D01*
X22664500Y16027676D01*
X22688731Y16046271D01*
X22707326Y16070502D01*
X22719012Y16098720D01*
X22723000Y16129002D01*
X22719012Y16159283D01*
X22707326Y16187502D01*
X22688731Y16211734D01*
X22664500Y16230327D01*
X22641425Y16239886D01*
X22638670Y16256001D01*
X22641425Y16272118D01*
X22664500Y16281676D01*
X22688731Y16300270D01*
X22707326Y16324503D01*
X22719012Y16352721D01*
X22723000Y16383002D01*
X22719012Y16413284D01*
X22707326Y16441502D01*
X22688731Y16465733D01*
X22664500Y16484328D01*
X22641425Y16493886D01*
X22638670Y16510002D01*
X22641425Y16526118D01*
X22664500Y16535677D01*
X22688731Y16554269D01*
X22707326Y16578502D01*
X22719012Y16606720D01*
X22723000Y16637003D01*
X22719012Y16667284D01*
X22707326Y16695502D01*
X22688731Y16719734D01*
X22664500Y16738329D01*
X22636282Y16750015D01*
X22606000Y16754002D01*
X22575717Y16750015D01*
X22547499Y16738329D01*
X22523267Y16719734D01*
X22504674Y16695502D01*
X22492986Y16667284D01*
X22488998Y16637003D01*
X22492986Y16606720D01*
X22504674Y16578502D01*
X22523267Y16554269D01*
X22547499Y16535677D01*
X22570575Y16526118D01*
X22573328Y16510002D01*
X22570575Y16493886D01*
X22547499Y16484328D01*
X22523267Y16465733D01*
X22504674Y16441502D01*
X22492986Y16413284D01*
X22488998Y16383002D01*
X22492986Y16352721D01*
X22504674Y16324503D01*
X22523267Y16300270D01*
X22547499Y16281676D01*
X22570575Y16272118D01*
X22573328Y16256001D01*
X22570575Y16239886D01*
X22547499Y16230327D01*
X22523267Y16211734D01*
X22504674Y16187502D01*
X22492986Y16159283D01*
X22488998Y16129002D01*
X22492986Y16098720D01*
X22504674Y16070502D01*
X22523267Y16046271D01*
X22547499Y16027676D01*
X22570575Y16018118D01*
X22573328Y16002002D01*
X22570575Y15985886D01*
X22547499Y15976328D01*
X22523267Y15957735D01*
X22504674Y15933502D01*
X22492986Y15905284D01*
X22488998Y15875002D01*
X22492986Y15844720D01*
X22504674Y15816501D01*
X22523267Y15792270D01*
X22547499Y15773676D01*
X22570575Y15764117D01*
X22573328Y15748003D01*
X22570575Y15731886D01*
X22547499Y15722328D01*
X22539667Y15716318D01*
X22086679D01*
X21428798Y16374197D01*
X21409058Y16389345D01*
X21386069Y16398866D01*
X21361400Y16402115D01*
X18465800D01*
X18441132Y16398866D01*
X18418143Y16389345D01*
X18398402Y16374197D01*
X18045319Y16021115D01*
X17557961D01*
X17538744Y16035860D01*
X17508092Y16048557D01*
X17475200Y16052887D01*
X17442308Y16048557D01*
X17411658Y16035860D01*
X17385336Y16015665D01*
X17365140Y15989343D01*
X17352444Y15958691D01*
X17348112Y15925800D01*
X17352444Y15892908D01*
X17365140Y15862257D01*
X17385336Y15835936D01*
X17411658Y15815739D01*
X17442308Y15803044D01*
X17475200Y15798714D01*
X17508092Y15803044D01*
X17538744Y15815739D01*
X17557961Y15830486D01*
X17989485D01*
Y14009480D01*
X17466322Y13486317D01*
X17442308Y13483156D01*
X17411658Y13470461D01*
X17385336Y13450264D01*
X17372916Y13434077D01*
X17341914Y13444600D01*
Y14655800D01*
X17338667Y14680469D01*
X17329144Y14703458D01*
X17313998Y14723198D01*
X17113316Y14923882D01*
Y15066119D01*
X17121272Y15085329D01*
X17124915Y15113000D01*
X17121272Y15140671D01*
X17110591Y15166457D01*
X17093600Y15188600D01*
X17071457Y15205589D01*
X17045673Y15216270D01*
X17017999Y15219914D01*
X16990329Y15216270D01*
X16964543Y15205589D01*
X16942400Y15188600D01*
X16925410Y15166457D01*
X16914729Y15140671D01*
X16911086Y15113000D01*
X16914729Y15085329D01*
X16922685Y15066119D01*
Y14884399D01*
X16925932Y14859731D01*
X16935455Y14836742D01*
X16950603Y14817001D01*
X17151285Y14616319D01*
Y13113968D01*
X17121272Y13108672D01*
X17110591Y13134457D01*
X17093600Y13156599D01*
X17071457Y13173592D01*
X17045673Y13184271D01*
X17017999Y13187915D01*
X16990329Y13184271D01*
X16964543Y13173592D01*
X16942400Y13156599D01*
X16925410Y13134457D01*
X16914729Y13108672D01*
X16911086Y13081000D01*
X16914729Y13053329D01*
X16925410Y13027544D01*
X16942400Y13005400D01*
X16964543Y12988409D01*
X16990329Y12977728D01*
X17017999Y12974086D01*
X17045673Y12977728D01*
X17071457Y12988409D01*
X17093600Y13005400D01*
X17110591Y13027544D01*
X17121272Y13053328D01*
X17151285Y13048032D01*
Y12605968D01*
X17121272Y12600672D01*
X17110591Y12626457D01*
X17093600Y12648600D01*
X17071457Y12665590D01*
X17045673Y12676271D01*
X17017999Y12679914D01*
X16990329Y12676271D01*
X16964543Y12665590D01*
X16942400Y12648600D01*
X16925410Y12626457D01*
X16914729Y12600671D01*
X16911086Y12573000D01*
X16914729Y12545328D01*
X16925410Y12519543D01*
X16942400Y12497400D01*
X16964543Y12480409D01*
X16990329Y12469728D01*
X17017999Y12466085D01*
X17034142Y12468210D01*
X17151285Y12351066D01*
Y10573968D01*
X17121272Y10568672D01*
X17110591Y10594457D01*
X17093600Y10616600D01*
X17071457Y10633591D01*
X17045673Y10644272D01*
X17017999Y10647915D01*
X16990329Y10644272D01*
X16964543Y10633591D01*
X16942400Y10616600D01*
X16925410Y10594457D01*
X16914729Y10568672D01*
X16911086Y10541000D01*
X16914729Y10513329D01*
X16925410Y10487543D01*
X16942400Y10465400D01*
X16964543Y10448410D01*
X16990329Y10437729D01*
X17017999Y10434086D01*
X17045673Y10437729D01*
X17071457Y10448410D01*
X17093600Y10465400D01*
X17110591Y10487543D01*
X17121272Y10513328D01*
X17151285Y10508032D01*
Y10065968D01*
X17121272Y10060672D01*
X17110591Y10086457D01*
X17093600Y10108600D01*
X17071457Y10125590D01*
X17045673Y10136271D01*
X17017999Y10139914D01*
X16990329Y10136271D01*
X16964543Y10125590D01*
X16942400Y10108600D01*
X16925410Y10086457D01*
X16914729Y10060671D01*
X16911086Y10033000D01*
X16914729Y10005328D01*
X16925410Y9979543D01*
X16942400Y9957400D01*
X16964543Y9940409D01*
X16990329Y9929728D01*
X17017999Y9926085D01*
X17034142Y9928210D01*
X17151285Y9811066D01*
Y9677400D01*
X17154533Y9652731D01*
X17164055Y9629742D01*
X17179202Y9610002D01*
X17587758Y9201446D01*
X17607498Y9186299D01*
X17630486Y9176777D01*
X17655156Y9173529D01*
X20783253D01*
X20808162Y9154416D01*
X20840030Y9141216D01*
X20874226Y9136714D01*
X20908424Y9141216D01*
X20940292Y9154416D01*
X20967657Y9175414D01*
X20988657Y9202779D01*
X21001855Y9234647D01*
X21006358Y9268844D01*
X21001855Y9303042D01*
X20988657Y9334909D01*
X20967657Y9362275D01*
X20940292Y9383273D01*
X20908424Y9396472D01*
X20874226Y9400975D01*
X20840030Y9396472D01*
X20808162Y9383273D01*
X20783253Y9364160D01*
X17694637D01*
X17431194Y9627603D01*
X17438165Y9645568D01*
X17447012Y9655624D01*
X17475200Y9651913D01*
X17508092Y9656244D01*
X17538744Y9668940D01*
X17565063Y9689136D01*
X17585260Y9715457D01*
X17597955Y9746108D01*
X17602287Y9779000D01*
X17597955Y9811892D01*
X17585260Y9842543D01*
X17565063Y9868864D01*
X17538744Y9889060D01*
X17508092Y9901756D01*
X17475200Y9906087D01*
X17442308Y9901756D01*
X17411658Y9889060D01*
X17385336Y9868864D01*
X17372916Y9852677D01*
X17341914Y9863200D01*
Y10710800D01*
X17372916Y10721323D01*
X17385336Y10705136D01*
X17411658Y10684940D01*
X17442308Y10672244D01*
X17475200Y10667913D01*
X17508092Y10672244D01*
X17538744Y10684940D01*
X17565063Y10705136D01*
X17585260Y10731457D01*
X17597955Y10762108D01*
X17601118Y10786122D01*
X18152197Y11337201D01*
X18152197Y11337202D01*
X18167345Y11356942D01*
X18176868Y11379931D01*
X18180116Y11404600D01*
X18180115Y11404602D01*
Y13969998D01*
X18180116Y13970000D01*
X18180115Y13970003D01*
Y15886319D01*
X18505281Y16211485D01*
X21321919D01*
X21979800Y15553604D01*
X21999541Y15538457D01*
X22022528Y15528935D01*
X22047198Y15525687D01*
X22539667D01*
X22547499Y15519676D01*
X22570575Y15510118D01*
X22573328Y15494002D01*
X22570575Y15477885D01*
X22547499Y15468327D01*
X22523267Y15449734D01*
X22504674Y15425502D01*
X22492986Y15397284D01*
X22488998Y15367001D01*
X22492986Y15336720D01*
X22504674Y15308502D01*
X22523267Y15284270D01*
X22547499Y15265675D01*
X22570575Y15256117D01*
X22573328Y15240002D01*
X22570575Y15223886D01*
X22547499Y15214328D01*
X22523267Y15195734D01*
X22504674Y15171503D01*
X22492986Y15143285D01*
X22488998Y15113002D01*
X22492986Y15082719D01*
X22504674Y15054501D01*
X22523267Y15030270D01*
X22547499Y15011676D01*
X22570575Y15002118D01*
X22573328Y14986002D01*
X22570575Y14969885D01*
X22547499Y14960329D01*
X22523267Y14941734D01*
X22504674Y14917502D01*
X22492986Y14889284D01*
X22488998Y14859003D01*
X22492986Y14828720D01*
X22504674Y14800502D01*
X22523267Y14776270D01*
X22547499Y14757677D01*
X22570575Y14748119D01*
X22573328Y14732002D01*
X22570575Y14715886D01*
X22547499Y14706328D01*
X22523267Y14687733D01*
X22504674Y14663503D01*
X22492986Y14635284D01*
X22488998Y14605002D01*
X22492986Y14574719D01*
X22504674Y14546503D01*
X22523267Y14522270D01*
X22547499Y14503676D01*
X22570575Y14494118D01*
X22573328Y14478001D01*
X22570575Y14461887D01*
X22547499Y14452328D01*
X22523267Y14433734D01*
X22504674Y14409502D01*
X22492986Y14381284D01*
X22488998Y14351003D01*
X22492986Y14320720D01*
X22504674Y14292502D01*
X22523267Y14268269D01*
X22547499Y14249677D01*
X22570575Y14240118D01*
X22573328Y14224002D01*
X22570575Y14207886D01*
X22547499Y14198328D01*
X22523267Y14179733D01*
X22504674Y14155502D01*
X22492986Y14127284D01*
X22488998Y14097002D01*
X22492986Y14066721D01*
X22504674Y14038503D01*
X22523267Y14014270D01*
X22547499Y13995676D01*
X22570575Y13986118D01*
X22573328Y13970003D01*
X22570575Y13953886D01*
X22547499Y13944328D01*
X22523267Y13925734D01*
X22504674Y13901501D01*
X22492986Y13873283D01*
X22488998Y13843002D01*
X22492986Y13812720D01*
X22504674Y13784502D01*
X22523267Y13760271D01*
X22547499Y13741676D01*
X22570575Y13732118D01*
X22573328Y13716002D01*
X22570575Y13699886D01*
X22547499Y13690327D01*
X22523267Y13671735D01*
X22504674Y13647502D01*
X22492986Y13619284D01*
X22488998Y13589001D01*
X22492986Y13558720D01*
X22504674Y13530502D01*
X22523267Y13506270D01*
X22547499Y13487675D01*
X22570575Y13478117D01*
X22573328Y13462003D01*
X22570575Y13445886D01*
X22547499Y13436328D01*
X22523267Y13417734D01*
X22504674Y13393501D01*
X22492986Y13365285D01*
X22488998Y13335002D01*
X22492986Y13304720D01*
X22504674Y13276501D01*
X22523267Y13252271D01*
X22547499Y13233676D01*
X22570575Y13224118D01*
X22573328Y13208002D01*
X22570575Y13191885D01*
X22547499Y13182327D01*
X22523267Y13163734D01*
X22504674Y13139502D01*
X22492986Y13111284D01*
X22488998Y13081001D01*
X22492986Y13050720D01*
X22504674Y13022502D01*
X22523267Y12998270D01*
X22547499Y12979675D01*
X22570575Y12970119D01*
X22573328Y12954002D01*
X22570575Y12937886D01*
X22547499Y12928328D01*
X22523267Y12909734D01*
X22504674Y12885503D01*
X22492986Y12857285D01*
X22488998Y12827002D01*
X22492986Y12796720D01*
X22504674Y12768502D01*
X22523267Y12744270D01*
X22547499Y12725676D01*
X22570575Y12716118D01*
X22573328Y12700002D01*
X22570575Y12683886D01*
X22547499Y12674328D01*
X22523267Y12655734D01*
X22504674Y12631502D01*
X22492986Y12603284D01*
X22488998Y12573002D01*
X22492986Y12542720D01*
X22504674Y12514502D01*
X22523267Y12490270D01*
X22547499Y12471676D01*
X22570575Y12462118D01*
X22573328Y12446002D01*
X22570575Y12429886D01*
X22547499Y12420328D01*
X22523267Y12401734D01*
X22504674Y12377502D01*
X22492986Y12349284D01*
X22488998Y12319002D01*
X22492986Y12288720D01*
X22504674Y12260502D01*
X22523267Y12236270D01*
X22547499Y12217676D01*
X22570575Y12208118D01*
X22573328Y12192002D01*
X22570575Y12175886D01*
X22547499Y12166327D01*
X22523267Y12147734D01*
X22504674Y12123502D01*
X22492986Y12095284D01*
X22488998Y12065002D01*
X22492986Y12034720D01*
X22504674Y12006501D01*
X22523267Y11982270D01*
X22547499Y11963676D01*
X22570575Y11954118D01*
X22573328Y11938002D01*
X22570575Y11921886D01*
X22547499Y11912327D01*
X22523267Y11893734D01*
X22504674Y11869502D01*
X22492986Y11841284D01*
X22488998Y11811002D01*
X22492986Y11780720D01*
X22504674Y11752501D01*
X22523267Y11728270D01*
X22547499Y11709676D01*
X22570575Y11700118D01*
X22573328Y11684002D01*
X22570575Y11667886D01*
X22547499Y11658328D01*
X22523267Y11639734D01*
X22504674Y11615502D01*
X22492986Y11587284D01*
X22488998Y11557002D01*
X22492986Y11526720D01*
X22504674Y11498502D01*
X22523267Y11474270D01*
X22547499Y11455676D01*
X22570575Y11446118D01*
X22573328Y11430002D01*
X22570575Y11413886D01*
X22547499Y11404328D01*
X22523267Y11385734D01*
X22504674Y11361502D01*
X22492986Y11333284D01*
X22488998Y11303002D01*
X22492986Y11272720D01*
X22504674Y11244502D01*
X22523267Y11220270D01*
X22547499Y11201676D01*
X22570575Y11192118D01*
X22573328Y11176002D01*
X22570575Y11159886D01*
X22547499Y11150328D01*
X22523267Y11131734D01*
X22504674Y11107502D01*
X22492986Y11079284D01*
X22488998Y11049002D01*
X22492986Y11018720D01*
X22504674Y10990502D01*
X22523267Y10966270D01*
X22547499Y10947676D01*
X22570575Y10938118D01*
X22573328Y10922002D01*
X22570575Y10905886D01*
X22547499Y10896328D01*
X22523267Y10877734D01*
X22504674Y10853502D01*
X22492986Y10825284D01*
X22488998Y10795002D01*
X22492986Y10764720D01*
X22504674Y10736502D01*
X22523267Y10712270D01*
X22547499Y10693676D01*
X22570575Y10684118D01*
X22573328Y10668002D01*
X22570575Y10651886D01*
X22547499Y10642328D01*
X22523267Y10623734D01*
X22504674Y10599502D01*
X22492986Y10571284D01*
X22488998Y10541002D01*
X22492986Y10510720D01*
X22504674Y10482502D01*
X22523267Y10458270D01*
X22547499Y10439676D01*
X22570575Y10430118D01*
X22573328Y10414002D01*
X22570575Y10397886D01*
X22547499Y10388328D01*
X22523267Y10369734D01*
X22504674Y10345502D01*
X22492986Y10317284D01*
X22488998Y10287002D01*
X22492986Y10256720D01*
X22504674Y10228502D01*
X22523267Y10204270D01*
X22547499Y10185676D01*
X22570575Y10176118D01*
X22573328Y10160002D01*
X22570575Y10143886D01*
X22547499Y10134327D01*
X22523267Y10115734D01*
X22504674Y10091502D01*
X22492986Y10063284D01*
X22488998Y10033002D01*
X22492986Y10002720D01*
X22504674Y9974501D01*
X22523267Y9950270D01*
X22547499Y9931676D01*
X22570575Y9922118D01*
X22573328Y9906002D01*
X22570575Y9889886D01*
X22547499Y9880327D01*
X22523267Y9861734D01*
X22504674Y9837502D01*
X22492986Y9809284D01*
X22488998Y9779002D01*
X22492986Y9748720D01*
X22504674Y9720501D01*
X22523267Y9696270D01*
X22547499Y9677676D01*
X22570575Y9668118D01*
X22573328Y9652002D01*
X22570575Y9635886D01*
X22547499Y9626328D01*
X22523267Y9607734D01*
X22504674Y9583502D01*
X22492986Y9555284D01*
X22488998Y9525002D01*
X22492986Y9494720D01*
X22504674Y9466502D01*
X22523267Y9442270D01*
X22547499Y9423676D01*
X22570575Y9414118D01*
X22573328Y9398002D01*
X22570575Y9381886D01*
X22547499Y9372328D01*
X22539667Y9366317D01*
X21535809D01*
X21535603Y9366586D01*
X21508238Y9387584D01*
X21476370Y9400784D01*
X21442172Y9405286D01*
X21407974Y9400784D01*
X21376106Y9387584D01*
X21348743Y9366586D01*
X21327744Y9339221D01*
X21314545Y9307353D01*
X21310042Y9273156D01*
X21314545Y9238958D01*
X21327744Y9207091D01*
X21348743Y9179725D01*
X21376106Y9158727D01*
X21407974Y9145528D01*
X21442172Y9141025D01*
X21476370Y9145528D01*
X21508238Y9158727D01*
X21530341Y9175687D01*
X22539667D01*
X22547499Y9169676D01*
X22570575Y9160118D01*
X22573328Y9144002D01*
X22570575Y9127886D01*
X22547499Y9118328D01*
X22523267Y9099734D01*
X22504674Y9075502D01*
X22492986Y9047284D01*
X22488998Y9017002D01*
X22492986Y8986720D01*
X22504674Y8958502D01*
X22523267Y8934270D01*
X22547499Y8915676D01*
X22559702Y8910622D01*
Y8877068D01*
X22543918Y8870530D01*
X22518204Y8850798D01*
X22498473Y8825083D01*
X22488539Y8801102D01*
X22723460D01*
X22713527Y8825083D01*
X22693794Y8850798D01*
X22668082Y8870530D01*
X22652296Y8877068D01*
Y8910622D01*
X22664500Y8915676D01*
X22688731Y8934270D01*
X22707326Y8958502D01*
X22719012Y8986720D01*
X22723000Y9017002D01*
X22719012Y9047284D01*
X22707326Y9075502D01*
X22688731Y9099734D01*
X22664500Y9118328D01*
X22641425Y9127886D01*
X22638670Y9144002D01*
X22641425Y9160118D01*
X22664500Y9169676D01*
X22672333Y9175687D01*
X23047665D01*
X23055499Y9169676D01*
X23078575Y9160118D01*
X23081328Y9144002D01*
X23078575Y9127886D01*
X23055499Y9118328D01*
X23031267Y9099734D01*
X23012674Y9075502D01*
X23000986Y9047284D01*
X22996999Y9017002D01*
X23000986Y8986720D01*
X23012674Y8958502D01*
X23031267Y8934270D01*
X23055499Y8915676D01*
X23067702Y8910622D01*
Y8877068D01*
X23051918Y8870530D01*
X23026204Y8850798D01*
X23006471Y8825083D01*
X22996539Y8801102D01*
X23231461D01*
X23221527Y8825083D01*
X23201794Y8850798D01*
X23176080Y8870530D01*
X23160297Y8877068D01*
Y8910622D01*
X23172501Y8915676D01*
X23196732Y8934270D01*
X23215324Y8958502D01*
X23227013Y8986720D01*
X23231000Y9017002D01*
X23227013Y9047284D01*
X23215324Y9075502D01*
X23196732Y9099734D01*
X23172501Y9118328D01*
X23149425Y9127886D01*
X23146671Y9144002D01*
X23149425Y9160118D01*
X23172501Y9169676D01*
X23196732Y9188270D01*
X23215324Y9212502D01*
X23227013Y9240720D01*
X23231000Y9271002D01*
X23227013Y9301284D01*
X23215324Y9329502D01*
X23196732Y9353734D01*
X23172501Y9372328D01*
X23149425Y9381886D01*
X23146671Y9398002D01*
X23149425Y9414118D01*
X23172501Y9423676D01*
X23196732Y9442270D01*
X23215324Y9466502D01*
X23227013Y9494720D01*
X23231000Y9525002D01*
X23227013Y9555284D01*
X23215324Y9583502D01*
X23196732Y9607734D01*
X23172501Y9626328D01*
X23149425Y9635886D01*
X23146671Y9652002D01*
X23149425Y9668118D01*
X23172501Y9677676D01*
X23196732Y9696270D01*
X23215324Y9720501D01*
X23227013Y9748720D01*
X23231000Y9779002D01*
X23227013Y9809284D01*
X23215324Y9837502D01*
X23196732Y9861734D01*
X23172501Y9880327D01*
X23149425Y9889886D01*
X23146671Y9906002D01*
X23149425Y9922118D01*
X23172501Y9931676D01*
X23196732Y9950270D01*
X23215324Y9974501D01*
X23227013Y10002720D01*
X23231000Y10033002D01*
X23227013Y10063284D01*
X23215324Y10091502D01*
X23196732Y10115734D01*
X23172501Y10134327D01*
X23149425Y10143886D01*
X23146671Y10160002D01*
X23149425Y10176118D01*
X23172501Y10185676D01*
X23196732Y10204270D01*
X23215324Y10228502D01*
X23227013Y10256720D01*
X23231000Y10287002D01*
X23227013Y10317284D01*
X23215324Y10345502D01*
X23196732Y10369734D01*
X23172501Y10388328D01*
X23149425Y10397886D01*
X23146671Y10414002D01*
X23149425Y10430118D01*
X23172501Y10439676D01*
X23196732Y10458270D01*
X23215324Y10482502D01*
X23227013Y10510720D01*
X23231000Y10541002D01*
X23227013Y10571284D01*
X23215324Y10599502D01*
X23196732Y10623734D01*
X23172501Y10642328D01*
X23149425Y10651886D01*
X23146671Y10668002D01*
X23149425Y10684118D01*
X23172501Y10693676D01*
X23196732Y10712270D01*
X23215324Y10736502D01*
X23227013Y10764720D01*
X23231000Y10795002D01*
X23227013Y10825284D01*
X23215324Y10853502D01*
X23196732Y10877734D01*
X23172501Y10896328D01*
X23149425Y10905886D01*
X23146671Y10922002D01*
X23149425Y10938118D01*
X23172501Y10947676D01*
X23196732Y10966270D01*
X23215324Y10990502D01*
X23227013Y11018720D01*
X23231000Y11049002D01*
X23227013Y11079284D01*
X23215324Y11107502D01*
X23196732Y11131734D01*
X23172501Y11150328D01*
X23149425Y11159886D01*
X23146671Y11176002D01*
X23149425Y11192118D01*
X23172501Y11201676D01*
X23196732Y11220270D01*
X23215324Y11244502D01*
X23227013Y11272720D01*
X23231000Y11303002D01*
X23227013Y11333284D01*
X23215324Y11361502D01*
X23196732Y11385734D01*
X23172501Y11404328D01*
X23149425Y11413886D01*
X23146671Y11430002D01*
X23149425Y11446118D01*
X23172501Y11455676D01*
X23196732Y11474270D01*
X23215324Y11498502D01*
X23227013Y11526720D01*
X23231000Y11557002D01*
X23227013Y11587284D01*
X23215324Y11615502D01*
X23196732Y11639734D01*
X23172501Y11658328D01*
X23149425Y11667886D01*
X23146671Y11684002D01*
X23149425Y11700118D01*
X23172501Y11709676D01*
X23196732Y11728270D01*
X23215324Y11752501D01*
X23227013Y11780720D01*
X23231000Y11811002D01*
X23227013Y11841284D01*
X23215324Y11869502D01*
X23196732Y11893734D01*
X23172501Y11912327D01*
X23149425Y11921886D01*
X23146671Y11938002D01*
X23149425Y11954118D01*
X23172501Y11963676D01*
X23196732Y11982270D01*
X23215324Y12006501D01*
X23227013Y12034720D01*
X23231000Y12065002D01*
X23227013Y12095284D01*
X23215324Y12123502D01*
X23196732Y12147734D01*
X23172501Y12166327D01*
X23149425Y12175886D01*
X23146671Y12192002D01*
X23149425Y12208118D01*
X23172501Y12217676D01*
X23196732Y12236270D01*
X23215324Y12260502D01*
X23227013Y12288720D01*
X23231000Y12319002D01*
X23227013Y12349284D01*
X23215324Y12377502D01*
X23196732Y12401734D01*
X23172501Y12420328D01*
X23149425Y12429886D01*
X23146671Y12446002D01*
X23149425Y12462118D01*
X23172501Y12471676D01*
X23196732Y12490270D01*
X23215324Y12514502D01*
X23227013Y12542720D01*
X23231000Y12573002D01*
X23227013Y12603284D01*
X23215324Y12631502D01*
X23196732Y12655734D01*
X23172501Y12674328D01*
X23149425Y12683886D01*
X23146671Y12700002D01*
X23149425Y12716118D01*
X23172501Y12725676D01*
X23196732Y12744270D01*
X23215324Y12768502D01*
X23227013Y12796720D01*
X23231000Y12827002D01*
X23227013Y12857285D01*
X23215324Y12885503D01*
X23196732Y12909734D01*
X23172501Y12928328D01*
X23149425Y12937886D01*
X23146671Y12954002D01*
X23149425Y12970119D01*
X23172501Y12979675D01*
X23196732Y12998270D01*
X23215324Y13022502D01*
X23227013Y13050720D01*
X23231000Y13081001D01*
X23227013Y13111284D01*
X23215324Y13139502D01*
X23196732Y13163734D01*
X23172501Y13182327D01*
X23149425Y13191885D01*
X23146671Y13208002D01*
X23149425Y13224118D01*
X23172501Y13233676D01*
X23196732Y13252271D01*
X23215324Y13276501D01*
X23227013Y13304720D01*
X23231000Y13335002D01*
X23227013Y13365285D01*
X23215324Y13393501D01*
X23196732Y13417734D01*
X23172501Y13436328D01*
X23149425Y13445886D01*
X23146671Y13462003D01*
X23149425Y13478117D01*
X23172501Y13487675D01*
X23196732Y13506270D01*
X23215324Y13530502D01*
X23227013Y13558720D01*
X23231000Y13589001D01*
X23227013Y13619284D01*
X23215324Y13647502D01*
X23196732Y13671735D01*
X23172501Y13690327D01*
X23149425Y13699886D01*
X23146671Y13716002D01*
X23149425Y13732118D01*
X23172501Y13741676D01*
X23196732Y13760271D01*
X23215324Y13784502D01*
X23227013Y13812720D01*
X23231000Y13843002D01*
X23227013Y13873283D01*
X23215324Y13901501D01*
X23196732Y13925734D01*
X23172501Y13944328D01*
X23149425Y13953886D01*
X23146671Y13970003D01*
X23149425Y13986118D01*
X23172501Y13995676D01*
X23196732Y14014270D01*
X23215324Y14038503D01*
X23227013Y14066721D01*
X23231000Y14097002D01*
X23227013Y14127284D01*
X23215324Y14155502D01*
X23196732Y14179733D01*
X23172501Y14198328D01*
X23149425Y14207886D01*
X23146671Y14224002D01*
X23149425Y14240118D01*
X23172501Y14249677D01*
X23196732Y14268269D01*
X23215324Y14292502D01*
X23227013Y14320720D01*
X23231000Y14351003D01*
X23227013Y14381284D01*
X23215324Y14409502D01*
X23196732Y14433734D01*
X23172501Y14452328D01*
X23149425Y14461887D01*
X23146671Y14478001D01*
X23149425Y14494118D01*
X23172501Y14503676D01*
X23196732Y14522270D01*
X23215324Y14546503D01*
X23227013Y14574719D01*
X23231000Y14605002D01*
X23227013Y14635284D01*
X23215324Y14663503D01*
X23196732Y14687733D01*
X23172501Y14706328D01*
X23149425Y14715886D01*
X23146671Y14732002D01*
X23149425Y14748119D01*
X23172501Y14757677D01*
X23196732Y14776270D01*
X23215324Y14800502D01*
X23227013Y14828720D01*
X23231000Y14859003D01*
X23227013Y14889284D01*
X23215324Y14917502D01*
X23196732Y14941734D01*
X23172501Y14960329D01*
X23149425Y14969885D01*
X23146671Y14986002D01*
X23149425Y15002118D01*
X23172501Y15011676D01*
X23196732Y15030270D01*
X23215324Y15054501D01*
X23227013Y15082719D01*
X23231000Y15113002D01*
X23227013Y15143285D01*
X23215324Y15171503D01*
X23196732Y15195734D01*
X23172501Y15214328D01*
X23149425Y15223886D01*
X23146671Y15240002D01*
X23149425Y15256117D01*
X23172501Y15265675D01*
X23196732Y15284270D01*
X23215324Y15308502D01*
X23227013Y15336720D01*
X23231000Y15367001D01*
X23227013Y15397284D01*
X23215324Y15425502D01*
X23196732Y15449734D01*
X23172501Y15468327D01*
X23149425Y15477885D01*
X23146671Y15494002D01*
X23149425Y15510118D01*
X23172501Y15519676D01*
X23196732Y15538271D01*
X23215324Y15562502D01*
X23227013Y15590720D01*
X23231000Y15621002D01*
X23227013Y15651283D01*
X23215324Y15679501D01*
X23196732Y15703734D01*
X23172501Y15722328D01*
X23149425Y15731886D01*
X23146671Y15748003D01*
X23149425Y15764117D01*
X23172501Y15773676D01*
X23196732Y15792270D01*
X23215324Y15816501D01*
X23227013Y15844720D01*
X23231000Y15875002D01*
X23227013Y15905284D01*
X23215324Y15933502D01*
X23196732Y15957735D01*
X23172501Y15976328D01*
X23149425Y15985886D01*
X23146671Y16002002D01*
X23149425Y16018118D01*
X23172501Y16027676D01*
X23196732Y16046271D01*
X23215324Y16070502D01*
X23227013Y16098720D01*
X23231000Y16129002D01*
X23227013Y16159283D01*
X23215324Y16187502D01*
X23196732Y16211734D01*
X23172501Y16230327D01*
X23149425Y16239886D01*
X23146671Y16256001D01*
X23149425Y16272118D01*
X23172501Y16281676D01*
X23196732Y16300270D01*
X23215324Y16324503D01*
X23227013Y16352721D01*
X23231000Y16383002D01*
X23227013Y16413284D01*
X23215324Y16441502D01*
X23196732Y16465733D01*
X23172501Y16484328D01*
X23149425Y16493886D01*
X23146671Y16510002D01*
X23149425Y16526118D01*
X23172501Y16535677D01*
X23196732Y16554269D01*
X23215324Y16578502D01*
X23227013Y16606720D01*
X23231000Y16637003D01*
X23227013Y16667284D01*
X23215324Y16695502D01*
X23196732Y16719734D01*
X23172501Y16738329D01*
X23144283Y16750015D01*
X23113998Y16754002D01*
D02*
G37*
G36*
X17017999Y15727914D02*
X16990329Y15724272D01*
X16964543Y15713591D01*
X16942400Y15696600D01*
X16925410Y15674457D01*
X16914729Y15648672D01*
X16911086Y15621001D01*
X16914729Y15593329D01*
X16925410Y15567543D01*
X16942400Y15545399D01*
X16964543Y15528410D01*
X16990329Y15517729D01*
X17017999Y15514085D01*
X17045673Y15517729D01*
X17071457Y15528410D01*
X17093600Y15545399D01*
X17110591Y15567543D01*
X17121272Y15593329D01*
X17124915Y15621001D01*
X17121272Y15648672D01*
X17110591Y15674457D01*
X17093600Y15696600D01*
X17071457Y15713591D01*
X17045673Y15724272D01*
X17017999Y15727914D01*
D02*
G37*
G36*
X16510001D02*
X16482327Y15724272D01*
X16456543Y15713591D01*
X16434399Y15696600D01*
X16417409Y15674458D01*
X16406729Y15648672D01*
X16403085Y15621001D01*
X16406729Y15593329D01*
X16417409Y15567543D01*
X16434399Y15545399D01*
X16456543Y15528410D01*
X16482327Y15517729D01*
X16510001Y15514085D01*
X16537672Y15517729D01*
X16563457Y15528410D01*
X16585600Y15545399D01*
X16602591Y15567543D01*
X16613271Y15593329D01*
X16616914Y15621001D01*
X16613271Y15648672D01*
X16602591Y15674458D01*
X16585600Y15696600D01*
X16563457Y15713591D01*
X16537672Y15724272D01*
X16510001Y15727914D01*
D02*
G37*
G36*
X15773399Y15912283D02*
X15087601D01*
X15063612Y15907513D01*
X15043275Y15893925D01*
X14879597Y15730246D01*
X14859000Y15732957D01*
X14830023Y15729143D01*
X14803021Y15717958D01*
X14779834Y15700166D01*
X14762042Y15676979D01*
X14750858Y15649977D01*
X14747633Y15625491D01*
X14716367D01*
X14713142Y15649977D01*
X14701958Y15676979D01*
X14684166Y15700166D01*
X14660979Y15717958D01*
X14633977Y15729143D01*
X14605000Y15732957D01*
X14576022Y15729143D01*
X14549020Y15717958D01*
X14525835Y15700166D01*
X14508041Y15676979D01*
X14496857Y15649977D01*
X14493042Y15621001D01*
X14496857Y15592023D01*
X14508041Y15565021D01*
X14525835Y15541833D01*
X14549020Y15524042D01*
X14576022Y15512857D01*
X14605000Y15509042D01*
X14633977Y15512857D01*
X14660979Y15524042D01*
X14684166Y15541833D01*
X14701958Y15565021D01*
X14713142Y15592023D01*
X14716367Y15616508D01*
X14747633D01*
X14750858Y15592023D01*
X14762042Y15565021D01*
X14779834Y15541833D01*
X14803021Y15524042D01*
X14830023Y15512857D01*
X14859000Y15509042D01*
X14887978Y15512857D01*
X14914980Y15524042D01*
X14938165Y15541833D01*
X14955959Y15565021D01*
X14967143Y15592023D01*
X14970366Y15616508D01*
X15001634D01*
X15004857Y15592023D01*
X15016042Y15565021D01*
X15033833Y15541833D01*
X15057021Y15524042D01*
X15084023Y15512857D01*
X15113000Y15509042D01*
X15141977Y15512857D01*
X15168979Y15524042D01*
X15192166Y15541833D01*
X15209958Y15565021D01*
X15221143Y15592023D01*
X15224957Y15621001D01*
X15221143Y15649977D01*
X15209958Y15676979D01*
X15192166Y15700166D01*
X15168979Y15717958D01*
X15141977Y15729143D01*
X15113000Y15732957D01*
X15101999Y15731509D01*
X15087520Y15760870D01*
X15113565Y15786916D01*
X15747435D01*
X15897211Y15637141D01*
X15895085Y15621001D01*
X15898727Y15593329D01*
X15909409Y15567543D01*
X15926401Y15545399D01*
X15948543Y15528410D01*
X15974329Y15517729D01*
X16002000Y15514085D01*
X16029671Y15517729D01*
X16055457Y15528410D01*
X16077600Y15545399D01*
X16094591Y15567543D01*
X16105270Y15593329D01*
X16108914Y15621001D01*
X16105270Y15648672D01*
X16094591Y15674457D01*
X16077600Y15696600D01*
X16055457Y15713591D01*
X16029671Y15724272D01*
X16002000Y15727914D01*
X15985860Y15725790D01*
X15817725Y15893925D01*
X15797388Y15907513D01*
X15773399Y15912283D01*
D02*
G37*
G36*
X8763000Y15732957D02*
X8734023Y15729143D01*
X8707021Y15717958D01*
X8683834Y15700166D01*
X8666042Y15676979D01*
X8654857Y15649977D01*
X8651042Y15621001D01*
X8654857Y15592023D01*
X8666042Y15565021D01*
X8683834Y15541833D01*
X8707021Y15524042D01*
X8734023Y15512857D01*
X8763000Y15509042D01*
X8791977Y15512857D01*
X8818979Y15524042D01*
X8842166Y15541833D01*
X8859958Y15565021D01*
X8871143Y15592023D01*
X8874958Y15621001D01*
X8871143Y15649977D01*
X8859958Y15676979D01*
X8842166Y15700166D01*
X8818979Y15717958D01*
X8791977Y15729143D01*
X8763000Y15732957D01*
D02*
G37*
G36*
X8001000D02*
X7972023Y15729143D01*
X7945021Y15717958D01*
X7921834Y15700166D01*
X7904042Y15676979D01*
X7892857Y15649977D01*
X7889042Y15621001D01*
X7892857Y15592023D01*
X7904042Y15565021D01*
X7921834Y15541833D01*
X7945021Y15524042D01*
X7972023Y15512857D01*
X8001000Y15509042D01*
X8029977Y15512857D01*
X8056979Y15524042D01*
X8080166Y15541833D01*
X8097958Y15565021D01*
X8109143Y15592023D01*
X8112958Y15621001D01*
X8109143Y15649977D01*
X8097958Y15676979D01*
X8080166Y15700166D01*
X8056979Y15717958D01*
X8029977Y15729143D01*
X8001000Y15732957D01*
D02*
G37*
G36*
X8509000Y15478958D02*
X8480023Y15475143D01*
X8453021Y15463959D01*
X8429834Y15446165D01*
X8412042Y15422980D01*
X8400857Y15395976D01*
X8397042Y15367000D01*
X8400857Y15338023D01*
X8412042Y15311021D01*
X8429834Y15287834D01*
X8453021Y15270042D01*
X8480023Y15258858D01*
X8478169Y15228059D01*
X8449441Y15216161D01*
X8424770Y15197231D01*
X8405840Y15172559D01*
X8396951Y15151100D01*
X8509000D01*
X8621049D01*
X8612160Y15172559D01*
X8593230Y15197231D01*
X8568559Y15216161D01*
X8539831Y15228059D01*
X8537977Y15258858D01*
X8564979Y15270042D01*
X8588166Y15287834D01*
X8605958Y15311021D01*
X8617143Y15338023D01*
X8620958Y15367000D01*
X8617143Y15395976D01*
X8605958Y15422980D01*
X8588166Y15446165D01*
X8564979Y15463959D01*
X8537977Y15475143D01*
X8509000Y15478958D01*
D02*
G37*
G36*
X16510001Y15219914D02*
X16482327Y15216270D01*
X16456543Y15205589D01*
X16434399Y15188600D01*
X16417409Y15166457D01*
X16406729Y15140671D01*
X16403085Y15113000D01*
X16406729Y15085329D01*
X16417409Y15059541D01*
X16434399Y15037399D01*
X16456543Y15020409D01*
X16482327Y15009727D01*
X16510001Y15006085D01*
X16537672Y15009727D01*
X16563457Y15020409D01*
X16585600Y15037399D01*
X16602591Y15059541D01*
X16613271Y15085329D01*
X16616914Y15113000D01*
X16613271Y15140671D01*
X16602591Y15166457D01*
X16585600Y15188600D01*
X16563457Y15205589D01*
X16537672Y15216270D01*
X16510001Y15219914D01*
D02*
G37*
G36*
X16002000D02*
X15974329Y15216270D01*
X15948543Y15205589D01*
X15926401Y15188600D01*
X15909409Y15166457D01*
X15898727Y15140671D01*
X15895085Y15113000D01*
X15898727Y15085329D01*
X15909409Y15059543D01*
X15926401Y15037399D01*
X15948543Y15020409D01*
X15974329Y15009727D01*
X16002000Y15006085D01*
X16029671Y15009727D01*
X16055457Y15020409D01*
X16077600Y15037399D01*
X16094591Y15059543D01*
X16105270Y15085329D01*
X16108914Y15113000D01*
X16105270Y15140671D01*
X16094591Y15166457D01*
X16077600Y15188600D01*
X16055457Y15205589D01*
X16029671Y15216270D01*
X16002000Y15219914D01*
D02*
G37*
G36*
X8621049Y15074899D02*
X8547100D01*
Y15000951D01*
X8568559Y15009840D01*
X8593230Y15028770D01*
X8612160Y15053441D01*
X8621049Y15074899D01*
D02*
G37*
G36*
X8470900D02*
X8396951D01*
X8405840Y15053441D01*
X8424770Y15028770D01*
X8449441Y15009840D01*
X8470900Y15000951D01*
Y15074899D01*
D02*
G37*
G36*
X15113000Y14970958D02*
X15084023Y14967143D01*
X15057021Y14955959D01*
X15033833Y14938165D01*
X15016042Y14914980D01*
X15004857Y14887978D01*
X15001633Y14863492D01*
X14970367D01*
X14967143Y14887978D01*
X14955959Y14914980D01*
X14938165Y14938165D01*
X14914980Y14955959D01*
X14887978Y14967143D01*
X14859000Y14970958D01*
X14830023Y14967143D01*
X14803021Y14955959D01*
X14779834Y14938165D01*
X14762042Y14914980D01*
X14750858Y14887978D01*
X14747041Y14859000D01*
X14750858Y14830023D01*
X14762042Y14803021D01*
X14779834Y14779834D01*
X14803021Y14762042D01*
X14830023Y14750858D01*
X14859000Y14747041D01*
X14887978Y14750858D01*
X14914980Y14762042D01*
X14938165Y14779834D01*
X14955959Y14803021D01*
X14967143Y14830023D01*
X14970367Y14854507D01*
X15001633D01*
X15004857Y14830023D01*
X15016042Y14803021D01*
X15033833Y14779834D01*
X15057021Y14762042D01*
X15084023Y14750858D01*
X15113000Y14747041D01*
X15141977Y14750858D01*
X15168979Y14762042D01*
X15192166Y14779834D01*
X15209958Y14803021D01*
X15221143Y14830023D01*
X15224957Y14859000D01*
X15221143Y14887978D01*
X15209958Y14914980D01*
X15192166Y14938165D01*
X15168979Y14955959D01*
X15141977Y14967143D01*
X15113000Y14970958D01*
D02*
G37*
G36*
X17475200Y15036887D02*
X17442308Y15032556D01*
X17411658Y15019859D01*
X17385336Y14999664D01*
X17365140Y14973343D01*
X17352444Y14942693D01*
X17348112Y14909801D01*
X17352444Y14876907D01*
X17365140Y14846257D01*
X17385336Y14819936D01*
X17411658Y14799741D01*
X17442308Y14787044D01*
X17475200Y14782713D01*
X17508092Y14787044D01*
X17538744Y14799741D01*
X17565063Y14819936D01*
X17585260Y14846257D01*
X17597955Y14876907D01*
X17602287Y14909801D01*
X17597955Y14942693D01*
X17585260Y14973343D01*
X17565063Y14999664D01*
X17538744Y15019859D01*
X17508092Y15032556D01*
X17475200Y15036887D01*
D02*
G37*
G36*
X14716000Y14970000D02*
X14494000D01*
Y14748000D01*
X14716000D01*
Y14970000D01*
D02*
G37*
G36*
X8763000Y14970958D02*
X8734023Y14967143D01*
X8707021Y14955959D01*
X8683834Y14938165D01*
X8666042Y14914980D01*
X8654857Y14887978D01*
X8651042Y14859000D01*
X8654857Y14830023D01*
X8666042Y14803021D01*
X8683834Y14779834D01*
X8707021Y14762042D01*
X8734023Y14750858D01*
X8763000Y14747041D01*
X8791977Y14750858D01*
X8818979Y14762042D01*
X8842166Y14779834D01*
X8859958Y14803021D01*
X8871143Y14830023D01*
X8874958Y14859000D01*
X8871143Y14887978D01*
X8859958Y14914980D01*
X8842166Y14938165D01*
X8818979Y14955959D01*
X8791977Y14967143D01*
X8763000Y14970958D01*
D02*
G37*
G36*
X8001000D02*
X7972023Y14967143D01*
X7945021Y14955959D01*
X7921834Y14938165D01*
X7904042Y14914980D01*
X7892857Y14887978D01*
X7889042Y14859000D01*
X7892857Y14830023D01*
X7904042Y14803021D01*
X7921834Y14779834D01*
X7945021Y14762042D01*
X7972023Y14750858D01*
X8001000Y14747041D01*
X8029977Y14750858D01*
X8056979Y14762042D01*
X8080166Y14779834D01*
X8097958Y14803021D01*
X8109143Y14830023D01*
X8112958Y14859000D01*
X8109143Y14887978D01*
X8097958Y14914980D01*
X8080166Y14938165D01*
X8056979Y14955959D01*
X8029977Y14967143D01*
X8001000Y14970958D01*
D02*
G37*
G36*
X15621001Y14589958D02*
X15592023Y14586143D01*
X15565021Y14574957D01*
X15541833Y14557166D01*
X15524042Y14533978D01*
X15512857Y14506976D01*
X15509042Y14478000D01*
X15512857Y14449023D01*
X15524042Y14422021D01*
X15541833Y14398834D01*
X15565021Y14381042D01*
X15592023Y14369856D01*
X15621001Y14366042D01*
X15649977Y14369856D01*
X15676979Y14381042D01*
X15700166Y14398834D01*
X15717958Y14422021D01*
X15729143Y14449023D01*
X15732957Y14478000D01*
X15729143Y14506976D01*
X15717958Y14533978D01*
X15700166Y14557166D01*
X15676979Y14574957D01*
X15649977Y14586143D01*
X15621001Y14589958D01*
D02*
G37*
G36*
X14605000D02*
X14576022Y14586143D01*
X14549020Y14574957D01*
X14525835Y14557166D01*
X14508041Y14533978D01*
X14496857Y14506976D01*
X14493042Y14478000D01*
X14496857Y14449023D01*
X14508041Y14422021D01*
X14525835Y14398834D01*
X14549020Y14381042D01*
X14576022Y14369856D01*
X14605000Y14366042D01*
X14633977Y14369856D01*
X14660979Y14381042D01*
X14684166Y14398834D01*
X14701958Y14422021D01*
X14713142Y14449023D01*
X14716959Y14478000D01*
X14713142Y14506976D01*
X14701958Y14533978D01*
X14684166Y14557166D01*
X14660979Y14574957D01*
X14633977Y14586143D01*
X14605000Y14589958D01*
D02*
G37*
G36*
X8420100Y13848038D02*
Y13779500D01*
X8488637D01*
X8480793Y13798438D01*
X8462664Y13822064D01*
X8439038Y13840193D01*
X8420100Y13848038D01*
D02*
G37*
G36*
X8343900D02*
X8324962Y13840193D01*
X8301336Y13822064D01*
X8283207Y13798438D01*
X8275363Y13779500D01*
X8343900D01*
Y13848038D01*
D02*
G37*
G36*
X8488637Y13703300D02*
X8420100D01*
Y13634763D01*
X8439038Y13642607D01*
X8462664Y13660736D01*
X8480793Y13684361D01*
X8488637Y13703300D01*
D02*
G37*
G36*
X8343900D02*
X8275363D01*
X8283207Y13684361D01*
X8301336Y13660736D01*
X8324962Y13642607D01*
X8343900Y13634763D01*
Y13703300D01*
D02*
G37*
G36*
X14135100Y13624849D02*
Y13550900D01*
X14209048D01*
X14200160Y13572359D01*
X14181230Y13597031D01*
X14156560Y13615961D01*
X14135100Y13624849D01*
D02*
G37*
G36*
X14058900D02*
X14037440Y13615961D01*
X14012770Y13597031D01*
X13993840Y13572359D01*
X13984950Y13550900D01*
X14058900D01*
Y13624849D01*
D02*
G37*
G36*
X8128000Y13706184D02*
X8104244Y13703056D01*
X8082107Y13693887D01*
X8063098Y13679301D01*
X8048512Y13660292D01*
X8039342Y13638156D01*
X8036215Y13614400D01*
X8039342Y13590643D01*
X8048512Y13568507D01*
X8063098Y13549498D01*
X8082107Y13534912D01*
X8104244Y13525743D01*
X8128000Y13522615D01*
X8151755Y13525743D01*
X8173892Y13534912D01*
X8192902Y13549498D01*
X8207488Y13568507D01*
X8216657Y13590643D01*
X8219785Y13614400D01*
X8216657Y13638156D01*
X8207488Y13660292D01*
X8192902Y13679301D01*
X8173892Y13693887D01*
X8151755Y13703056D01*
X8128000Y13706184D01*
D02*
G37*
G36*
X16510001Y13624757D02*
X16481023Y13620943D01*
X16454021Y13609758D01*
X16430833Y13591966D01*
X16413042Y13568779D01*
X16401857Y13541777D01*
X16398042Y13512801D01*
X16401857Y13483823D01*
X16413042Y13456821D01*
X16430833Y13433633D01*
X16454021Y13415842D01*
X16481023Y13404657D01*
X16510001Y13400842D01*
X16538977Y13404657D01*
X16565979Y13415842D01*
X16589166Y13433633D01*
X16606958Y13456821D01*
X16618143Y13483823D01*
X16621957Y13512801D01*
X16618143Y13541777D01*
X16606958Y13568779D01*
X16589166Y13591966D01*
X16565979Y13609758D01*
X16538977Y13620943D01*
X16510001Y13624757D01*
D02*
G37*
G36*
X15494000D02*
X15465022Y13620943D01*
X15438020Y13609758D01*
X15414835Y13591966D01*
X15397041Y13568779D01*
X15385857Y13541777D01*
X15382042Y13512801D01*
X15385857Y13483823D01*
X15397041Y13456821D01*
X15414835Y13433633D01*
X15438020Y13415842D01*
X15465022Y13404657D01*
X15494000Y13400842D01*
X15522977Y13404657D01*
X15549979Y13415842D01*
X15573166Y13433633D01*
X15590958Y13456821D01*
X15602142Y13483823D01*
X15605959Y13512801D01*
X15602142Y13541777D01*
X15590958Y13568779D01*
X15573166Y13591966D01*
X15549979Y13609758D01*
X15522977Y13620943D01*
X15494000Y13624757D01*
D02*
G37*
G36*
X15113000D02*
X15084023Y13620943D01*
X15057021Y13609758D01*
X15033833Y13591966D01*
X15016042Y13568779D01*
X15004857Y13541777D01*
X15001042Y13512801D01*
X15004857Y13483823D01*
X15016042Y13456821D01*
X15033833Y13433633D01*
X15057021Y13415842D01*
X15084023Y13404657D01*
X15113000Y13400842D01*
X15141977Y13404657D01*
X15168979Y13415842D01*
X15192166Y13433633D01*
X15209958Y13456821D01*
X15221143Y13483823D01*
X15224957Y13512801D01*
X15221143Y13541777D01*
X15209958Y13568779D01*
X15192166Y13591966D01*
X15168979Y13609758D01*
X15141977Y13620943D01*
X15113000Y13624757D01*
D02*
G37*
G36*
X14209048Y13474699D02*
X14135100D01*
Y13400751D01*
X14156560Y13409641D01*
X14181230Y13428571D01*
X14200160Y13453241D01*
X14209048Y13474699D01*
D02*
G37*
G36*
X14058900D02*
X13984950D01*
X13993840Y13453241D01*
X14012770Y13428571D01*
X14037440Y13409641D01*
X14058900Y13400751D01*
Y13474699D01*
D02*
G37*
G36*
X8382000Y13594315D02*
X8354328Y13590671D01*
X8328543Y13579991D01*
X8306400Y13563000D01*
X8289409Y13540857D01*
X8278729Y13515073D01*
X8275086Y13487399D01*
X8278729Y13459727D01*
X8289409Y13433943D01*
X8306400Y13411800D01*
X8328543Y13394809D01*
X8354328Y13384129D01*
X8382000Y13380486D01*
X8409672Y13384129D01*
X8435457Y13394809D01*
X8457600Y13411800D01*
X8474591Y13433943D01*
X8485271Y13459727D01*
X8488914Y13487399D01*
X8485271Y13515073D01*
X8474591Y13540857D01*
X8457600Y13563000D01*
X8435457Y13579991D01*
X8409672Y13590671D01*
X8382000Y13594315D01*
D02*
G37*
G36*
X10185400Y13599358D02*
X10156423Y13595543D01*
X10129421Y13584358D01*
X10106234Y13566566D01*
X10088442Y13543379D01*
X10077257Y13516377D01*
X10073442Y13487399D01*
X10077257Y13458423D01*
X10088442Y13431421D01*
X10106234Y13408234D01*
X10129421Y13390442D01*
X10156423Y13379257D01*
X10185400Y13375443D01*
X10214377Y13379257D01*
X10241379Y13390442D01*
X10264566Y13408234D01*
X10282358Y13431421D01*
X10293543Y13458423D01*
X10297358Y13487399D01*
X10293543Y13516377D01*
X10282358Y13543379D01*
X10264566Y13566566D01*
X10241379Y13584358D01*
X10214377Y13595543D01*
X10185400Y13599358D01*
D02*
G37*
G36*
X9169400D02*
X9140423Y13595543D01*
X9113421Y13584358D01*
X9090234Y13566566D01*
X9072442Y13543379D01*
X9061257Y13516377D01*
X9057442Y13487399D01*
X9061257Y13458423D01*
X9072442Y13431421D01*
X9090234Y13408234D01*
X9113421Y13390442D01*
X9140423Y13379257D01*
X9169400Y13375443D01*
X9198377Y13379257D01*
X9225379Y13390442D01*
X9248566Y13408234D01*
X9266358Y13431421D01*
X9277543Y13458423D01*
X9281358Y13487399D01*
X9277543Y13516377D01*
X9266358Y13543379D01*
X9248566Y13566566D01*
X9225379Y13584358D01*
X9198377Y13595543D01*
X9169400Y13599358D01*
D02*
G37*
G36*
X16510001Y13187915D02*
X16482327Y13184271D01*
X16456543Y13173592D01*
X16434399Y13156599D01*
X16417409Y13134457D01*
X16406729Y13108672D01*
X16403085Y13081000D01*
X16406729Y13053329D01*
X16417409Y13027544D01*
X16434399Y13005400D01*
X16456543Y12988409D01*
X16482327Y12977728D01*
X16510001Y12974086D01*
X16537672Y12977728D01*
X16563457Y12988409D01*
X16585600Y13005400D01*
X16602591Y13027544D01*
X16613271Y13053329D01*
X16616914Y13081000D01*
X16613271Y13108672D01*
X16602591Y13134457D01*
X16585600Y13156599D01*
X16563457Y13173592D01*
X16537672Y13184271D01*
X16510001Y13187915D01*
D02*
G37*
G36*
X15798801Y13346884D02*
X15062199D01*
X15038213Y13342113D01*
X15017876Y13328525D01*
X14879597Y13190247D01*
X14859000Y13192958D01*
X14830023Y13189143D01*
X14803021Y13177959D01*
X14779834Y13160165D01*
X14762042Y13136980D01*
X14750858Y13109978D01*
X14747633Y13085492D01*
X14716367D01*
X14713142Y13109978D01*
X14701958Y13136980D01*
X14684166Y13160165D01*
X14660979Y13177959D01*
X14633977Y13189143D01*
X14605000Y13192958D01*
X14576022Y13189143D01*
X14549020Y13177959D01*
X14525835Y13160165D01*
X14508041Y13136980D01*
X14496857Y13109978D01*
X14493042Y13081000D01*
X14496857Y13052023D01*
X14508041Y13025021D01*
X14525835Y13001834D01*
X14549020Y12984042D01*
X14576022Y12972858D01*
X14605000Y12969041D01*
X14633977Y12972858D01*
X14660979Y12984042D01*
X14684166Y13001834D01*
X14701958Y13025021D01*
X14713142Y13052023D01*
X14716367Y13076508D01*
X14747633D01*
X14750858Y13052023D01*
X14762042Y13025021D01*
X14779834Y13001834D01*
X14803021Y12984042D01*
X14830023Y12972858D01*
X14859000Y12969041D01*
X14887978Y12972858D01*
X14914980Y12984042D01*
X14938165Y13001834D01*
X14955959Y13025021D01*
X14967143Y13052023D01*
X14970366Y13076508D01*
X15001634D01*
X15004857Y13052023D01*
X15016042Y13025021D01*
X15033833Y13001834D01*
X15057021Y12984042D01*
X15084023Y12972858D01*
X15113000Y12969041D01*
X15141977Y12972858D01*
X15168979Y12984042D01*
X15192166Y13001834D01*
X15209958Y13025021D01*
X15221143Y13052023D01*
X15224957Y13081000D01*
X15221143Y13109978D01*
X15209958Y13136980D01*
X15192166Y13160165D01*
X15168979Y13177959D01*
X15141977Y13189143D01*
X15131549Y13190517D01*
X15133582Y13221516D01*
X15772835D01*
X15897211Y13097141D01*
X15895085Y13081000D01*
X15898727Y13053329D01*
X15909409Y13027544D01*
X15926401Y13005400D01*
X15948543Y12988409D01*
X15974329Y12977728D01*
X16002000Y12974086D01*
X16029671Y12977728D01*
X16055457Y12988409D01*
X16077600Y13005400D01*
X16094591Y13027544D01*
X16105270Y13053329D01*
X16108914Y13081000D01*
X16105270Y13108672D01*
X16094591Y13134457D01*
X16077600Y13156599D01*
X16055457Y13173592D01*
X16029671Y13184271D01*
X16002000Y13187915D01*
X15985860Y13185789D01*
X15843124Y13328525D01*
X15822787Y13342113D01*
X15798801Y13346884D01*
D02*
G37*
G36*
X8763000Y13192958D02*
X8734023Y13189143D01*
X8707021Y13177959D01*
X8683834Y13160165D01*
X8666042Y13136980D01*
X8654857Y13109978D01*
X8651042Y13081000D01*
X8654857Y13052023D01*
X8666042Y13025021D01*
X8683834Y13001834D01*
X8707021Y12984042D01*
X8734023Y12972858D01*
X8763000Y12969041D01*
X8791977Y12972858D01*
X8818979Y12984042D01*
X8842166Y13001834D01*
X8859958Y13025021D01*
X8871143Y13052023D01*
X8874958Y13081000D01*
X8871143Y13109978D01*
X8859958Y13136980D01*
X8842166Y13160165D01*
X8818979Y13177959D01*
X8791977Y13189143D01*
X8763000Y13192958D01*
D02*
G37*
G36*
X8001000D02*
X7972023Y13189143D01*
X7945021Y13177959D01*
X7921834Y13160165D01*
X7904042Y13136980D01*
X7892857Y13109978D01*
X7889042Y13081000D01*
X7892857Y13052023D01*
X7904042Y13025021D01*
X7921834Y13001834D01*
X7945021Y12984042D01*
X7972023Y12972858D01*
X8001000Y12969041D01*
X8029977Y12972858D01*
X8056979Y12984042D01*
X8080166Y13001834D01*
X8097958Y13025021D01*
X8109143Y13052023D01*
X8112958Y13081000D01*
X8109143Y13109978D01*
X8097958Y13136980D01*
X8080166Y13160165D01*
X8056979Y13177959D01*
X8029977Y13189143D01*
X8001000Y13192958D01*
D02*
G37*
G36*
X8509000Y12938959D02*
X8480023Y12935143D01*
X8453021Y12923958D01*
X8429834Y12906166D01*
X8412042Y12882979D01*
X8400857Y12855977D01*
X8397042Y12827000D01*
X8400857Y12798023D01*
X8412042Y12771021D01*
X8429834Y12747834D01*
X8453021Y12730042D01*
X8480023Y12718857D01*
X8478169Y12688060D01*
X8449441Y12676160D01*
X8424770Y12657230D01*
X8405840Y12632559D01*
X8396951Y12611100D01*
X8509000D01*
X8621049D01*
X8612160Y12632559D01*
X8593230Y12657230D01*
X8568559Y12676160D01*
X8539831Y12688060D01*
X8537977Y12718857D01*
X8564979Y12730042D01*
X8588166Y12747834D01*
X8605958Y12771021D01*
X8617143Y12798023D01*
X8620958Y12827000D01*
X8617143Y12855977D01*
X8605958Y12882979D01*
X8588166Y12906166D01*
X8564979Y12923958D01*
X8537977Y12935143D01*
X8509000Y12938959D01*
D02*
G37*
G36*
X16510001Y12679914D02*
X16482327Y12676271D01*
X16456543Y12665590D01*
X16434399Y12648600D01*
X16417409Y12626457D01*
X16406729Y12600671D01*
X16403085Y12573000D01*
X16406729Y12545328D01*
X16417409Y12519542D01*
X16434399Y12497400D01*
X16456543Y12480409D01*
X16482327Y12469728D01*
X16510001Y12466085D01*
X16537672Y12469728D01*
X16563457Y12480409D01*
X16585600Y12497400D01*
X16602591Y12519542D01*
X16613271Y12545328D01*
X16616914Y12573000D01*
X16613271Y12600671D01*
X16602591Y12626457D01*
X16585600Y12648600D01*
X16563457Y12665590D01*
X16537672Y12676271D01*
X16510001Y12679914D01*
D02*
G37*
G36*
X16002000D02*
X15974329Y12676271D01*
X15948543Y12665590D01*
X15926401Y12648600D01*
X15909409Y12626457D01*
X15898727Y12600671D01*
X15895085Y12573000D01*
X15898727Y12545328D01*
X15909409Y12519543D01*
X15926401Y12497400D01*
X15948543Y12480409D01*
X15974329Y12469728D01*
X16002000Y12466085D01*
X16029671Y12469728D01*
X16055457Y12480409D01*
X16077600Y12497400D01*
X16094591Y12519543D01*
X16105270Y12545328D01*
X16108914Y12573000D01*
X16105270Y12600671D01*
X16094591Y12626457D01*
X16077600Y12648600D01*
X16055457Y12665590D01*
X16029671Y12676271D01*
X16002000Y12679914D01*
D02*
G37*
G36*
X8621049Y12534900D02*
X8547100D01*
Y12460951D01*
X8568559Y12469840D01*
X8593230Y12488770D01*
X8612160Y12513441D01*
X8621049Y12534900D01*
D02*
G37*
G36*
X8470900D02*
X8396951D01*
X8405840Y12513441D01*
X8424770Y12488770D01*
X8449441Y12469840D01*
X8470900Y12460951D01*
Y12534900D01*
D02*
G37*
G36*
X15113000Y12430958D02*
X15084023Y12427143D01*
X15057021Y12415958D01*
X15033833Y12398166D01*
X15016042Y12374979D01*
X15004857Y12347977D01*
X15001633Y12323492D01*
X14970367D01*
X14967143Y12347977D01*
X14955959Y12374979D01*
X14938165Y12398166D01*
X14914980Y12415958D01*
X14887978Y12427143D01*
X14859000Y12430958D01*
X14830023Y12427143D01*
X14803021Y12415958D01*
X14779834Y12398166D01*
X14762042Y12374979D01*
X14750858Y12347977D01*
X14747041Y12319000D01*
X14750858Y12290023D01*
X14762042Y12263021D01*
X14779834Y12239834D01*
X14803021Y12222042D01*
X14830023Y12210857D01*
X14859000Y12207042D01*
X14887978Y12210857D01*
X14914980Y12222042D01*
X14938165Y12239834D01*
X14955959Y12263021D01*
X14967143Y12290023D01*
X14970367Y12314508D01*
X15001633D01*
X15004857Y12290023D01*
X15016042Y12263021D01*
X15033833Y12239834D01*
X15057021Y12222042D01*
X15084023Y12210857D01*
X15113000Y12207042D01*
X15141977Y12210857D01*
X15168979Y12222042D01*
X15192166Y12239834D01*
X15209958Y12263021D01*
X15221143Y12290023D01*
X15224957Y12319000D01*
X15221143Y12347977D01*
X15209958Y12374979D01*
X15192166Y12398166D01*
X15168979Y12415958D01*
X15141977Y12427143D01*
X15113000Y12430958D01*
D02*
G37*
G36*
X14716000Y12430000D02*
X14494000D01*
Y12208000D01*
X14716000D01*
Y12430000D01*
D02*
G37*
G36*
X8763000Y12430958D02*
X8734023Y12427143D01*
X8707021Y12415958D01*
X8683834Y12398166D01*
X8666042Y12374979D01*
X8654857Y12347977D01*
X8651042Y12319000D01*
X8654857Y12290023D01*
X8666042Y12263021D01*
X8683834Y12239834D01*
X8707021Y12222042D01*
X8734023Y12210857D01*
X8763000Y12207042D01*
X8791977Y12210857D01*
X8818979Y12222042D01*
X8842166Y12239834D01*
X8859958Y12263021D01*
X8871143Y12290023D01*
X8874958Y12319000D01*
X8871143Y12347977D01*
X8859958Y12374979D01*
X8842166Y12398166D01*
X8818979Y12415958D01*
X8791977Y12427143D01*
X8763000Y12430958D01*
D02*
G37*
G36*
X8001000D02*
X7972023Y12427143D01*
X7945021Y12415958D01*
X7921834Y12398166D01*
X7904042Y12374979D01*
X7892857Y12347977D01*
X7889042Y12319000D01*
X7892857Y12290023D01*
X7904042Y12263021D01*
X7921834Y12239834D01*
X7945021Y12222042D01*
X7972023Y12210857D01*
X8001000Y12207042D01*
X8029977Y12210857D01*
X8056979Y12222042D01*
X8080166Y12239834D01*
X8097958Y12263021D01*
X8109143Y12290023D01*
X8112958Y12319000D01*
X8109143Y12347977D01*
X8097958Y12374979D01*
X8080166Y12398166D01*
X8056979Y12415958D01*
X8029977Y12427143D01*
X8001000Y12430958D01*
D02*
G37*
G36*
X15621001Y12049958D02*
X15592023Y12046143D01*
X15565021Y12034958D01*
X15541833Y12017166D01*
X15524042Y11993979D01*
X15512857Y11966977D01*
X15509042Y11938000D01*
X15512857Y11909023D01*
X15524042Y11882021D01*
X15541833Y11858834D01*
X15565021Y11841042D01*
X15592023Y11829857D01*
X15621001Y11826042D01*
X15649977Y11829857D01*
X15676979Y11841042D01*
X15700166Y11858834D01*
X15717958Y11882021D01*
X15729143Y11909023D01*
X15732957Y11938000D01*
X15729143Y11966977D01*
X15717958Y11993979D01*
X15700166Y12017166D01*
X15676979Y12034958D01*
X15649977Y12046143D01*
X15621001Y12049958D01*
D02*
G37*
G36*
X14605000D02*
X14576022Y12046143D01*
X14549020Y12034958D01*
X14525835Y12017166D01*
X14508041Y11993979D01*
X14496857Y11966977D01*
X14493042Y11938000D01*
X14496857Y11909023D01*
X14508041Y11882021D01*
X14525835Y11858834D01*
X14549020Y11841042D01*
X14576022Y11829857D01*
X14605000Y11826042D01*
X14633977Y11829857D01*
X14660979Y11841042D01*
X14684166Y11858834D01*
X14701958Y11882021D01*
X14713142Y11909023D01*
X14716959Y11938000D01*
X14713142Y11966977D01*
X14701958Y11993979D01*
X14684166Y12017166D01*
X14660979Y12034958D01*
X14633977Y12046143D01*
X14605000Y12049958D01*
D02*
G37*
G36*
X8420100Y11308037D02*
Y11239500D01*
X8488637D01*
X8480793Y11258438D01*
X8462664Y11282064D01*
X8439038Y11300193D01*
X8420100Y11308037D01*
D02*
G37*
G36*
X8343900D02*
X8324962Y11300193D01*
X8301336Y11282064D01*
X8283208Y11258438D01*
X8275363Y11239500D01*
X8343900D01*
Y11308037D01*
D02*
G37*
G36*
X8488637Y11163300D02*
X8420100D01*
Y11094763D01*
X8439038Y11102607D01*
X8462664Y11120736D01*
X8480793Y11144362D01*
X8488637Y11163300D01*
D02*
G37*
G36*
X8343900D02*
X8275363D01*
X8283208Y11144362D01*
X8301336Y11120736D01*
X8324962Y11102607D01*
X8343900Y11094763D01*
Y11163300D01*
D02*
G37*
G36*
X14135100Y11084849D02*
Y11010900D01*
X14209048D01*
X14200160Y11032359D01*
X14181230Y11057030D01*
X14156560Y11075960D01*
X14135100Y11084849D01*
D02*
G37*
G36*
X14058900D02*
X14037440Y11075960D01*
X14012770Y11057030D01*
X13993840Y11032359D01*
X13984950Y11010900D01*
X14058900D01*
Y11084849D01*
D02*
G37*
G36*
X8128000Y11166185D02*
X8104244Y11163057D01*
X8082108Y11153888D01*
X8063098Y11139302D01*
X8048512Y11120292D01*
X8039343Y11098156D01*
X8036215Y11074400D01*
X8039343Y11050644D01*
X8048512Y11028508D01*
X8063098Y11009498D01*
X8082108Y10994912D01*
X8104244Y10985743D01*
X8128000Y10982615D01*
X8151756Y10985743D01*
X8173892Y10994912D01*
X8192902Y11009498D01*
X8207488Y11028508D01*
X8216657Y11050644D01*
X8219785Y11074400D01*
X8216657Y11098156D01*
X8207488Y11120292D01*
X8192902Y11139302D01*
X8173892Y11153888D01*
X8151756Y11163057D01*
X8128000Y11166185D01*
D02*
G37*
G36*
X16510001Y11084758D02*
X16481023Y11080943D01*
X16454021Y11069758D01*
X16430833Y11051966D01*
X16413042Y11028779D01*
X16401857Y11001777D01*
X16398042Y10972800D01*
X16401857Y10943823D01*
X16413042Y10916821D01*
X16430833Y10893634D01*
X16454021Y10875842D01*
X16481023Y10864657D01*
X16510001Y10860842D01*
X16538977Y10864657D01*
X16565979Y10875842D01*
X16589166Y10893634D01*
X16606958Y10916821D01*
X16618143Y10943823D01*
X16621957Y10972800D01*
X16618143Y11001777D01*
X16606958Y11028779D01*
X16589166Y11051966D01*
X16565979Y11069758D01*
X16538977Y11080943D01*
X16510001Y11084758D01*
D02*
G37*
G36*
X14209048Y10934700D02*
X14135100D01*
Y10860751D01*
X14156560Y10869640D01*
X14181230Y10888570D01*
X14200160Y10913241D01*
X14209048Y10934700D01*
D02*
G37*
G36*
X14058900D02*
X13984950D01*
X13993840Y10913241D01*
X14012770Y10888570D01*
X14037440Y10869640D01*
X14058900Y10860751D01*
Y10934700D01*
D02*
G37*
G36*
X8382000Y11054314D02*
X8354329Y11050671D01*
X8328543Y11039991D01*
X8306400Y11023000D01*
X8289410Y11000857D01*
X8278729Y10975072D01*
X8275086Y10947400D01*
X8278729Y10919728D01*
X8289410Y10893943D01*
X8306400Y10871800D01*
X8328543Y10854809D01*
X8354329Y10844129D01*
X8382000Y10840486D01*
X8409672Y10844129D01*
X8435457Y10854809D01*
X8457600Y10871800D01*
X8474591Y10893943D01*
X8485272Y10919728D01*
X8488915Y10947400D01*
X8485272Y10975072D01*
X8474591Y11000857D01*
X8457600Y11023000D01*
X8435457Y11039991D01*
X8409672Y11050671D01*
X8382000Y11054314D01*
D02*
G37*
G36*
X10185400Y11059358D02*
X10156423Y11055543D01*
X10129421Y11044358D01*
X10106234Y11026566D01*
X10088442Y11003379D01*
X10077257Y10976377D01*
X10073442Y10947400D01*
X10077257Y10918423D01*
X10088442Y10891421D01*
X10106234Y10868234D01*
X10129421Y10850442D01*
X10156423Y10839257D01*
X10185400Y10835442D01*
X10214377Y10839257D01*
X10241379Y10850442D01*
X10264566Y10868234D01*
X10282358Y10891421D01*
X10293543Y10918423D01*
X10297358Y10947400D01*
X10293543Y10976377D01*
X10282358Y11003379D01*
X10264566Y11026566D01*
X10241379Y11044358D01*
X10214377Y11055543D01*
X10185400Y11059358D01*
D02*
G37*
G36*
X9169400D02*
X9140423Y11055543D01*
X9113421Y11044358D01*
X9090234Y11026566D01*
X9072442Y11003379D01*
X9061257Y10976377D01*
X9057442Y10947400D01*
X9061257Y10918423D01*
X9072442Y10891421D01*
X9090234Y10868234D01*
X9113421Y10850442D01*
X9140423Y10839257D01*
X9169400Y10835442D01*
X9198377Y10839257D01*
X9225379Y10850442D01*
X9248566Y10868234D01*
X9266358Y10891421D01*
X9277543Y10918423D01*
X9281358Y10947400D01*
X9277543Y10976377D01*
X9266358Y11003379D01*
X9248566Y11026566D01*
X9225379Y11044358D01*
X9198377Y11055543D01*
X9169400Y11059358D01*
D02*
G37*
G36*
X15494000Y11084758D02*
X15465022Y11080943D01*
X15438020Y11069758D01*
X15414835Y11051966D01*
X15397041Y11028779D01*
X15385857Y11001777D01*
X15382042Y10972800D01*
X15385857Y10943823D01*
X15397041Y10916821D01*
X15414835Y10893634D01*
X15438020Y10875842D01*
X15465022Y10864657D01*
X15475452Y10863284D01*
X15473419Y10832284D01*
X15133582D01*
X15131549Y10863284D01*
X15141977Y10864657D01*
X15168979Y10875842D01*
X15192166Y10893634D01*
X15209958Y10916821D01*
X15221143Y10943823D01*
X15224957Y10972800D01*
X15221143Y11001777D01*
X15209958Y11028779D01*
X15192166Y11051966D01*
X15168979Y11069758D01*
X15141977Y11080943D01*
X15113000Y11084758D01*
X15084023Y11080943D01*
X15057021Y11069758D01*
X15033833Y11051966D01*
X15016042Y11028779D01*
X15004857Y11001777D01*
X15001042Y10972800D01*
X15004857Y10943823D01*
X15016042Y10916821D01*
X15033833Y10893634D01*
X15057021Y10875842D01*
X15084023Y10864657D01*
X15094450Y10863284D01*
X15092419Y10832284D01*
X15087601D01*
X15063612Y10827513D01*
X15043275Y10813925D01*
X14879597Y10650246D01*
X14859000Y10652958D01*
X14830023Y10649143D01*
X14803021Y10637958D01*
X14779834Y10620166D01*
X14762042Y10596979D01*
X14750858Y10569977D01*
X14747633Y10545492D01*
X14716367D01*
X14713142Y10569977D01*
X14701958Y10596979D01*
X14684166Y10620166D01*
X14660979Y10637958D01*
X14633977Y10649143D01*
X14605000Y10652958D01*
X14576022Y10649143D01*
X14549020Y10637958D01*
X14525835Y10620166D01*
X14508041Y10596979D01*
X14496857Y10569977D01*
X14493042Y10541000D01*
X14496857Y10512023D01*
X14508041Y10485021D01*
X14525835Y10461834D01*
X14549020Y10444042D01*
X14576022Y10432857D01*
X14605000Y10429042D01*
X14633977Y10432857D01*
X14660979Y10444042D01*
X14684166Y10461834D01*
X14701958Y10485021D01*
X14713142Y10512023D01*
X14716367Y10536508D01*
X14747633D01*
X14750858Y10512023D01*
X14762042Y10485021D01*
X14779834Y10461834D01*
X14803021Y10444042D01*
X14830023Y10432857D01*
X14859000Y10429042D01*
X14887978Y10432857D01*
X14914980Y10444042D01*
X14938165Y10461834D01*
X14955959Y10485021D01*
X14967143Y10512023D01*
X14970366Y10536508D01*
X15001634D01*
X15004857Y10512023D01*
X15016042Y10485021D01*
X15033833Y10461834D01*
X15057021Y10444042D01*
X15084023Y10432857D01*
X15113000Y10429042D01*
X15141977Y10432857D01*
X15168979Y10444042D01*
X15192166Y10461834D01*
X15209958Y10485021D01*
X15221143Y10512023D01*
X15224957Y10541000D01*
X15221143Y10569977D01*
X15209958Y10596979D01*
X15192166Y10620166D01*
X15168979Y10637958D01*
X15141977Y10649143D01*
X15113000Y10652958D01*
X15101999Y10651509D01*
X15087520Y10680871D01*
X15113565Y10706916D01*
X15747435D01*
X15897211Y10557141D01*
X15895085Y10541000D01*
X15898727Y10513329D01*
X15909409Y10487543D01*
X15926401Y10465400D01*
X15948543Y10448410D01*
X15974329Y10437729D01*
X16002000Y10434086D01*
X16029671Y10437729D01*
X16055457Y10448410D01*
X16077600Y10465400D01*
X16094591Y10487543D01*
X16105270Y10513329D01*
X16108914Y10541000D01*
X16105270Y10568672D01*
X16094591Y10594457D01*
X16077600Y10616600D01*
X16055457Y10633591D01*
X16029671Y10644272D01*
X16002000Y10647915D01*
X15985860Y10645790D01*
X15817725Y10813925D01*
X15797388Y10827513D01*
X15773399Y10832284D01*
X15514581D01*
X15512549Y10863284D01*
X15522977Y10864657D01*
X15549979Y10875842D01*
X15573166Y10893634D01*
X15590958Y10916821D01*
X15602142Y10943823D01*
X15605959Y10972800D01*
X15602142Y11001777D01*
X15590958Y11028779D01*
X15573166Y11051966D01*
X15549979Y11069758D01*
X15522977Y11080943D01*
X15494000Y11084758D01*
D02*
G37*
G36*
X16510001Y10647915D02*
X16482327Y10644272D01*
X16456543Y10633591D01*
X16434399Y10616600D01*
X16417409Y10594458D01*
X16406729Y10568672D01*
X16403085Y10541000D01*
X16406729Y10513329D01*
X16417409Y10487543D01*
X16434399Y10465400D01*
X16456543Y10448410D01*
X16482327Y10437729D01*
X16510001Y10434086D01*
X16537672Y10437729D01*
X16563457Y10448410D01*
X16585600Y10465400D01*
X16602591Y10487543D01*
X16613271Y10513329D01*
X16616914Y10541000D01*
X16613271Y10568672D01*
X16602591Y10594458D01*
X16585600Y10616600D01*
X16563457Y10633591D01*
X16537672Y10644272D01*
X16510001Y10647915D01*
D02*
G37*
G36*
X8763000Y10652958D02*
X8734023Y10649143D01*
X8707021Y10637958D01*
X8683834Y10620166D01*
X8666042Y10596979D01*
X8654857Y10569977D01*
X8651042Y10541000D01*
X8654857Y10512023D01*
X8666042Y10485021D01*
X8683834Y10461834D01*
X8707021Y10444042D01*
X8734023Y10432857D01*
X8763000Y10429042D01*
X8791977Y10432857D01*
X8818979Y10444042D01*
X8842166Y10461834D01*
X8859958Y10485021D01*
X8871143Y10512023D01*
X8874958Y10541000D01*
X8871143Y10569977D01*
X8859958Y10596979D01*
X8842166Y10620166D01*
X8818979Y10637958D01*
X8791977Y10649143D01*
X8763000Y10652958D01*
D02*
G37*
G36*
X8001000D02*
X7972023Y10649143D01*
X7945021Y10637958D01*
X7921834Y10620166D01*
X7904042Y10596979D01*
X7892857Y10569977D01*
X7889042Y10541000D01*
X7892857Y10512023D01*
X7904042Y10485021D01*
X7921834Y10461834D01*
X7945021Y10444042D01*
X7972023Y10432857D01*
X8001000Y10429042D01*
X8029977Y10432857D01*
X8056979Y10444042D01*
X8080166Y10461834D01*
X8097958Y10485021D01*
X8109143Y10512023D01*
X8112958Y10541000D01*
X8109143Y10569977D01*
X8097958Y10596979D01*
X8080166Y10620166D01*
X8056979Y10637958D01*
X8029977Y10649143D01*
X8001000Y10652958D01*
D02*
G37*
G36*
X8509000Y10398958D02*
X8480023Y10395143D01*
X8453021Y10383958D01*
X8429834Y10366166D01*
X8412042Y10342979D01*
X8400857Y10315977D01*
X8397042Y10287000D01*
X8400857Y10258023D01*
X8412042Y10231021D01*
X8429834Y10207834D01*
X8453021Y10190042D01*
X8480023Y10178857D01*
X8478169Y10148060D01*
X8449441Y10136160D01*
X8424770Y10117230D01*
X8405840Y10092559D01*
X8396951Y10071100D01*
X8509000D01*
X8621049D01*
X8612160Y10092559D01*
X8593230Y10117230D01*
X8568559Y10136160D01*
X8539831Y10148060D01*
X8537977Y10178857D01*
X8564979Y10190042D01*
X8588166Y10207834D01*
X8605958Y10231021D01*
X8617143Y10258023D01*
X8620958Y10287000D01*
X8617143Y10315977D01*
X8605958Y10342979D01*
X8588166Y10366166D01*
X8564979Y10383958D01*
X8537977Y10395143D01*
X8509000Y10398958D01*
D02*
G37*
G36*
X16510001Y10139914D02*
X16482327Y10136271D01*
X16456543Y10125590D01*
X16434399Y10108600D01*
X16417409Y10086457D01*
X16406729Y10060671D01*
X16403085Y10033000D01*
X16406729Y10005328D01*
X16417409Y9979542D01*
X16434399Y9957400D01*
X16456543Y9940409D01*
X16482327Y9929728D01*
X16510001Y9926085D01*
X16537672Y9929728D01*
X16563457Y9940409D01*
X16585600Y9957400D01*
X16602591Y9979542D01*
X16613271Y10005328D01*
X16616914Y10033000D01*
X16613271Y10060671D01*
X16602591Y10086457D01*
X16585600Y10108600D01*
X16563457Y10125590D01*
X16537672Y10136271D01*
X16510001Y10139914D01*
D02*
G37*
G36*
X16002000D02*
X15974329Y10136271D01*
X15948543Y10125590D01*
X15926401Y10108600D01*
X15909409Y10086457D01*
X15898727Y10060671D01*
X15895085Y10033000D01*
X15898727Y10005328D01*
X15909409Y9979543D01*
X15926401Y9957400D01*
X15948543Y9940409D01*
X15974329Y9929728D01*
X16002000Y9926085D01*
X16029671Y9929728D01*
X16055457Y9940409D01*
X16077600Y9957400D01*
X16094591Y9979543D01*
X16105270Y10005328D01*
X16108914Y10033000D01*
X16105270Y10060671D01*
X16094591Y10086457D01*
X16077600Y10108600D01*
X16055457Y10125590D01*
X16029671Y10136271D01*
X16002000Y10139914D01*
D02*
G37*
G36*
X8621049Y9994900D02*
X8547100D01*
Y9920951D01*
X8568559Y9929840D01*
X8593230Y9948770D01*
X8612160Y9973441D01*
X8621049Y9994900D01*
D02*
G37*
G36*
X8470900D02*
X8396951D01*
X8405840Y9973441D01*
X8424770Y9948770D01*
X8449441Y9929840D01*
X8470900Y9920951D01*
Y9994900D01*
D02*
G37*
G36*
X15113000Y9890958D02*
X15084023Y9887143D01*
X15057021Y9875958D01*
X15033833Y9858166D01*
X15016042Y9834979D01*
X15004857Y9807977D01*
X15001633Y9783492D01*
X14970367D01*
X14967143Y9807977D01*
X14955959Y9834979D01*
X14938165Y9858166D01*
X14914980Y9875958D01*
X14887978Y9887143D01*
X14859000Y9890958D01*
X14830023Y9887143D01*
X14803021Y9875958D01*
X14779834Y9858166D01*
X14762042Y9834979D01*
X14750858Y9807977D01*
X14747041Y9779000D01*
X14750858Y9750023D01*
X14762042Y9723021D01*
X14779834Y9699834D01*
X14803021Y9682042D01*
X14830023Y9670857D01*
X14859000Y9667042D01*
X14887978Y9670857D01*
X14914980Y9682042D01*
X14938165Y9699834D01*
X14955959Y9723021D01*
X14967143Y9750023D01*
X14970367Y9774508D01*
X15001633D01*
X15004857Y9750023D01*
X15016042Y9723021D01*
X15033833Y9699834D01*
X15057021Y9682042D01*
X15084023Y9670857D01*
X15113000Y9667042D01*
X15141977Y9670857D01*
X15168979Y9682042D01*
X15192166Y9699834D01*
X15209958Y9723021D01*
X15221143Y9750023D01*
X15224957Y9779000D01*
X15221143Y9807977D01*
X15209958Y9834979D01*
X15192166Y9858166D01*
X15168979Y9875958D01*
X15141977Y9887143D01*
X15113000Y9890958D01*
D02*
G37*
G36*
X14716000Y9890000D02*
X14494000D01*
Y9668000D01*
X14716000D01*
Y9890000D01*
D02*
G37*
G36*
X8763000Y9890958D02*
X8734023Y9887143D01*
X8707021Y9875958D01*
X8683834Y9858166D01*
X8666042Y9834979D01*
X8654857Y9807977D01*
X8651042Y9779000D01*
X8654857Y9750023D01*
X8666042Y9723021D01*
X8683834Y9699834D01*
X8707021Y9682042D01*
X8734023Y9670857D01*
X8763000Y9667042D01*
X8791977Y9670857D01*
X8818979Y9682042D01*
X8842166Y9699834D01*
X8859958Y9723021D01*
X8871143Y9750023D01*
X8874958Y9779000D01*
X8871143Y9807977D01*
X8859958Y9834979D01*
X8842166Y9858166D01*
X8818979Y9875958D01*
X8791977Y9887143D01*
X8763000Y9890958D01*
D02*
G37*
G36*
X8001000D02*
X7972023Y9887143D01*
X7945021Y9875958D01*
X7921834Y9858166D01*
X7904042Y9834979D01*
X7892857Y9807977D01*
X7889042Y9779000D01*
X7892857Y9750023D01*
X7904042Y9723021D01*
X7921834Y9699834D01*
X7945021Y9682042D01*
X7972023Y9670857D01*
X8001000Y9667042D01*
X8029977Y9670857D01*
X8056979Y9682042D01*
X8080166Y9699834D01*
X8097958Y9723021D01*
X8109143Y9750023D01*
X8112958Y9779000D01*
X8109143Y9807977D01*
X8097958Y9834979D01*
X8080166Y9858166D01*
X8056979Y9875958D01*
X8029977Y9887143D01*
X8001000Y9890958D01*
D02*
G37*
G36*
X15621001Y9509958D02*
X15592023Y9506143D01*
X15565021Y9494958D01*
X15541833Y9477166D01*
X15524042Y9453979D01*
X15512857Y9426977D01*
X15509042Y9398000D01*
X15512857Y9369023D01*
X15524042Y9342021D01*
X15541833Y9318834D01*
X15565021Y9301042D01*
X15592023Y9289857D01*
X15621001Y9286042D01*
X15649977Y9289857D01*
X15676979Y9301042D01*
X15700166Y9318834D01*
X15717958Y9342021D01*
X15729143Y9369023D01*
X15732957Y9398000D01*
X15729143Y9426977D01*
X15717958Y9453979D01*
X15700166Y9477166D01*
X15676979Y9494958D01*
X15649977Y9506143D01*
X15621001Y9509958D01*
D02*
G37*
G36*
X14605000D02*
X14576022Y9506143D01*
X14549020Y9494958D01*
X14525835Y9477166D01*
X14508041Y9453979D01*
X14496857Y9426977D01*
X14493042Y9398000D01*
X14496857Y9369023D01*
X14508041Y9342021D01*
X14525835Y9318834D01*
X14549020Y9301042D01*
X14576022Y9289857D01*
X14605000Y9286042D01*
X14633977Y9289857D01*
X14660979Y9301042D01*
X14684166Y9318834D01*
X14701958Y9342021D01*
X14713142Y9369023D01*
X14716959Y9398000D01*
X14713142Y9426977D01*
X14701958Y9453979D01*
X14684166Y9477166D01*
X14660979Y9494958D01*
X14633977Y9506143D01*
X14605000Y9509958D01*
D02*
G37*
G36*
X23231461Y8724902D02*
X23152100D01*
Y8645541D01*
X23176080Y8655474D01*
X23201794Y8675206D01*
X23221527Y8700921D01*
X23231461Y8724902D01*
D02*
G37*
G36*
X23075899D02*
X22996539D01*
X23006471Y8700921D01*
X23026204Y8675206D01*
X23051918Y8655474D01*
X23075899Y8645541D01*
Y8724902D01*
D02*
G37*
G36*
X22723460D02*
X22644099D01*
Y8645541D01*
X22668082Y8655474D01*
X22693794Y8675206D01*
X22713527Y8700921D01*
X22723460Y8724902D01*
D02*
G37*
G36*
X22567899D02*
X22488539D01*
X22498473Y8700921D01*
X22518204Y8675206D01*
X22543918Y8655474D01*
X22567899Y8645541D01*
Y8724902D01*
D02*
G37*
%LPD*%
D10*
X17017999Y12573000D02*
X17221201Y12369800D01*
X17017999Y10033000D02*
X17221201Y9829800D01*
X14859000Y10541000D02*
X15087601Y10769600D01*
X15773399D01*
X16002000Y10541000D01*
X14859000Y13081000D02*
X15062199Y13284200D01*
X15798801D01*
X16002000Y13081000D01*
X14859000Y15621001D02*
X15087601Y15849600D01*
X15773399D01*
X16002000Y15621001D01*
D11*
X17518324Y5024175D02*
X17653000Y4889500D01*
X17518324Y5024175D02*
X17460606Y4966457D01*
X17447781Y4940805D01*
Y4927979D01*
X17454195Y4908739D01*
X17467020Y4895913D01*
X17486259Y4889500D01*
X17499086D01*
X17524738Y4902326D01*
X17582455Y4960044D02*
X17524738Y4902326D01*
X17511913Y4876674D01*
Y4863848D01*
X17518324Y4844608D01*
X17537564Y4825369D01*
X17556804Y4818956D01*
X17569630D01*
X17595282Y4831782D01*
X17653000Y4889500D01*
X17411226Y4827293D02*
X17430466Y4833706D01*
X17456117D01*
X17481770Y4820880D01*
X17494595Y4808054D01*
X17507423Y4782401D01*
Y4756749D01*
X17501010Y4737510D01*
X17481770Y4718270D01*
X17462531Y4711857D01*
X17436879Y4711857D01*
X17411226Y4724683D01*
X17398399Y4737510D01*
X17385574Y4763162D01*
X17385574Y4788814D01*
X17391988Y4808054D01*
X17411226Y4827293D01*
X17266290Y4772140D02*
X17375313Y4663118D01*
X17388139Y4637465D01*
X17381726Y4618226D01*
X17368900Y4605400D01*
X17330421Y4746488D02*
X17285530Y4701596D01*
X17195746Y4701596D02*
X17304768Y4592574D01*
X17317595Y4566921D01*
X17311182Y4547682D01*
X17298357Y4534856D01*
X17259877Y4675944D02*
X17214986Y4631052D01*
X17157268Y4573335D02*
X17176508Y4579748D01*
X17202159D01*
X17227812Y4566921D01*
X17240639Y4554095D01*
X17253464Y4528443D01*
Y4502790D01*
X17247050Y4483551D01*
X17227812Y4464312D01*
X17208572Y4457899D01*
X17182919Y4457899D01*
X17157268Y4470725D01*
X17144443Y4483551D01*
X17131615Y4509203D01*
X17131615Y4534856D01*
X17138028Y4554095D01*
X17157268Y4573335D01*
X17076463Y4492529D02*
X17166246Y4402746D01*
X17102115Y4466877D02*
X17063637D01*
X17044397Y4460464D01*
X17025159Y4441225D01*
X17018745Y4421985D01*
X17031570Y4396333D01*
X17095702Y4332202D01*
X17031570Y4396333D02*
X16993092D01*
X16973853Y4389920D01*
X16954614Y4370681D01*
X16948201Y4351441D01*
X16961028Y4325789D01*
X17025159Y4261658D01*
X16742342Y4248190D02*
X16877016Y4113516D01*
X16800058Y4036558D01*
X16618568Y4034634D02*
X16708351Y3944851D01*
X16637807Y4015395D02*
X16637807Y4041048D01*
X16644220Y4060287D01*
X16663458Y4079526D01*
X16682700Y4085939D01*
X16708351D01*
X16734004Y4073113D01*
X16746831Y4060287D01*
X16759656Y4034634D01*
Y4008982D01*
X16753242Y3989743D01*
X16734004Y3970504D01*
X16714764Y3964091D01*
X16689111Y3964090D01*
X16576241Y3992308D02*
X16627547Y3864046D01*
X16499284Y3915351D02*
X16627547Y3864046D01*
X16666025Y3851220D01*
X16691676D01*
X16710916Y3857633D01*
X16717329Y3864046D01*
X16515317Y3854427D02*
X16438361Y3777469D01*
X16425534Y3790295D01*
X16419121Y3809535D01*
X16419121Y3822361D01*
X16425534Y3841600D01*
X16444772Y3860840D01*
X16464012Y3867253D01*
X16489665D01*
X16515317Y3854427D01*
X16528143Y3841600D01*
X16540968Y3815948D01*
Y3790296D01*
X16534557Y3771056D01*
X16515317Y3751817D01*
X16496078Y3745404D01*
X16470425D01*
X16371022Y3787089D02*
X16460806Y3697306D01*
X16409502Y3748610D02*
X16383849Y3761437D01*
X16358195D01*
X16338957Y3755024D01*
X16319717Y3735785D01*
D12*
X16408676Y3428946D02*
X16287750Y3259649D01*
X16469141D01*
X16408676Y3428946D02*
Y3175000D01*
D13*
X14097000Y10972800D02*
D03*
X15113000D02*
D03*
X16510001D02*
D03*
X15494000D02*
D03*
X15621001Y9398000D02*
D03*
X14605000D02*
D03*
X16510001Y13512801D02*
D03*
X15494000D02*
D03*
X14097000D02*
D03*
X15113000D02*
D03*
X15621001Y11938000D02*
D03*
X14605000D02*
D03*
X14859000Y10541000D02*
D03*
X14605000D02*
D03*
X15113000D02*
D03*
Y9779000D02*
D03*
X14859000D02*
D03*
Y13081000D02*
D03*
X14605000D02*
D03*
X15113000D02*
D03*
Y12319000D02*
D03*
X14859000D02*
D03*
X15621001Y14478000D02*
D03*
X14605000D02*
D03*
X14859000Y15621001D02*
D03*
X14605000D02*
D03*
X15113000D02*
D03*
Y14859000D02*
D03*
X14859000D02*
D03*
X9169400Y10947400D02*
D03*
X10185400D02*
D03*
X9169400Y13487399D02*
D03*
X10185400D02*
D03*
X9169400Y16027400D02*
D03*
X10185400D02*
D03*
X14097000Y16103600D02*
D03*
X15113000D02*
D03*
X8763000Y9779000D02*
D03*
X8001000D02*
D03*
Y10541000D02*
D03*
X8763000D02*
D03*
X8509000Y10287000D02*
D03*
Y10033000D02*
D03*
X8763000Y12319000D02*
D03*
X8001000D02*
D03*
Y13081000D02*
D03*
X8763000D02*
D03*
X8509000Y12827000D02*
D03*
Y12573000D02*
D03*
X8763000Y14859000D02*
D03*
X8001000D02*
D03*
Y15621001D02*
D03*
X8763000D02*
D03*
X8509000Y15367000D02*
D03*
Y15113000D02*
D03*
X16510001Y16103600D02*
D03*
X15494000D02*
D03*
D14*
X16510001Y10033000D02*
D03*
X16002000D02*
D03*
X17017999Y10541000D02*
D03*
Y10033000D02*
D03*
X16510001Y10541000D02*
D03*
X16002000D02*
D03*
X16510001Y12573000D02*
D03*
X16002000D02*
D03*
X17017999Y13081000D02*
D03*
Y12573000D02*
D03*
X16510001Y13081000D02*
D03*
X16002000D02*
D03*
X16510001Y15113000D02*
D03*
X16002000D02*
D03*
X17017999Y15621001D02*
D03*
Y15113000D02*
D03*
X16510001Y15621001D02*
D03*
X16002000D02*
D03*
X8382000Y13487399D02*
D03*
Y13741400D02*
D03*
X8382000Y10947400D02*
D03*
Y11201400D02*
D03*
Y16027400D02*
D03*
Y16281400D02*
D03*
D15*
X14605000Y9779000D02*
D03*
Y12319000D02*
D03*
Y14859000D02*
D03*
D16*
X17475200Y13360400D02*
D03*
Y12344400D02*
D03*
Y10795000D02*
D03*
Y9779000D02*
D03*
Y15925800D02*
D03*
Y14909801D02*
D03*
D17*
X8128000Y13614400D02*
D03*
X8128000Y11074400D02*
D03*
Y16154401D02*
D03*
D18*
X22606000Y16637003D02*
D03*
Y16383002D02*
D03*
Y16129002D02*
D03*
Y15875002D02*
D03*
Y15621002D02*
D03*
Y15367001D02*
D03*
Y15113002D02*
D03*
Y14859003D02*
D03*
Y12827002D02*
D03*
Y13081001D02*
D03*
Y13335002D02*
D03*
Y13589001D02*
D03*
Y13843002D02*
D03*
Y14097002D02*
D03*
Y14351003D02*
D03*
Y14605002D02*
D03*
Y10795002D02*
D03*
Y11049002D02*
D03*
Y11303002D02*
D03*
Y11557002D02*
D03*
Y11811002D02*
D03*
Y12065002D02*
D03*
Y12319002D02*
D03*
Y12573002D02*
D03*
Y8763002D02*
D03*
Y9017002D02*
D03*
Y9271002D02*
D03*
Y9525002D02*
D03*
Y9779002D02*
D03*
Y10033002D02*
D03*
Y10287002D02*
D03*
Y10541002D02*
D03*
X23113998D02*
D03*
Y10287002D02*
D03*
Y10033002D02*
D03*
Y9779002D02*
D03*
Y9525002D02*
D03*
Y9271002D02*
D03*
Y9017002D02*
D03*
Y8763002D02*
D03*
Y12573002D02*
D03*
Y12319002D02*
D03*
Y12065002D02*
D03*
Y11811002D02*
D03*
Y11557002D02*
D03*
Y11303002D02*
D03*
Y11049002D02*
D03*
Y10795002D02*
D03*
Y14605002D02*
D03*
Y14351003D02*
D03*
Y14097002D02*
D03*
Y13843002D02*
D03*
Y13589001D02*
D03*
Y13335002D02*
D03*
Y13081001D02*
D03*
Y12827002D02*
D03*
Y14859003D02*
D03*
Y15113002D02*
D03*
Y15367001D02*
D03*
Y15621002D02*
D03*
Y15875002D02*
D03*
Y16129002D02*
D03*
Y16383002D02*
D03*
Y16637003D02*
D03*
D20*
X20874226Y9268844D02*
D03*
X21442172Y9273156D02*
D03*
D21*
X8001000Y8255000D02*
D03*
Y17145000D02*
D03*
D22*
X17246600Y9677400D02*
Y14655800D01*
X17017999Y14884399D02*
X17246600Y14655800D01*
X17017999Y14884399D02*
Y15113000D01*
X21361400Y16306799D02*
X22047198Y15621002D01*
X18465800Y16306799D02*
X21361400D01*
X18084801Y15925800D02*
X18465800Y16306799D01*
X18084801Y11404600D02*
Y13970000D01*
X17475200Y10795000D02*
X18084801Y11404600D01*
X17475200Y15925800D02*
X18084801D01*
X17475200Y13360400D02*
X18084801Y13970000D01*
Y15925800D01*
X22047198Y15621002D02*
X22606000D01*
X23113998D01*
X17246600Y9677400D02*
X17655156Y9268844D01*
X20874226D01*
X21442172Y9273156D02*
X21444325Y9271002D01*
X22606000D01*
X23113998D01*
D23*
X23367999Y8255002D02*
D03*
Y17145003D02*
D03*
%TF.MD5,ccd913d63b3a61afe04ced0cca0d937b*%
M02*
