%TF.GenerationSoftware,Altium Limited,Altium Designer,19.1.5 (86)*%
G04 Layer_Color=16711935*
%FSLAX45Y45*%
%MOMM*%
%TF.FileFunction,Keep-out,Top*%
%TF.Part,Single*%
G01*
G75*
%TA.AperFunction,NonConductor*%
%ADD26C,0.20000*%
D26*
X23643993Y8118242D02*
Y8391758D01*
Y17008241D02*
Y17281758D01*
Y8391758D02*
Y17008241D01*
Y7699997D02*
Y8118242D01*
Y17281758D02*
Y17699997D01*
X7643992D02*
X23643993D01*
X7643992Y7699997D02*
X23643993D01*
X7643992D02*
Y17699997D01*
%TF.MD5,2d7ce75b0aa3e2e908d6cb155edaf96f*%
M02*
