%TF.GenerationSoftware,Altium Limited,Altium Designer,19.1.5 (86)*%
G04 Layer_Color=32896*
%FSLAX45Y45*%
%MOMM*%
%TF.FileFunction,Legend,Bot*%
%TF.Part,Single*%
G01*
G75*
%TA.AperFunction,NonConductor*%
%ADD21C,0.17780*%
D21*
X22098000Y4762459D02*
Y4572000D01*
Y4762459D02*
X22016376D01*
X21989166Y4753390D01*
X21980096Y4744320D01*
X21971027Y4726181D01*
Y4708042D01*
X21980096Y4689903D01*
X21989166Y4680834D01*
X22016376Y4671764D01*
X22098000D02*
X22016376D01*
X21989166Y4662695D01*
X21980096Y4653625D01*
X21971027Y4635486D01*
Y4608278D01*
X21980096Y4590139D01*
X21989166Y4581070D01*
X22016376Y4572000D01*
X22098000D01*
X21883054Y4698973D02*
X21901192Y4689903D01*
X21919331Y4671764D01*
X21928401Y4644556D01*
Y4626417D01*
X21919331Y4599208D01*
X21901192Y4581070D01*
X21883054Y4572000D01*
X21855846D01*
X21837706Y4581070D01*
X21819566Y4599208D01*
X21810497Y4626417D01*
Y4644556D01*
X21819566Y4671764D01*
X21837706Y4689903D01*
X21855846Y4698973D01*
X21883054D01*
X21741570Y4762459D02*
Y4608278D01*
X21732500Y4581070D01*
X21714362Y4572000D01*
X21696222D01*
X21768777Y4698973D02*
X21705292D01*
X21641805Y4762459D02*
Y4608278D01*
X21632735Y4581070D01*
X21614597Y4572000D01*
X21596457D01*
X21669012Y4698973D02*
X21605527D01*
X21523901D02*
X21542039Y4689903D01*
X21560179Y4671764D01*
X21569249Y4644556D01*
Y4626417D01*
X21560179Y4599208D01*
X21542039Y4581070D01*
X21523901Y4572000D01*
X21496693D01*
X21478554Y4581070D01*
X21460416Y4599208D01*
X21451346Y4626417D01*
Y4644556D01*
X21460416Y4671764D01*
X21478554Y4689903D01*
X21496693Y4698973D01*
X21523901D01*
X21409625D02*
Y4572000D01*
Y4662695D02*
X21382417Y4689903D01*
X21364279Y4698973D01*
X21337070D01*
X21318932Y4689903D01*
X21309862Y4662695D01*
Y4572000D01*
Y4662695D02*
X21282652Y4689903D01*
X21264514Y4698973D01*
X21237306D01*
X21219167Y4689903D01*
X21210097Y4662695D01*
Y4572000D01*
X20946175Y4762459D02*
X20964314Y4753390D01*
X20982452Y4735251D01*
X20991524Y4717112D01*
X21000592Y4689903D01*
Y4644556D01*
X20991524Y4617347D01*
X20982452Y4599208D01*
X20964314Y4581070D01*
X20946175Y4572000D01*
X20909897D01*
X20891759Y4581070D01*
X20873619Y4599208D01*
X20864549Y4617347D01*
X20855481Y4644556D01*
Y4689903D01*
X20864549Y4717112D01*
X20873619Y4735251D01*
X20891759Y4753390D01*
X20909897Y4762459D01*
X20946175D01*
X20811040Y4698973D02*
X20756622Y4572000D01*
X20702206Y4698973D02*
X20756622Y4572000D01*
X20671370Y4644556D02*
X20562537D01*
Y4662695D01*
X20571606Y4680834D01*
X20580675Y4689903D01*
X20598814Y4698973D01*
X20626022D01*
X20644160Y4689903D01*
X20662300Y4671764D01*
X20671370Y4644556D01*
Y4626417D01*
X20662300Y4599208D01*
X20644160Y4581070D01*
X20626022Y4572000D01*
X20598814D01*
X20580675Y4581070D01*
X20562537Y4599208D01*
X20521722Y4698973D02*
Y4572000D01*
Y4644556D02*
X20512654Y4671764D01*
X20494514Y4689903D01*
X20476376Y4698973D01*
X20449168D01*
X20431937Y4762459D02*
Y4572000D01*
X20283195Y4698973D02*
Y4572000D01*
Y4671764D02*
X20301335Y4689903D01*
X20319473Y4698973D01*
X20346683D01*
X20364821Y4689903D01*
X20382961Y4671764D01*
X20392030Y4644556D01*
Y4626417D01*
X20382961Y4599208D01*
X20364821Y4581070D01*
X20346683Y4572000D01*
X20319473D01*
X20301335Y4581070D01*
X20283195Y4599208D01*
X20223337Y4698973D02*
X20168921Y4572000D01*
X20114503Y4698973D02*
X20168921Y4572000D01*
X20187059Y4535722D01*
X20205199Y4517583D01*
X20223337Y4508514D01*
X20232407D01*
%TF.MD5,59401135b7606d767790e44cab77fa6a*%
M02*
