%TF.GenerationSoftware,Altium Limited,Altium Designer,19.1.5 (86)*%
G04 Layer_Color=128*
%FSLAX45Y45*%
%MOMM*%
%TF.FileFunction,Paste,Bot*%
%TF.Part,Single*%
G01*
G75*
%TA.AperFunction,NonConductor*%
%ADD21C,0.17780*%
D21*
X22098000Y4254459D02*
Y4064000D01*
Y4254459D02*
X22016376D01*
X21989166Y4245390D01*
X21980096Y4236320D01*
X21971027Y4218181D01*
Y4200042D01*
X21980096Y4181903D01*
X21989166Y4172834D01*
X22016376Y4163764D01*
X22098000D02*
X22016376D01*
X21989166Y4154695D01*
X21980096Y4145625D01*
X21971027Y4127486D01*
Y4100278D01*
X21980096Y4082139D01*
X21989166Y4073070D01*
X22016376Y4064000D01*
X22098000D01*
X21883054Y4190973D02*
X21901192Y4181903D01*
X21919331Y4163764D01*
X21928401Y4136556D01*
Y4118417D01*
X21919331Y4091208D01*
X21901192Y4073070D01*
X21883054Y4064000D01*
X21855846D01*
X21837706Y4073070D01*
X21819566Y4091208D01*
X21810497Y4118417D01*
Y4136556D01*
X21819566Y4163764D01*
X21837706Y4181903D01*
X21855846Y4190973D01*
X21883054D01*
X21741570Y4254459D02*
Y4100278D01*
X21732500Y4073070D01*
X21714362Y4064000D01*
X21696222D01*
X21768777Y4190973D02*
X21705292D01*
X21641805Y4254459D02*
Y4100278D01*
X21632735Y4073070D01*
X21614597Y4064000D01*
X21596457D01*
X21669012Y4190973D02*
X21605527D01*
X21523901D02*
X21542039Y4181903D01*
X21560179Y4163764D01*
X21569249Y4136556D01*
Y4118417D01*
X21560179Y4091208D01*
X21542039Y4073070D01*
X21523901Y4064000D01*
X21496693D01*
X21478554Y4073070D01*
X21460416Y4091208D01*
X21451346Y4118417D01*
Y4136556D01*
X21460416Y4163764D01*
X21478554Y4181903D01*
X21496693Y4190973D01*
X21523901D01*
X21409625D02*
Y4064000D01*
Y4154695D02*
X21382417Y4181903D01*
X21364279Y4190973D01*
X21337070D01*
X21318932Y4181903D01*
X21309862Y4154695D01*
Y4064000D01*
Y4154695D02*
X21282652Y4181903D01*
X21264514Y4190973D01*
X21237306D01*
X21219167Y4181903D01*
X21210097Y4154695D01*
Y4064000D01*
X21000592Y4154695D02*
X20918967D01*
X20891759Y4163764D01*
X20882689Y4172834D01*
X20873619Y4190973D01*
Y4218181D01*
X20882689Y4236320D01*
X20891759Y4245390D01*
X20918967Y4254459D01*
X21000592D01*
Y4064000D01*
X20722159Y4190973D02*
Y4064000D01*
Y4163764D02*
X20740298Y4181903D01*
X20758437Y4190973D01*
X20785645D01*
X20803784Y4181903D01*
X20821922Y4163764D01*
X20830994Y4136556D01*
Y4118417D01*
X20821922Y4091208D01*
X20803784Y4073070D01*
X20785645Y4064000D01*
X20758437D01*
X20740298Y4073070D01*
X20722159Y4091208D01*
X20571606Y4163764D02*
X20580675Y4181903D01*
X20607884Y4190973D01*
X20635092D01*
X20662300Y4181903D01*
X20671370Y4163764D01*
X20662300Y4145625D01*
X20644160Y4136556D01*
X20598814Y4127486D01*
X20580675Y4118417D01*
X20571606Y4100278D01*
Y4091208D01*
X20580675Y4073070D01*
X20607884Y4064000D01*
X20635092D01*
X20662300Y4073070D01*
X20671370Y4091208D01*
X20504491Y4254459D02*
Y4100278D01*
X20495422Y4073070D01*
X20477283Y4064000D01*
X20459145D01*
X20531700Y4190973D02*
X20468214D01*
X20431937Y4136556D02*
X20323102D01*
Y4154695D01*
X20332172Y4172834D01*
X20341241Y4181903D01*
X20359380Y4190973D01*
X20386588D01*
X20404727Y4181903D01*
X20422865Y4163764D01*
X20431937Y4136556D01*
Y4118417D01*
X20422865Y4091208D01*
X20404727Y4073070D01*
X20386588Y4064000D01*
X20359380D01*
X20341241Y4073070D01*
X20323102Y4091208D01*
%TF.MD5,49edd1f09a47414353769ff647d1f0b0*%
M02*
