%TF.GenerationSoftware,Altium Limited,Altium Designer,19.1.5 (86)*%
G04 Layer_Color=8421504*
%FSLAX45Y45*%
%MOMM*%
%TF.FileFunction,Paste,Top*%
%TF.Part,Single*%
G01*
G75*
%TA.AperFunction,SMDPad,CuDef*%
%ADD10R,1.55000X2.20000*%
%ADD11R,1.90000X1.45000*%
%ADD12R,4.50000X1.80000*%
%TA.AperFunction,NonConductor*%
%ADD21C,0.17780*%
D10*
X24113200Y9702800D02*
D03*
X24553200D02*
D03*
X24113200Y9347200D02*
D03*
X24553200D02*
D03*
D11*
X25552400Y8928400D02*
D03*
Y8648400D02*
D03*
X26695401Y9030000D02*
D03*
Y8750000D02*
D03*
D12*
X26111200Y9258200D02*
D03*
Y8928200D02*
D03*
D21*
X18097485Y4254459D02*
Y4064000D01*
X18034000Y4254459D02*
X18160973D01*
X18228995Y4190973D02*
X18210855Y4181903D01*
X18192715Y4163764D01*
X18183646Y4136556D01*
Y4118417D01*
X18192715Y4091208D01*
X18210855Y4073070D01*
X18228995Y4064000D01*
X18256203D01*
X18274341Y4073070D01*
X18292480Y4091208D01*
X18301550Y4118417D01*
Y4136556D01*
X18292480Y4163764D01*
X18274341Y4181903D01*
X18256203Y4190973D01*
X18228995D01*
X18343269D02*
Y4000514D01*
Y4163764D02*
X18361407Y4181903D01*
X18379547Y4190973D01*
X18406757D01*
X18424895Y4181903D01*
X18443034Y4163764D01*
X18452103Y4136556D01*
Y4118417D01*
X18443034Y4091208D01*
X18424895Y4073070D01*
X18406757Y4064000D01*
X18379547D01*
X18361407Y4073070D01*
X18343269Y4091208D01*
X18642561Y4154695D02*
X18724188D01*
X18751396Y4163764D01*
X18760464Y4172834D01*
X18769534Y4190973D01*
Y4218181D01*
X18760464Y4236320D01*
X18751396Y4245390D01*
X18724188Y4254459D01*
X18642561D01*
Y4064000D01*
X18920995Y4190973D02*
Y4064000D01*
Y4163764D02*
X18902856Y4181903D01*
X18884717Y4190973D01*
X18857509D01*
X18839371Y4181903D01*
X18821231Y4163764D01*
X18812161Y4136556D01*
Y4118417D01*
X18821231Y4091208D01*
X18839371Y4073070D01*
X18857509Y4064000D01*
X18884717D01*
X18902856Y4073070D01*
X18920995Y4091208D01*
X19071548Y4163764D02*
X19062479Y4181903D01*
X19035271Y4190973D01*
X19008063D01*
X18980853Y4181903D01*
X18971785Y4163764D01*
X18980853Y4145625D01*
X18998993Y4136556D01*
X19044341Y4127486D01*
X19062479Y4118417D01*
X19071548Y4100278D01*
Y4091208D01*
X19062479Y4073070D01*
X19035271Y4064000D01*
X19008063D01*
X18980853Y4073070D01*
X18971785Y4091208D01*
X19138663Y4254459D02*
Y4100278D01*
X19147733Y4073070D01*
X19165871Y4064000D01*
X19184010D01*
X19111455Y4190973D02*
X19174940D01*
X19211218Y4136556D02*
X19320053D01*
Y4154695D01*
X19310983Y4172834D01*
X19301913Y4181903D01*
X19283775Y4190973D01*
X19256566D01*
X19238428Y4181903D01*
X19220288Y4163764D01*
X19211218Y4136556D01*
Y4118417D01*
X19220288Y4091208D01*
X19238428Y4073070D01*
X19256566Y4064000D01*
X19283775D01*
X19301913Y4073070D01*
X19320053Y4091208D01*
%TF.MD5,e156c832778601ded0351f3dc9db9f6b*%
M02*
