Removed Pin From Net: NetName=+24VV Pin=IC10-5
Removed Pin From Net: NetName=NetIC10_4 Pin=IC20-5
Removed Pin From Net: NetName=NetIC20_4 Pin=IC30-5
Added Component: Designator=D10(DO-41)
Add component. Clean all parameters for all variants
Add component (AddParameter): Name = "Author"; Value = "CERN DEM JLC"; VariantName = "[No Variations]"
Add component (AddParameter): Name = "Bonding"; Value = "No"; VariantName = "[No Variations]"
Add component (AddParameter): Name = "Case"; Value = "DO-41"; VariantName = "[No Variations]"
Add component (AddParameter): Name = "ComponentHeight"; Value = "2.72mm"; VariantName = "[No Variations]"
Add component (AddParameter): Name = "ComponentLink1Description"; Value = "Package Drawing"; VariantName = "[No Variations]"
Add component (AddParameter): Name = "ComponentLink1URL"; Value = "\\cern.ch\dfs\Applications\Altium\Datasheets\1N4007_Package.pdf"; VariantName = "[No Variations]"
Add component (AddParameter): Name = "Component Type"; Value = "Standard"; VariantName = "[No Variations]"
Add component (AddParameter): Name = "CreateDate"; Value = "20/08/2008"; VariantName = "[No Variations]"
Add component (AddParameter): Name = "Device"; Value = "1N4007"; VariantName = "[No Variations]"
Add component (AddParameter): Name = "HelpURL"; Value = "\\cern.ch\dfs\Applications\Altium\Datasheets\1N4007.pdf"; VariantName = "[No Variations]"
Add component (AddParameter): Name = "LatestRevisionDate"; Value = "30/10/2013"; VariantName = "[No Variations]"
Add component (AddParameter): Name = "Manufacturer"; Value = "FAIRCHILD SEMICONDUCTOR"; VariantName = "[No Variations]"
Add component (AddParameter): Name = "Manufacturer Part Number"; Value = "1N4007"; VariantName = "[No Variations]"
Add component (AddParameter): Name = "Mounted"; Value = "Yes"; VariantName = "[No Variations]"
Add component (AddParameter): Name = "PackageDescription"; Value = "DO-41, Diode, Axial, Body 4.7 x 2.7mm (LxDia. Max), Pin spacing 10.16mm"; VariantName = "[No Variations]"
Add component (AddParameter): Name = "Part Description"; Value = "Axial Lead Standard Recovery Rectifier"; VariantName = "[No Variations]"
Add component (AddParameter): Name = "Part Number"; Value = "1N4007"; VariantName = "[No Variations]"
Add component (AddParameter): Name = "Pin Count"; Value = "2"; VariantName = "[No Variations]"
Add component (AddParameter): Name = "Power"; Value = "1A"; VariantName = "[No Variations]"
Add component (AddParameter): Name = "PressFit"; Value = "No"; VariantName = "[No Variations]"
Add component (AddParameter): Name = "Sense"; Value = "No"; VariantName = "[No Variations]"
Add component (AddParameter): Name = "SMD"; Value = "No"; VariantName = "[No Variations]"
Add component (AddParameter): Name = "Socket"; Value = "No"; VariantName = "[No Variations]"
Add component (AddParameter): Name = "Voltage"; Value = "1000V"; VariantName = "[No Variations]"
Added Component: Designator=D20(DO-41)
Add component. Clean all parameters for all variants
Add component (AddParameter): Name = "Author"; Value = "CERN DEM JLC"; VariantName = "[No Variations]"
Add component (AddParameter): Name = "Bonding"; Value = "No"; VariantName = "[No Variations]"
Add component (AddParameter): Name = "Case"; Value = "DO-41"; VariantName = "[No Variations]"
Add component (AddParameter): Name = "ComponentHeight"; Value = "2.72mm"; VariantName = "[No Variations]"
Add component (AddParameter): Name = "ComponentLink1Description"; Value = "Package Drawing"; VariantName = "[No Variations]"
Add component (AddParameter): Name = "ComponentLink1URL"; Value = "\\cern.ch\dfs\Applications\Altium\Datasheets\1N4007_Package.pdf"; VariantName = "[No Variations]"
Add component (AddParameter): Name = "Component Type"; Value = "Standard"; VariantName = "[No Variations]"
Add component (AddParameter): Name = "CreateDate"; Value = "20/08/2008"; VariantName = "[No Variations]"
Add component (AddParameter): Name = "Device"; Value = "1N4007"; VariantName = "[No Variations]"
Add component (AddParameter): Name = "HelpURL"; Value = "\\cern.ch\dfs\Applications\Altium\Datasheets\1N4007.pdf"; VariantName = "[No Variations]"
Add component (AddParameter): Name = "LatestRevisionDate"; Value = "30/10/2013"; VariantName = "[No Variations]"
Add component (AddParameter): Name = "Manufacturer"; Value = "FAIRCHILD SEMICONDUCTOR"; VariantName = "[No Variations]"
Add component (AddParameter): Name = "Manufacturer Part Number"; Value = "1N4007"; VariantName = "[No Variations]"
Add component (AddParameter): Name = "Mounted"; Value = "Yes"; VariantName = "[No Variations]"
Add component (AddParameter): Name = "PackageDescription"; Value = "DO-41, Diode, Axial, Body 4.7 x 2.7mm (LxDia. Max), Pin spacing 10.16mm"; VariantName = "[No Variations]"
Add component (AddParameter): Name = "Part Description"; Value = "Axial Lead Standard Recovery Rectifier"; VariantName = "[No Variations]"
Add component (AddParameter): Name = "Part Number"; Value = "1N4007"; VariantName = "[No Variations]"
Add component (AddParameter): Name = "Pin Count"; Value = "2"; VariantName = "[No Variations]"
Add component (AddParameter): Name = "Power"; Value = "1A"; VariantName = "[No Variations]"
Add component (AddParameter): Name = "PressFit"; Value = "No"; VariantName = "[No Variations]"
Add component (AddParameter): Name = "Sense"; Value = "No"; VariantName = "[No Variations]"
Add component (AddParameter): Name = "SMD"; Value = "No"; VariantName = "[No Variations]"
Add component (AddParameter): Name = "Socket"; Value = "No"; VariantName = "[No Variations]"
Add component (AddParameter): Name = "Voltage"; Value = "1000V"; VariantName = "[No Variations]"
Added Component: Designator=D30(DO-41)
Add component. Clean all parameters for all variants
Add component (AddParameter): Name = "Author"; Value = "CERN DEM JLC"; VariantName = "[No Variations]"
Add component (AddParameter): Name = "Bonding"; Value = "No"; VariantName = "[No Variations]"
Add component (AddParameter): Name = "Case"; Value = "DO-41"; VariantName = "[No Variations]"
Add component (AddParameter): Name = "ComponentHeight"; Value = "2.72mm"; VariantName = "[No Variations]"
Add component (AddParameter): Name = "ComponentLink1Description"; Value = "Package Drawing"; VariantName = "[No Variations]"
Add component (AddParameter): Name = "ComponentLink1URL"; Value = "\\cern.ch\dfs\Applications\Altium\Datasheets\1N4007_Package.pdf"; VariantName = "[No Variations]"
Add component (AddParameter): Name = "Component Type"; Value = "Standard"; VariantName = "[No Variations]"
Add component (AddParameter): Name = "CreateDate"; Value = "20/08/2008"; VariantName = "[No Variations]"
Add component (AddParameter): Name = "Device"; Value = "1N4007"; VariantName = "[No Variations]"
Add component (AddParameter): Name = "HelpURL"; Value = "\\cern.ch\dfs\Applications\Altium\Datasheets\1N4007.pdf"; VariantName = "[No Variations]"
Add component (AddParameter): Name = "LatestRevisionDate"; Value = "30/10/2013"; VariantName = "[No Variations]"
Add component (AddParameter): Name = "Manufacturer"; Value = "FAIRCHILD SEMICONDUCTOR"; VariantName = "[No Variations]"
Add component (AddParameter): Name = "Manufacturer Part Number"; Value = "1N4007"; VariantName = "[No Variations]"
Add component (AddParameter): Name = "Mounted"; Value = "Yes"; VariantName = "[No Variations]"
Add component (AddParameter): Name = "PackageDescription"; Value = "DO-41, Diode, Axial, Body 4.7 x 2.7mm (LxDia. Max), Pin spacing 10.16mm"; VariantName = "[No Variations]"
Add component (AddParameter): Name = "Part Description"; Value = "Axial Lead Standard Recovery Rectifier"; VariantName = "[No Variations]"
Add component (AddParameter): Name = "Part Number"; Value = "1N4007"; VariantName = "[No Variations]"
Add component (AddParameter): Name = "Pin Count"; Value = "2"; VariantName = "[No Variations]"
Add component (AddParameter): Name = "Power"; Value = "1A"; VariantName = "[No Variations]"
Add component (AddParameter): Name = "PressFit"; Value = "No"; VariantName = "[No Variations]"
Add component (AddParameter): Name = "Sense"; Value = "No"; VariantName = "[No Variations]"
Add component (AddParameter): Name = "SMD"; Value = "No"; VariantName = "[No Variations]"
Add component (AddParameter): Name = "Socket"; Value = "No"; VariantName = "[No Variations]"
Add component (AddParameter): Name = "Voltage"; Value = "1000V"; VariantName = "[No Variations]"
Added Component: Designator=RL10(REL_TYCO-AXICOM_V23026A1)
Add component. Clean all parameters for all variants
Add component (AddParameter): Name = "Author"; Value = "CERN DEM MR"; VariantName = "[No Variations]"
Add component (AddParameter): Name = "ComponentHeight"; Value = "6.9mm"; VariantName = "[No Variations]"
Add component (AddParameter): Name = "Component Type"; Value = "Standard"; VariantName = "[No Variations]"
Add component (AddParameter): Name = "CreateDate"; Value = "17/06/2016"; VariantName = "[No Variations]"
Add component (AddParameter): Name = "HelpURL"; Value = "\\cern.ch\dfs\Applications\Altium\Datasheets\REL_TYCO-AXICOM_V23026.pdf"; VariantName = "[No Variations]"
Add component (AddParameter): Name = "LatestRevisionDate"; Value = "04/09/2018"; VariantName = "[No Variations]"
Add component (AddParameter): Name = "Manufacturer"; Value = "TYCO AXICOM"; VariantName = "[No Variations]"
Add component (AddParameter): Name = "Manufacturer Part Number"; Value = "V23026A1004B201 or 1-1393774-2"; VariantName = "[No Variations]"
Add component (AddParameter): Name = "Mounted"; Value = "Yes"; VariantName = "[No Variations]"
Add component (AddParameter): Name = "PackageDescription"; Value = "Relay, 6 Leads, Row Spacing 5.08 mm; Body 13mm x 7.6mm, AXICOM V23026 Series"; VariantName = "[No Variations]"
Add component (AddParameter): Name = "Part Description"; Value = "1A SPDT (1 form C) Signal Relay, V23026 Series"; VariantName = "[No Variations]"
Add component (AddParameter): Name = "Part Number"; Value = "REL_TYCO-AXICOM_V23026A1004B201"; VariantName = "[No Variations]"
Add component (AddParameter): Name = "Pin Count"; Value = "6"; VariantName = "[No Variations]"
Add component (AddParameter): Name = "PressFit"; Value = "No"; VariantName = "[No Variations]"
Add component (AddParameter): Name = "Sense"; Value = "Yes"; VariantName = "[No Variations]"
Add component (AddParameter): Name = "Sense Comment"; Value = "Cleaning Limitation"; VariantName = "[No Variations]"
Add component (AddParameter): Name = "SMD"; Value = "No"; VariantName = "[No Variations]"
Add component (AddParameter): Name = "Socket"; Value = "No"; VariantName = "[No Variations]"
Add component (AddParameter): Name = "Status"; Value = "Not Recommended"; VariantName = "[No Variations]"
Add component (AddParameter): Name = "Status Comment"; Value = "Sensitive (See Sensitive Field)"; VariantName = "[No Variations]"
Add component (AddParameter): Name = "Value"; Value = "24VDC"; VariantName = "[No Variations]"
Added Component: Designator=RL20(REL_TYCO-AXICOM_V23026A1)
Add component. Clean all parameters for all variants
Add component (AddParameter): Name = "Author"; Value = "CERN DEM MR"; VariantName = "[No Variations]"
Add component (AddParameter): Name = "ComponentHeight"; Value = "6.9mm"; VariantName = "[No Variations]"
Add component (AddParameter): Name = "Component Type"; Value = "Standard"; VariantName = "[No Variations]"
Add component (AddParameter): Name = "CreateDate"; Value = "17/06/2016"; VariantName = "[No Variations]"
Add component (AddParameter): Name = "HelpURL"; Value = "\\cern.ch\dfs\Applications\Altium\Datasheets\REL_TYCO-AXICOM_V23026.pdf"; VariantName = "[No Variations]"
Add component (AddParameter): Name = "LatestRevisionDate"; Value = "04/09/2018"; VariantName = "[No Variations]"
Add component (AddParameter): Name = "Manufacturer"; Value = "TYCO AXICOM"; VariantName = "[No Variations]"
Add component (AddParameter): Name = "Manufacturer Part Number"; Value = "V23026A1004B201 or 1-1393774-2"; VariantName = "[No Variations]"
Add component (AddParameter): Name = "Mounted"; Value = "Yes"; VariantName = "[No Variations]"
Add component (AddParameter): Name = "PackageDescription"; Value = "Relay, 6 Leads, Row Spacing 5.08 mm; Body 13mm x 7.6mm, AXICOM V23026 Series"; VariantName = "[No Variations]"
Add component (AddParameter): Name = "Part Description"; Value = "1A SPDT (1 form C) Signal Relay, V23026 Series"; VariantName = "[No Variations]"
Add component (AddParameter): Name = "Part Number"; Value = "REL_TYCO-AXICOM_V23026A1004B201"; VariantName = "[No Variations]"
Add component (AddParameter): Name = "Pin Count"; Value = "6"; VariantName = "[No Variations]"
Add component (AddParameter): Name = "PressFit"; Value = "No"; VariantName = "[No Variations]"
Add component (AddParameter): Name = "Sense"; Value = "Yes"; VariantName = "[No Variations]"
Add component (AddParameter): Name = "Sense Comment"; Value = "Cleaning Limitation"; VariantName = "[No Variations]"
Add component (AddParameter): Name = "SMD"; Value = "No"; VariantName = "[No Variations]"
Add component (AddParameter): Name = "Socket"; Value = "No"; VariantName = "[No Variations]"
Add component (AddParameter): Name = "Status"; Value = "Not Recommended"; VariantName = "[No Variations]"
Add component (AddParameter): Name = "Status Comment"; Value = "Sensitive (See Sensitive Field)"; VariantName = "[No Variations]"
Add component (AddParameter): Name = "Value"; Value = "24VDC"; VariantName = "[No Variations]"
Added Component: Designator=RL30(REL_TYCO-AXICOM_V23026A1)
Add component. Clean all parameters for all variants
Add component (AddParameter): Name = "Author"; Value = "CERN DEM MR"; VariantName = "[No Variations]"
Add component (AddParameter): Name = "ComponentHeight"; Value = "6.9mm"; VariantName = "[No Variations]"
Add component (AddParameter): Name = "Component Type"; Value = "Standard"; VariantName = "[No Variations]"
Add component (AddParameter): Name = "CreateDate"; Value = "17/06/2016"; VariantName = "[No Variations]"
Add component (AddParameter): Name = "HelpURL"; Value = "\\cern.ch\dfs\Applications\Altium\Datasheets\REL_TYCO-AXICOM_V23026.pdf"; VariantName = "[No Variations]"
Add component (AddParameter): Name = "LatestRevisionDate"; Value = "04/09/2018"; VariantName = "[No Variations]"
Add component (AddParameter): Name = "Manufacturer"; Value = "TYCO AXICOM"; VariantName = "[No Variations]"
Add component (AddParameter): Name = "Manufacturer Part Number"; Value = "V23026A1004B201 or 1-1393774-2"; VariantName = "[No Variations]"
Add component (AddParameter): Name = "Mounted"; Value = "Yes"; VariantName = "[No Variations]"
Add component (AddParameter): Name = "PackageDescription"; Value = "Relay, 6 Leads, Row Spacing 5.08 mm; Body 13mm x 7.6mm, AXICOM V23026 Series"; VariantName = "[No Variations]"
Add component (AddParameter): Name = "Part Description"; Value = "1A SPDT (1 form C) Signal Relay, V23026 Series"; VariantName = "[No Variations]"
Add component (AddParameter): Name = "Part Number"; Value = "REL_TYCO-AXICOM_V23026A1004B201"; VariantName = "[No Variations]"
Add component (AddParameter): Name = "Pin Count"; Value = "6"; VariantName = "[No Variations]"
Add component (AddParameter): Name = "PressFit"; Value = "No"; VariantName = "[No Variations]"
Add component (AddParameter): Name = "Sense"; Value = "Yes"; VariantName = "[No Variations]"
Add component (AddParameter): Name = "Sense Comment"; Value = "Cleaning Limitation"; VariantName = "[No Variations]"
Add component (AddParameter): Name = "SMD"; Value = "No"; VariantName = "[No Variations]"
Add component (AddParameter): Name = "Socket"; Value = "No"; VariantName = "[No Variations]"
Add component (AddParameter): Name = "Status"; Value = "Not Recommended"; VariantName = "[No Variations]"
Add component (AddParameter): Name = "Status Comment"; Value = "Sensitive (See Sensitive Field)"; VariantName = "[No Variations]"
Add component (AddParameter): Name = "Value"; Value = "24VDC"; VariantName = "[No Variations]"
Added Pin To Net: NetName=IN1+ Pin=D10-1
Added Pin To Net: NetName=IN1- Pin=D10-2
Added Pin To Net: NetName=IN2+ Pin=D20-1
Added Pin To Net: NetName=IN2- Pin=D20-2
Added Pin To Net: NetName=IN2+ Pin=D30-1
Added Pin To Net: NetName=IN2- Pin=D30-2
Added Pin To Net: NetName=IN1+ Pin=RL10-3
Added Pin To Net: NetName=+24VV Pin=RL10-5
Added Pin To Net: NetName=IN1- Pin=RL10-8
Added Pin To Net: NetName=IN2+ Pin=RL20-3
Added Pin To Net: NetName=NetIC10_4 Pin=RL20-5
Added Pin To Net: NetName=IN2- Pin=RL20-8
Added Pin To Net: NetName=IN2+ Pin=RL30-3
Added Pin To Net: NetName=NetIC20_4 Pin=RL30-5
Added Pin To Net: NetName=IN2- Pin=RL30-8
Added Pin To Net: NetName=NetIC10_5 Pin=IC10-5
Added Pin To Net: NetName=NetIC10_5 Pin=RL10-10
Added Net: Name=NetIC10_5
Added Pin To Net: NetName=NetIC20_5 Pin=IC20-5
Added Pin To Net: NetName=NetIC20_5 Pin=RL20-10
Added Net: Name=NetIC20_5
Added Pin To Net: NetName=NetIC30_5 Pin=IC30-5
Added Pin To Net: NetName=NetIC30_5 Pin=RL30-10
Added Net: Name=NetIC30_5
Added Member To Class: ClassName=Velo Cibu Interface V1 Member=Component D10 1N4007
Added Member To Class: ClassName=Velo Cibu Interface V1 Member=Component D20 1N4007
Added Member To Class: ClassName=Velo Cibu Interface V1 Member=Component D30 1N4007
Added Member To Class: ClassName=Velo Cibu Interface V1 Member=Component RL10 REL_TYCO-AXICOM_V23026A1xxxB201
Added Member To Class: ClassName=Velo Cibu Interface V1 Member=Component RL20 REL_TYCO-AXICOM_V23026A1xxxB201
Added Member To Class: ClassName=Velo Cibu Interface V1 Member=Component RL30 REL_TYCO-AXICOM_V23026A1xxxB201
